{"text_format":"3","workbook":"xlsx","n_sheets":3,"sheets":["BASE","INFORME","DO_INFORME"],"not_rendered":{"charts":1,"macros":1,"defined_names":19,"pivot_tables":2},"read":"whole","date_system":"1900"}

{"sheet":"BASE","index":0,"n_rows":3385,"n_cols":7,"rows_kept":3385}
[null,"Excel No Convencional"]
[null,"MOS Expert - CPC Martín Cruz - 998401784"]
[]
[]
[]
[null,null,"MES","RUC ","RAZON SOCIAL","VENTAS","RENTABILIDAD"]
[null,null,"Abr",10224046532,"GUERRA LOPEZ FREDDY ROMEL",{"v":1949.8,"d":"1,949.80"},{"v":233.976,"d":"233.98"}]
[null,null,"Abr",20484258873,"AGRICOLA EL RURAL EIRL",{"v":9808.64,"d":"9,808.64"},{"v":1373.2096000000001,"d":"1,373.21"}]
[null,null,"Abr",20494343321,"REPUESTOS Y LUBRICANTES WILLYS SRL",{"v":9865.34,"d":"9,865.34"},{"v":986.5340000000001,"d":"986.53"}]
[null,null,"Abr",20407823037,"INVERSIONES ROJO SOCIEDAD ANONIMA CERRADA",{"v":1977.93,"d":"1,977.93"},{"v":276.91020000000003,"d":"276.91"}]
[null,null,"Abr",10001118761,"LOPEZ DURAND ISAAC",{"v":1841.97,"d":"1,841.97"},{"v":257.8758,"d":"257.88"}]
[null,null,"Abr",10328869441,"BALTODANO SERNA MIGUEL HUMBERTO",{"v":2789.26,"d":"2,789.26"},{"v":278.92600000000004,"d":"278.93"}]
[null,null,"Abr",20494343321,"REPUESTOS Y LUBRICANTES WILLYS SRL",{"v":3232.96,"d":"3,232.96"},{"v":355.6256,"d":"355.63"}]
[null,null,"Abr",20477821988,"ALG INVERSIONES E.I.R.L",{"v":1083.25,"d":"1,083.25"},129.99]
[null,null,"Abr",20134631661,"EXPORTADORES E IMPORTADORES MEZA S.A.C.",{"v":1974.51,"d":"1,974.51"},{"v":276.43140000000005,"d":"276.43"}]
[null,null,"Abr",20513535873,"HIDRAULIC COUPLING S.A.C.",{"v":1244.44,"d":"1,244.44"},{"v":136.88840000000002,"d":"136.89"}]
[null,null,"Abr",20480057644,"N & W GONZALES ASOCIADOS SAC",{"v":8028.53,"d":"8,028.53"},{"v":963.4236,"d":"963.42"}]
[null,null,"Abr",20454418655,"TRANSPORTES Y SERVICIOS SAN JUDAS TADEO S.R.L.",{"v":1565.8,"d":"1,565.80"},156.58]
[null,null,"Abr",20489693055,"EMPRESA DE TRANSPORTES MARCELITO HERMANOS SOCIEDAD",{"v":5276.33,"d":"5,276.33"},{"v":791.4495,"d":"791.45"}]
[null,null,"Abr",10328869441,"BALTODANO SERNA MIGUEL HUMBERTO",705.06,{"v":91.6578,"d":"91.66"}]
[null,null,"Abr",10257256516,"MENDOZA QUISPE DE GUTIERREZ MAXIMINA",{"v":1138.73,"d":"1,138.73"},{"v":148.0349,"d":"148.03"}]
[null,null,"Abr",10328869441,"BALTODANO SERNA MIGUEL HUMBERTO",{"v":2225.65,"d":"2,225.65"},{"v":244.82150000000001,"d":"244.82"}]
[null,null,"Abr",10005204297,"CATUNTA TICONA YARI PERCY",{"v":2207.63,"d":"2,207.63"},{"v":264.9156,"d":"264.92"}]
[null,null,"Abr",10005204297,"CATUNTA TICONA YARI PERCY",{"v":1596.93,"d":"1,596.93"},{"v":207.60090000000002,"d":"207.60"}]
[null,null,"Abr",20494343321,"REPUESTOS Y LUBRICANTES WILLYS SRL",{"v":11795.07,"d":"11,795.07"},{"v":1533.3591000000001,"d":"1,533.36"}]
[null,null,"Abr",10421930355,"CORONEL ARIZAPANA YSABEL RUTH",{"v":17251.17,"d":"17,251.17"},{"v":2070.1403999999998,"d":"2,070.14"}]
[null,null,"Abr",10061080223,"FOINQUINOS MERA DAVID",{"v":17371.14,"d":"17,371.14"},{"v":2084.5368,"d":"2,084.54"}]
[null,null,"Abr",20100927013,"TREINTA ONCE AG VIAJES Y TURISMO S A",{"v":1148.6,"d":"1,148.60"},114.86]
[null,null,"Abr",20475260199,"ASOCIACION CIVIL-BASC-PERU",801.39,{"v":88.1529,"d":"88.15"}]
[null,null,"Abr",20480609272,"ERICELL S.A.C.",{"v":1437.71,"d":"1,437.71"},{"v":201.27940000000004,"d":"201.28"}]
[null,null,"Abr",20475260199,"ASOCIACION CIVIL-BASC-PERU",{"v":9572.26,"d":"9,572.26"},{"v":1340.1164,"d":"1,340.12"}]
[null,null,"Abr",20480609272,"ERICELL S.A.C.",{"v":1637.78,"d":"1,637.78"},{"v":163.77800000000002,"d":"163.78"}]
[null,null,"Abr",20503513359,"ALMACENES VALER S.R.L.",{"v":1369.62,"d":"1,369.62"},{"v":178.0506,"d":"178.05"}]
[null,null,"Abr",20517960714,"MECDRILL  E.I.R.L.",{"v":2545.69,"d":"2,545.69"},{"v":330.9397,"d":"330.94"}]
[null,null,"Abr",20452673186,"CHIFA KEN CHAY E.I.R.L.",{"v":2271.88,"d":"2,271.88"},{"v":318.06320000000005,"d":"318.06"}]
[null,null,"Abr",20432849083,"INVERSIONES MARIA ISABEL SAC",{"v":8048.51,"d":"8,048.51"},{"v":804.8510000000001,"d":"804.85"}]
[null,null,"Abr",20513535873,"HIDRAULIC COUPLING S.A.C.",{"v":10924.81,"d":"10,924.81"},{"v":1638.7214999999999,"d":"1,638.72"}]
[null,null,"Abr",20513535873,"HIDRAULIC COUPLING S.A.C.",{"v":2651.02,"d":"2,651.02"},{"v":397.65299999999996,"d":"397.65"}]
[null,null,"Abr",20489693055,"EMPRESA DE TRANSPORTES MARCELITO HERMANOS SOCIEDAD",{"v":2129.89,"d":"2,129.89"},{"v":255.58679999999998,"d":"255.59"}]
[null,null,"Abr",20513535873,"HIDRAULIC COUPLING S.A.C.",{"v":7490.71,"d":"7,490.71"},{"v":1123.6064999999999,"d":"1,123.61"}]
[null,null,"Abr",10328869441,"BALTODANO SERNA MIGUEL HUMBERTO",{"v":3988.57,"d":"3,988.57"},{"v":478.6284,"d":"478.63"}]
[null,null,"Abr",20513535873,"HIDRAULIC COUPLING S.A.C.",{"v":8348.82,"d":"8,348.82"},{"v":1085.3466,"d":"1,085.35"}]
[null,null,"Abr",20513535873,"HIDRAULIC COUPLING S.A.C.",{"v":1520.88,"d":"1,520.88"},{"v":212.92320000000004,"d":"212.92"}]
[null,null,"Abr",15481757671,"HONGYING ZHOU",{"v":3568.26,"d":"3,568.26"},{"v":463.8738,"d":"463.87"}]
[null,null,"Abr",15481757671,"HONGYING ZHOU",{"v":1471.79,"d":"1,471.79"},{"v":161.8969,"d":"161.90"}]
[null,null,"Abr",20502834887,"GMA ASESORES CONSULTORES S.A.C.",{"v":1363.63,"d":"1,363.63"},{"v":177.27190000000002,"d":"177.27"}]
[null,null,"Abr",10403560800,"MENDOZA GONZALES GLORIA DEL CARMEN",{"v":1634.98,"d":"1,634.98"},{"v":245.24699999999999,"d":"245.25"}]
[null,null,"Abr",20340199163,"MERCO PERUANA SOCIEDAD ANONIMA",{"v":3554.44,"d":"3,554.44"},{"v":497.62160000000006,"d":"497.62"}]
[null,null,"Abr",20525549934,"TRANSPORTES LUIS ANGEL E.I.R.L",{"v":6085.96,"d":"6,085.96"},{"v":852.0344000000001,"d":"852.03"}]
[null,null,"Abr",20513535873,"HIDRAULIC COUPLING S.A.C.",{"v":1181.35,"d":"1,181.35"},{"v":129.9485,"d":"129.95"}]
[null,null,"Abr",10403694776,"SOTO VILA ROBERTO",{"v":5168.76,"d":"5,168.76"},{"v":516.8760000000001,"d":"516.88"}]
[null,null,"Abr",20486626179,"CGS EMPRESA INDIVIDUAL DE RESPONSBILIDAD LIMITADA",{"v":19797.81,"d":"19,797.81"},{"v":2177.7591,"d":"2,177.76"}]
[null,null,"Abr",10009930278,"ALIAGA ARAUJO GERMAN",{"v":4350.73,"d":"4,350.73"},{"v":652.6094999999999,"d":"652.61"}]
[null,null,"Abr",10257256516,"MENDOZA QUISPE DE GUTIERREZ MAXIMINA",{"v":1389.42,"d":"1,389.42"},{"v":208.413,"d":"208.41"}]
[null,null,"Abr",20517049671,"ODFJELL PERU S.A.C.",{"v":24682.25,"d":"24,682.25"},{"v":2468.2250000000004,"d":"2,468.23"}]
[null,null,"Abr",20454131950,"ALFAR S.A.C.",{"v":3090.64,"d":"3,090.64"},{"v":463.59599999999995,"d":"463.60"}]
[null,null,"Abr",10316790688,"URBANO TOLEDO WILDER JAVIER",{"v":7455.61,"d":"7,455.61"},{"v":745.561,"d":"745.56"}]
[null,null,"Abr",20517298540,"QUETA CONCESIONES S.A.C.",{"v":1643.73,"d":"1,643.73"},{"v":180.8103,"d":"180.81"}]
[null,null,"Abr",20517298540,"QUETA CONCESIONES S.A.C.",{"v":3484.01,"d":"3,484.01"},{"v":418.0812,"d":"418.08"}]
[null,null,"Abr",20517298540,"QUETA CONCESIONES S.A.C.",{"v":2560.16,"d":"2,560.16"},{"v":256.016,"d":"256.02"}]
{"$rows_left_out":3326}
{"sheet":"INFORME","index":1,"n_rows":421,"n_cols":22,"rows_kept":421}
[null,"Tablas dinámicas empresariales"]
[null,"MOS Expert - CPC Martín Cruz - 998401784"]
[]
[]
[{"$nulls":8},"Informe de Rentabilidad por Cliente"]
[{"$nulls":9},"Ene","Feb","Mar","Abr","May","Jun","Jul","Ago","Set","Oct","Nov","Dic","Total general"]
[{"$nulls":8},"4 LIFE RESEARCH PERU S.A.C.",{"$nulls":7},{"v":329.2317,"d":"329"},{"$nulls":4},{"v":329.2317,"d":"329"}]
[{"$nulls":8},"A.J.SEMINARIO E.I.R.L.",null,null,{"v":250.18560000000002,"d":"250"},{"$nulls":9},{"v":250.18560000000002,"d":"250"}]
[{"$nulls":8},"ACEROS JK S.A.C.",null,null,{"v":336.3975,"d":"336"},{"$nulls":6},{"v":94.8752,"d":"95"},null,null,{"v":431.2727,"d":"431"}]
[{"$nulls":8},"ACTIVIDADES EMPRESARIALES S R LTDA",{"$nulls":7},{"v":453.6144,"d":"454"},{"$nulls":4},{"v":453.6144,"d":"454"}]
[null,null,"Concepto","Cliente","Ganancia","%",null,null,"ACUÑA OBREGON YAN GUILLERMO",null,null,{"v":180.37320000000003,"d":"180"},{"v":108.79,"d":"109"},{"v":264.29200000000003,"d":"264"},null,{"v":419.5846,"d":"420"},{"$nulls":5},{"v":973.0398000000001,"d":"973"}]
[null,null,"1er mejor cliente",{"$f":"Cliente_1_Nombre","v":"HIDRAULIC COUPLING S.A.C."},{"$f":"Cliente_1","v":{"v":75681.58200000001,"d":"$ 75,682"}},{"$f":"E12/E$16","v":{"v":0.05188051623010805,"d":"5%"}},null,null,"ADAUTO QUISPE MARUJA YOLANDA",null,{"v":134.44400000000002,"d":"134"},null,null,{"v":66.361,"d":"66"},null,{"v":196.11,"d":"196"},null,{"v":380.3005,"d":"380"},null,{"v":265.953,"d":"266"},{"v":104.6851,"d":"105"},{"v":1147.8536,"d":"1,148"}]
[null,null,"2do mejor cliente",{"$f":"Cliente_2_Nombre","v":"BALTODANO SERNA MIGUEL HUMBERTO"},{"$f":"Cliente_2","v":{"v":58211.109899999996,"d":"$ 58,211"}},{"$f":"E13/E$16","v":{"v":0.039904324832157355,"d":"4%"}},null,null,"AGREGA S.A.C.",null,null,{"v":1380.8314,"d":"1,381"},{"$nulls":9},{"v":1380.8314,"d":"1,381"}]
[null,null,"3er mejor cliente",{"$f":"Cliente_3_Nombre","v":"CORPORACION EL MILAGRO DEL NIÑO JESUS S.A.C."},{"$f":"Cliente_3","v":{"v":56448.323899999996,"d":"$ 56,448"}},{"$f":"E14/E$16","v":{"v":0.03869591658716048,"d":"4%"}},null,null,"AGRICOLA EL RURAL EIRL",{"$nulls":3},{"v":1373.2096000000001,"d":"1,373"},null,null,{"v":505.27680000000004,"d":"505"},{"$nulls":5},{"v":1878.4864000000002,"d":"1,878"}]
[null,null,"10 Mejores Clientes",null,{"$f":"Diez_mejores","v":{"v":400490.5570000001,"d":"$ 400,491"}},{"$f":"E15/E$16","v":{"v":0.2745404666943077,"d":"27%"}},null,null,"AGROINDUSTRIAS  EXPORT ORO VERDE S.A.C.",{"v":135.7083,"d":"136"},null,{"v":177.4399,"d":"177"},null,null,{"v":299.31960000000004,"d":"299"},{"v":144.39100000000002,"d":"144"},{"$nulls":3},{"v":404.6078,"d":"405"},{"v":136.283,"d":"136"},{"v":1297.7495999999999,"d":"1,298"}]
[null,null,"Total General",null,{"$f":"Total_General","v":{"v":1458766.9418000004,"d":"$ 1,458,767"}},{"$nulls":3},"AGROINDUSTRIAS CALLPA SAC",{"v":264.13520000000005,"d":"264"},{"v":6922.545,"d":"6,923"},{"v":3946.1301000000003,"d":"3,946"},{"v":150.38100000000003,"d":"150"},{"v":3068.969,"d":"3,069"},null,null,{"v":8061.346799999999,"d":"8,061"},{"v":4573.4596,"d":"4,573"},{"v":160.8684,"d":"161"},{"v":327.591,"d":"328"},{"v":4392.3345,"d":"4,392"},{"v":31867.760599999998,"d":"31,868"}]
[{"$nulls":8},"AIR JMC EIRL",{"v":2484.1160000000004,"d":"2,484"},{"v":2102.6738000000005,"d":"2,103"},{"v":3950.0639999999994,"d":"3,950"},{"v":2566.1192,"d":"2,566"},{"v":6855.231,"d":"6,855"},{"v":2614.6107,"d":"2,615"},{"v":7143.211399999999,"d":"7,143"},{"v":2370.5064,"d":"2,371"},{"v":2177.7843000000003,"d":"2,178"},{"v":5298.152800000001,"d":"5,298"},{"v":1977.7965,"d":"1,978"},{"v":1665.3539,"d":"1,665"},{"v":41205.62,"d":"41,206"}]
[{"$nulls":8},"ALESANDRA IMPORT S.A.C",null,{"v":146.0147,"d":"146"},{"$nulls":4},{"v":394.229,"d":"394"},null,null,{"v":201.2988,"d":"201"},null,{"v":116.634,"d":"117"},{"v":858.1765,"d":"858"}]
[{"$nulls":8},"ALFAR S.A.C.",{"$nulls":3},{"v":463.59599999999995,"d":"464"},{"$nulls":8},{"v":463.59599999999995,"d":"464"}]
[{"$nulls":8},"ALG INVERSIONES E.I.R.L",{"$nulls":3},{"v":129.99,"d":"130"},null,{"v":264.378,"d":"264"},null,{"v":149.1516,"d":"149"},{"$nulls":3},{"v":195.0182,"d":"195"},{"v":738.5378,"d":"739"}]
[{"$nulls":8},"ALGODONES LARGOS & EXTRALARGOS S.A.C.",{"$nulls":11},{"v":139.7149,"d":"140"},{"v":139.7149,"d":"140"}]
[{"$nulls":8},"ALIAGA ARAUJO GERMAN",null,null,{"v":109.12160000000002,"d":"109"},{"v":1140.3099,"d":"1,140"},null,{"v":527.4412,"d":"527"},{"v":1365.2751,"d":"1,365"},null,null,{"v":759.4295999999999,"d":"759"},null,{"v":1035.9164999999998,"d":"1,036"},{"v":4937.4938999999995,"d":"4,937"}]
[{"$nulls":8},"ALMACENES VALER S.R.L.",{"$nulls":3},{"v":178.0506,"d":"178"},null,{"v":284.557,"d":"285"},{"v":451.8576,"d":"452"},null,null,{"v":207.471,"d":"207"},null,null,{"v":1121.9362,"d":"1,122"}]
[{"$nulls":8},"ALVA FOUSCAS HECTOR DANIEL",{"$nulls":6},{"v":1073.9505,"d":"1,074"},null,{"v":126.73870000000001,"d":"127"},{"$nulls":3},{"v":1200.6892,"d":"1,201"}]
[{"$nulls":8},"ALVA TICONA DE RAMOS JUANA ROSA",{"v":520.5178,"d":"521"},{"$nulls":11},{"v":520.5178,"d":"521"}]
[{"$nulls":8},"ALYJOV FARMA SRL",null,null,{"v":117.1478,"d":"117"},null,{"v":124.68690000000001,"d":"125"},{"v":689.5947000000001,"d":"690"},{"v":349.9462,"d":"350"},{"v":128.77349999999998,"d":"129"},null,{"v":94.78590000000001,"d":"95"},{"v":177.21210000000002,"d":"177"},null,{"v":1682.1471000000001,"d":"1,682"}]
[{"$nulls":8},"ANASTACIO IMAN ROBERTO",{"$nulls":11},{"v":823.0339,"d":"823"},{"v":823.0339,"d":"823"}]
[{"$nulls":8},"ANDINA IMEX S.A.C",{"v":254.68230000000003,"d":"255"},{"v":519.8354,"d":"520"},{"v":500.8875,"d":"501"},{"v":151.62359999999998,"d":"152"},{"v":87.98249999999999,"d":"88"},{"v":104.0975,"d":"104"},null,null,{"v":170.619,"d":"171"},null,{"v":232.51300000000003,"d":"233"},{"v":232.8965,"d":"233"},{"v":2255.1373,"d":"2,255"}]
[{"$nulls":8},"ANDRADE ELCORROBARRUTIA MARIO ISMAEL",{"v":506.39700000000005,"d":"506"},{"v":198.3348,"d":"198"},{"v":2543.0273,"d":"2,543"},{"v":423.5473,"d":"424"},{"v":5546.0913,"d":"5,546"},null,{"v":768.5124000000001,"d":"769"},{"v":307.3686,"d":"307"},{"v":3852.3419999999996,"d":"3,852"},{"v":398.3056,"d":"398"},{"v":613.7461000000001,"d":"614"},{"v":1605.3983999999998,"d":"1,605"},{"v":16763.070799999998,"d":"16,763"}]
[{"$nulls":8},"APOYO CARDIOVASCULAR SRLTDA",{"$nulls":5},{"v":204.96,"d":"205"},{"$nulls":3},{"v":116.10170000000001,"d":"116"},null,null,{"v":321.06170000000003,"d":"321"}]
[{"$nulls":8},"AQP BROKERS S.A.C.",{"$nulls":5},{"v":1088.0758,"d":"1,088"},{"$nulls":4},{"v":1526.0420000000001,"d":"1,526"},null,{"v":2614.1178,"d":"2,614"}]
[{"$nulls":8},"ARENAS RAMOS FREDY",{"$nulls":6},{"v":583.2486,"d":"583"},{"$nulls":4},{"v":669.3456,"d":"669"},{"v":1252.5942,"d":"1,253"}]
[{"$nulls":8},"ASESORIA Y SERVICIOS FERRETEROS S.R.L.",null,null,{"v":174.874,"d":"175"},{"v":157.074,"d":"157"},{"v":199.2536,"d":"199"},{"v":97.9649,"d":"98"},{"v":415.3428,"d":"415"},null,null,{"v":158.0813,"d":"158"},{"v":117.4944,"d":"117"},{"v":166.01999999999998,"d":"166"},{"v":1486.1050000000002,"d":"1,486"}]
[{"$nulls":8},"ASIA PACIFIC TRADE COMPANY S.A.C.",null,{"v":129.9948,"d":"130"},null,{"v":490.29240000000004,"d":"490"},{"$nulls":3},{"v":1092.2772,"d":"1,092"},null,{"v":810.2831,"d":"810"},null,null,{"v":2522.8475,"d":"2,523"}]
[{"$nulls":8},"ASOC CULT EDUC WINDSOR DEL PERU",{"v":416.7384,"d":"417"},{"$nulls":11},{"v":416.7384,"d":"417"}]
[{"$nulls":8},"ASOC.TRAB.SALUD VIRGEN DE LA CARIDAD DEL HOSP.DANI",{"v":219.83000000000004,"d":"220"},{"$nulls":11},{"v":219.83000000000004,"d":"220"}]
[{"$nulls":8},"ASOCIACION CIVIL-BASC-PERU",{"v":198.9676,"d":"199"},null,{"v":317.66670000000005,"d":"318"},{"v":2619.0347,"d":"2,619"},{"v":919.7188000000001,"d":"920"},{"v":1460.4340000000002,"d":"1,460"},{"v":2023.8423,"d":"2,024"},{"v":636.4412,"d":"636"},{"v":2832.2594000000004,"d":"2,832"},{"v":2698.0652,"d":"2,698"},null,{"v":1376.8180000000002,"d":"1,377"},{"v":15083.247900000002,"d":"15,083"}]
[{"$nulls":8},"ASOCIACION MINISTERIO RBC",null,null,{"v":467.92960000000005,"d":"468"},null,{"v":615.8908,"d":"616"},null,null,{"v":324.87149999999997,"d":"325"},{"v":581.6311000000001,"d":"582"},{"v":239.55540000000002,"d":"240"},{"v":938.4312000000001,"d":"938"},{"v":293.8845,"d":"294"},{"v":3462.1941,"d":"3,462"}]
[{"$nulls":8},"ASOCIACION PARA EL DESARROLLO EMPRESARIAL EN ABANC",{"v":152.5986,"d":"153"},{"$nulls":11},{"v":152.5986,"d":"153"}]
[{"$nulls":8},"ASUSA TEXTIL S.A.C. - ASUSA TEXTIL",{"v":284.6844,"d":"285"},{"v":963.3587,"d":"963"},null,{"v":227.1022,"d":"227"},null,{"v":1381.3224,"d":"1,381"},{"v":1394.6197000000002,"d":"1,395"},{"v":187.28709999999998,"d":"187"},{"v":1022.4666,"d":"1,022"},{"v":234.85700000000003,"d":"235"},{"v":506.02010000000007,"d":"506"},{"v":511.40200000000004,"d":"511"},{"v":6713.120199999999,"d":"6,713"}]
[{"$nulls":8},"AVETSA E.I.R.L.",{"$nulls":8},{"v":225.408,"d":"225"},{"$nulls":3},{"v":225.408,"d":"225"}]
[{"$nulls":8},"AYALA CASTILLO JUANA CELERINA",{"$nulls":3},{"v":159.13800000000003,"d":"159"},{"v":205.28830000000002,"d":"205"},null,{"v":409.3205,"d":"409"},null,null,{"v":327.14500000000004,"d":"327"},{"v":268.63200000000006,"d":"269"},{"v":299.91690000000006,"d":"300"},{"v":1669.4407,"d":"1,669"}]
[{"$nulls":8},"BALTODANO SERNA MIGUEL HUMBERTO",{"v":4902.2142,"d":"4,902"},{"v":3982.0712000000003,"d":"3,982"},{"v":3443.1056,"d":"3,443"},{"v":5251.2788,"d":"5,251"},{"v":9990.1807,"d":"9,990"},{"v":1812.319,"d":"1,812"},{"v":1624.063,"d":"1,624"},{"v":2435.5906999999997,"d":"2,436"},{"v":4046.994599999999,"d":"4,047"},{"v":9883.170699999999,"d":"9,883"},{"v":7051.3269,"d":"7,051"},{"v":3788.7945,"d":"3,789"},{"v":58211.109899999996,"d":"58,211"}]
[{"$nulls":8},"BARRON SILVERA CRISTOBAL CLAUDIO",null,null,{"v":148.2459,"d":"148"},{"$nulls":9},{"v":148.2459,"d":"148"}]
[{"$nulls":8},"BAZAN VASQUEZ MASSIEL JULISSA",{"$nulls":6},{"v":1146.3024,"d":"1,146"},{"$nulls":5},{"v":1146.3024,"d":"1,146"}]
[{"$nulls":8},"BERROCAL CARRANZA VICTORIA CONSUELO",{"$nulls":4},{"v":3259.3764,"d":"3,259"},{"$nulls":4},{"v":254.11049999999997,"d":"254"},null,null,{"v":3513.4869,"d":"3,513"}]
[{"$nulls":8},"BEST SELLER SOCIEDAD COMERCIAL DE RESPONSABILIDAD ",{"v":261.201,"d":"261"},{"$nulls":5},{"v":410.4282,"d":"410"},{"$nulls":4},{"v":258.831,"d":"259"},{"v":930.4602000000001,"d":"930"}]
[{"$nulls":8},"BIZARRO DE SUERO MARIA LIDIA",{"v":399.4656,"d":"399"},{"v":163.58300000000003,"d":"164"},{"v":326.3722,"d":"326"},null,{"v":1908.0193000000002,"d":"1,908"},{"v":357.1887,"d":"357"},{"v":715.3798,"d":"715"},{"v":618.5582,"d":"619"},null,null,{"v":306.8428,"d":"307"},{"v":209.52360000000002,"d":"210"},{"v":5004.933200000001,"d":"5,005"}]
[{"$nulls":8},"BORDADOS Y APLICACIONES S A",{"$nulls":4},{"v":707.99,"d":"708"},null,{"v":156.3822,"d":"156"},null,null,{"v":104.804,"d":"105"},{"v":941.1721000000001,"d":"941"},null,{"v":1910.3483,"d":"1,910"}]
[{"$nulls":8},"BORJA PINO CARLOS ANTONIO JAVIER EDILBERTO",null,{"v":315.2655,"d":"315"},{"$nulls":4},{"v":230.51930000000002,"d":"231"},null,{"v":210.4752,"d":"210"},{"v":251.877,"d":"252"},null,{"v":266.055,"d":"266"},{"v":1274.192,"d":"1,274"}]
[{"$nulls":8},"BOULANGGER LORO CATALINA",{"$nulls":3},{"v":297.5346,"d":"298"},{"$nulls":3},{"v":430.9435,"d":"431"},{"$nulls":4},{"v":728.4781,"d":"728"}]
[{"$nulls":8},"BULLON ROMERO ANTONIO PEDRO",{"$nulls":8},{"v":532.9835999999999,"d":"533"},{"$nulls":3},{"v":532.9835999999999,"d":"533"}]
[{"$nulls":8},"CAFE ROMERITO E.I.R.L.",{"$nulls":6},{"v":112.677,"d":"113"},{"$nulls":3},{"v":257.7615,"d":"258"},null,{"v":370.43850000000003,"d":"370"}]
[{"$nulls":8},"CAHUANA QUISPE RODOLFO",{"v":278.118,"d":"278"},{"$nulls":11},{"v":278.118,"d":"278"}]
[{"$nulls":8},"CALDERON FERNANDEZ MARIA DEL ROCIO",{"$nulls":4},{"v":100.9545,"d":"101"},{"v":137.2423,"d":"137"},{"v":214.944,"d":"215"},null,{"v":174.9241,"d":"175"},null,{"v":637.4023,"d":"637"},null,{"v":1265.4672,"d":"1,265"}]
[{"$nulls":8},"CAMARA DE COMERCIO Y PRODUCCION DE SAN MARTIN - TA",{"v":116.9564,"d":"117"},{"v":286.0173,"d":"286"},null,null,{"v":269.0985,"d":"269"},{"v":443.24860000000007,"d":"443"},{"v":375.29380000000003,"d":"375"},{"$nulls":4},{"v":417.23220000000003,"d":"417"},{"v":1907.8468000000003,"d":"1,908"}]
[{"$nulls":8},"CAMASACARI SAIRA FEDERICO",{"$nulls":5},{"v":763.0790000000001,"d":"763"},{"$nulls":3},{"v":223.48260000000002,"d":"223"},null,null,{"v":986.5616000000001,"d":"987"}]
[{"$nulls":8},"CANARIO SOTOMAYOR FLOR AMERICA",{"v":555.1415,"d":"555"},{"v":545.453,"d":"545"},{"v":295.4193,"d":"295"},null,{"v":137.2774,"d":"137"},null,null,{"v":639.1182000000001,"d":"639"},{"v":150.89000000000001,"d":"151"},{"v":528.278,"d":"528"},{"v":533.2692,"d":"533"},{"v":1322.5198,"d":"1,323"},{"v":4707.3664,"d":"4,707"}]
[{"$nulls":8},"CARBOTEC S.A.",null,{"v":102.0082,"d":"102"},null,null,{"v":490.56239999999997,"d":"491"},{"v":324.3402,"d":"324"},null,{"v":187.6756,"d":"188"},{"$nulls":4},{"v":1104.5864,"d":"1,105"}]
[{"$nulls":8},"CARITA ANCCO HERACLIO",null,{"v":402.62600000000003,"d":"403"},null,null,{"v":630.5740000000001,"d":"631"},{"$nulls":7},{"v":1033.2,"d":"1,033"}]
{"$rows_left_out":362}
{"sheet":"DO_INFORME","index":2,"n_rows":14,"n_cols":7,"rows_kept":14,"hidden":true}
[]
[null,null,"Suma de RENTABILIDAD"]
[null,"Ene",112724.69149999997,{"$f":"B3","v":"Ene"},{"$f":"C3","v":{"v":112724.69149999997,"d":"112,725"}},{"$f":"IF(nro_col>3,NA(),MATCH(OFFSET(INFORME!$H$6,0,nro_col-1),B3,0)*C3)","v":{"$error":"#N/A"}},{"$f":"OFFSET($D$3,0,0,12,1)","v":"Ene"}]
[null,"Feb",140604.71430000002,"Feb",{"v":140604.71430000002,"d":"140,605"},{"$f":"IF(nro_col>3,NA(),MATCH(OFFSET(INFORME!$H$6,0,nro_col-1),B4,0)*C4)","v":{"$error":"#N/A"}}]
[null,"Mar",97268.03010000003,"Mar",{"v":97268.03010000003,"d":"97,268"},{"$f":"IF(nro_col>3,NA(),MATCH(OFFSET(INFORME!$H$6,0,nro_col-1),B5,0)*C5)","v":{"$error":"#N/A"}}]
[null,"Abr",125879.2676999999,"Abr",{"v":125879.2676999999,"d":"125,879"},{"$f":"IF(nro_col>3,NA(),MATCH(OFFSET(INFORME!$H$6,0,nro_col-1),B6,0)*C6)","v":{"$error":"#N/A"}}]
[null,"May",130147.03540000001,"May",{"v":130147.03540000001,"d":"130,147"},{"$f":"IF(nro_col>3,NA(),MATCH(OFFSET(INFORME!$H$6,0,nro_col-1),B7,0)*C7)","v":{"$error":"#N/A"}}]
[null,"Jun",131208.33980000007,"Jun",{"v":131208.33980000007,"d":"131,208"},{"$f":"IF(nro_col>3,NA(),MATCH(OFFSET(INFORME!$H$6,0,nro_col-1),B8,0)*C8)","v":{"$error":"#N/A"}}]
[null,"Jul",121733.81729999998,"Jul",{"v":121733.81729999998,"d":"121,734"},{"$f":"IF(nro_col>3,NA(),MATCH(OFFSET(INFORME!$H$6,0,nro_col-1),B9,0)*C9)","v":{"$error":"#N/A"}}]
[null,"Ago",113279.73300000001,"Ago",{"v":113279.73300000001,"d":"113,280"},{"$f":"IF(nro_col>3,NA(),MATCH(OFFSET(INFORME!$H$6,0,nro_col-1),B10,0)*C10)","v":{"$error":"#N/A"}}]
[null,"Set",113098.2502000001,"Set",{"v":113098.2502000001,"d":"113,098"},{"$f":"IF(nro_col>3,NA(),MATCH(OFFSET(INFORME!$H$6,0,nro_col-1),B11,0)*C11)","v":{"$error":"#N/A"}}]
[null,"Oct",128120.95320000005,"Oct",{"v":128120.95320000005,"d":"128,121"},{"$f":"IF(nro_col>3,NA(),MATCH(OFFSET(INFORME!$H$6,0,nro_col-1),B12,0)*C12)","v":{"$error":"#N/A"}}]
[null,"Nov",108380.07870000003,"Nov",{"v":108380.07870000003,"d":"108,380"},{"$f":"IF(nro_col>3,NA(),MATCH(OFFSET(INFORME!$H$6,0,nro_col-1),B13,0)*C13)","v":{"$error":"#N/A"}}]
[null,"Dic",136322.0306000002,"Dic",{"v":136322.0306000002,"d":"136,322"},{"$f":"IF(nro_col>3,NA(),MATCH(OFFSET(INFORME!$H$6,0,nro_col-1),B14,0)*C14)","v":{"$error":"#N/A"}}]