{"text_format":"3","workbook":"xlsx","n_sheets":4,"sheets":["TASAS","F 7.1 Det bs AF","RESUMEN","DO_HT"],"not_rendered":{"macros":1,"external_links":1,"defined_names":4,"pivot_tables":1},"read":"whole","date_system":"1900"}

{"sheet":"TASAS","index":0,"n_rows":13,"n_cols":5,"rows_kept":13}
[null,"Tasas • Registro de activos fijos y depreciación"]
[null,"MOS Expert CPC Martín Cruz • +51 998 401 784 | Excel No Convencional"]
[]
[]
[null,null,"CUENTA","NOMBRE","TASA"]
[null,null,"335111","MUEBLES",{"v":0.1,"d":"10%"}]
[null,null,"335211","ENSERES",{"v":0.1,"d":"10%"}]
[null,null,"336111","EQUIPO COMPUTO",{"v":0.25,"d":"25%"}]
[null,null,"336211","EQUIPO DE COMUNICACION",{"v":0.1,"d":"10%"}]
[null,null,"336311","EQUIPOS DE SEGURIDAD",{"v":0.1,"d":"10%"}]
[null,null,"336911","OTROS EQUIPOS",{"v":0.1,"d":"10%"}]
[null,null,"341211","LICENCIAS DE PROGRAMAS",{"v":0.25,"d":"25%"}]
[null,null,"349111","OTROS ACTIVOS INTANGIBLES",{"v":0.1,"d":"10%"}]

{"sheet":"F 7.1 Det bs AF","index":1,"n_rows":204,"n_cols":40,"rows_kept":204}
[null,"Hoja de trabajo • Registro de activos fijos y depreciación"]
[null,"MOS Expert CPC Martín Cruz • +51 998 401 784 | Excel No Convencional"]
[]
[]
[]
[null,null,"FORMATO 7.1: \"REGISTRO DE ACTIVOS FIJOS - DETALLE DE LOS ACTIVOS FIJOS\""]
[]
[null,null,"PERÍODO:",{"$f":"SELECCION","v":"2020-05-31"}]
[null,null,"RUC:"]
[null,null,"APELLIDOS Y NOMBRES, DENOMINACIÓN O RAZÓN SOCIAL:"]
[]
[null,null,"       CÓDIGO","     CUENTA","                                 DETALLE DEL ACTIVO FIJO",{"$nulls":8},"        VALOR",null,"        VALOR",null," FECHA DE INICIO ","              DEPRECIACIÓN",null,null,"     DEPRECIACIÓN",{"$nulls":13},"        DEPRECIACIÓN","DEPRECIACIÓN","  DEPRECIACIÓN  ","    AJUSTE POR","   DEPRECIACIÓN"]
[null,null,"   RELACIONADO ","  CONTABLE ",null,"     MARCA","    MODELO"," NÚMERO DE SERIE","       SALDO","     ADQUISICIONES","  MEJORAS","    RETIROS","        OTROS","     HISTÓRICO ","AJUSTE POR","     AJUSTADO","   FECHA DE","         DEL USO","   MÉTODO","   N° DE DOCUMENTO","   PORCENTAJE","     ACUMULADA AL",{"$nulls":12},"   DEPRECIACIÓN ","        DEL EJERCICIO "," RELACIONADA ","    ACUMULADA","      INFLACIÓN","     ACUMULADA"]
[null,null,"         CON EL","         DEL","    DESCRIPCIÓN","         DEL","         DEL","     Y/O PLACA DEL","        INICIAL","        ADICIONES",null,"        Y/O","      AJUSTES"," DEL ACTIVO FIJO","  INFLACIÓN"," DEL ACTIVO FIJO"," ADQUISICIÓN"," DEL ACTIVO FIJO","  APLICADO","            DE","            DE","     AL CIERRE DEL",{"$nulls":12},"   DEL EJERCICIO"," RELACIONADA CON  LOS","   CON OTROS","     HISTÓRICA","          DE LA","  AJUSTADA POR"]
[null,null,"    ACTIVO FIJO"," ACTIVO FIJO",null," ACTIVO FIJO"," ACTIVO FIJO","       ACTIVO FIJO",{"$nulls":3},"     BAJAS",null,"        AL 31.12",null,"        AL 31.12",{"$nulls":3},"    AUTORIZACIÓN","  DEPRECIACIÓN","EJERCICIO ANTERIOR",{"$nulls":13},"    RETIROS Y/O BAJAS","     AJUSTES",null,"  DEPRECIACIÓN","      INFLACIÓN"]
{"$rows_left_out":190}
{"sheet":"RESUMEN","index":2,"n_rows":23,"n_cols":23,"rows_kept":23,"merged":[[9,2,9,22],[11,2,12,2],[11,3,12,3],[11,4,11,6],[11,7,11,21],[22,2,22,3]]}
[null,"Hoja de resumen • Registro de activos fijos y depreciación"]
[null,"MOS Expert CPC Martín Cruz • +51 998 401 784 | Excel No Convencional"]
{"$rows_empty":7}
[null,null,{"$f":"TITULO","v":"CUADRO DE ACTIVOS Y DEPRECIACION AL 31/05/2020"}]
[]
[null,null,"CUENTA","NOMBRE DE CUENTA","ACTIVO",null,null,"DEPRECIACION MENSUAL",{"$nulls":14},"ACTIVO"]
[{"$nulls":4},"SALDO INICIAL","COMPRAS","SALDO FINAL","SALDO INICIAL","ENE","FEB","MAR","ABR","MAY","JUN","JUL","AGO","SEP","OCT","NOV","DIC","DEL PERIODO","SALDO FINAL","NETO"]
[null,null,"335111",{"$f":"VLOOKUP(C14,TASAS!$C$6:$D$13,2,0)","v":"MUEBLES"},{"$f":"SUMIF('F 7.1 Det bs AF'!$D$17:$D$204,$C14,'F 7.1 Det bs AF'!I$17:I$204)","v":{"v":59143.99999999998,"d":"59,144.00"}},{"$f":"SUMIF('F 7.1 Det bs AF'!$D$17:$D$204,$C14,'F 7.1 Det bs AF'!J$17:J$204)","v":{"v":2498.37,"d":"2,498.37"}},{"$f":"SUM(E14:F14)","v":{"v":61642.36999999998,"d":"61,642.37"}},{"$f":"SUMIF('F 7.1 Det bs AF'!$D$17:$D$204,$C14,'F 7.1 Det bs AF'!V$17:V$204)","v":{"v":43866.120000000024,"d":"43,866.12"}},{"$f":"SUMIF('F 7.1 Det bs AF'!$D$17:$D$204,$C14,'F 7.1 Det bs AF'!W$17:W$204)","v":{"v":220.77441666666675,"d":"220.77"}},{"$f":"SUMIF('F 7.1 Det bs AF'!$D$17:$D$204,$C14,'F 7.1 Det bs AF'!X$17:X$204)","v":{"v":219.1807500000001,"d":"219.18"}},{"$f":"SUMIF('F 7.1 Det bs AF'!$D$17:$D$204,$C14,'F 7.1 Det bs AF'!Y$17:Y$204)","v":{"v":219.16758333333343,"d":"219.17"}},{"$f":"SUMIF('F 7.1 Det bs AF'!$D$17:$D$204,$C14,'F 7.1 Det bs AF'!Z$17:Z$204)","v":{"v":219.16758333333343,"d":"219.17"}},{"$f":"SUMIF('F 7.1 Det bs AF'!$D$17:$D$204,$C14,'F 7.1 Det bs AF'!AA$17:AA$204)","v":{"v":219.16758333333343,"d":"219.17"}},{"$f":"SUMIF('F 7.1 Det bs AF'!$D$17:$D$204,$C14,'F 7.1 Det bs AF'!AB$17:AB$204)","v":{"v":0,"d":"0.00"}},{"$f":"SUMIF('F 7.1 Det bs AF'!$D$17:$D$204,$C14,'F 7.1 Det bs AF'!AC$17:AC$204)","v":{"v":0,"d":"0.00"}},{"$f":"SUMIF('F 7.1 Det bs AF'!$D$17:$D$204,$C14,'F 7.1 Det bs AF'!AD$17:AD$204)","v":{"v":0,"d":"0.00"}},{"$f":"SUMIF('F 7.1 Det bs AF'!$D$17:$D$204,$C14,'F 7.1 Det bs AF'!AE$17:AE$204)","v":{"v":0,"d":"0.00"}},{"$f":"SUMIF('F 7.1 Det bs AF'!$D$17:$D$204,$C14,'F 7.1 Det bs AF'!AF$17:AF$204)","v":{"v":0,"d":"0.00"}},{"$f":"SUMIF('F 7.1 Det bs AF'!$D$17:$D$204,$C14,'F 7.1 Det bs AF'!AG$17:AG$204)","v":{"v":0,"d":"0.00"}},{"$f":"SUMIF('F 7.1 Det bs AF'!$D$17:$D$204,$C14,'F 7.1 Det bs AF'!AH$17:AH$204)","v":{"v":0,"d":"0.00"}},{"$f":"SUM(I14:T14)","v":{"v":1097.457916666667,"d":"1,097.46"}},{"$f":"SUM(H14,U14)","v":{"v":44963.57791666669,"d":"44,963.58"}},{"$f":"G14-V14","v":{"v":16678.79208333329,"d":"16,678.79"}}]
[null,null,"335211",{"$f":"VLOOKUP(C15,TASAS!$C$6:$D$13,2,0)","v":"ENSERES"},{"$f":"SUMIF('F 7.1 Det bs AF'!$D$17:$D$204,$C15,'F 7.1 Det bs AF'!I$17:I$204)","v":{"v":6605.8099999999995,"d":"6,605.81"}},{"$f":"SUMIF('F 7.1 Det bs AF'!$D$17:$D$204,$C15,'F 7.1 Det bs AF'!J$17:J$204)","v":{"v":0,"d":"0.00"}},{"$f":"SUM(E15:F15)","v":{"v":6605.8099999999995,"d":"6,605.81"}},{"$f":"SUMIF('F 7.1 Det bs AF'!$D$17:$D$204,$C15,'F 7.1 Det bs AF'!V$17:V$204)","v":{"v":6605.8099999999995,"d":"6,605.81"}},{"$f":"SUMIF('F 7.1 Det bs AF'!$D$17:$D$204,$C15,'F 7.1 Det bs AF'!W$17:W$204)","v":{"v":0,"d":"0.00"}},{"$f":"SUMIF('F 7.1 Det bs AF'!$D$17:$D$204,$C15,'F 7.1 Det bs AF'!X$17:X$204)","v":{"v":0,"d":"0.00"}},{"$f":"SUMIF('F 7.1 Det bs AF'!$D$17:$D$204,$C15,'F 7.1 Det bs AF'!Y$17:Y$204)","v":{"v":0,"d":"0.00"}},{"$f":"SUMIF('F 7.1 Det bs AF'!$D$17:$D$204,$C15,'F 7.1 Det bs AF'!Z$17:Z$204)","v":{"v":0,"d":"0.00"}},{"$f":"SUMIF('F 7.1 Det bs AF'!$D$17:$D$204,$C15,'F 7.1 Det bs AF'!AA$17:AA$204)","v":{"v":0,"d":"0.00"}},{"$f":"SUMIF('F 7.1 Det bs AF'!$D$17:$D$204,$C15,'F 7.1 Det bs AF'!AB$17:AB$204)","v":{"v":0,"d":"0.00"}},{"$f":"SUMIF('F 7.1 Det bs AF'!$D$17:$D$204,$C15,'F 7.1 Det bs AF'!AC$17:AC$204)","v":{"v":0,"d":"0.00"}},{"$f":"SUMIF('F 7.1 Det bs AF'!$D$17:$D$204,$C15,'F 7.1 Det bs AF'!AD$17:AD$204)","v":{"v":0,"d":"0.00"}},{"$f":"SUMIF('F 7.1 Det bs AF'!$D$17:$D$204,$C15,'F 7.1 Det bs AF'!AE$17:AE$204)","v":{"v":0,"d":"0.00"}},{"$f":"SUMIF('F 7.1 Det bs AF'!$D$17:$D$204,$C15,'F 7.1 Det bs AF'!AF$17:AF$204)","v":{"v":0,"d":"0.00"}},{"$f":"SUMIF('F 7.1 Det bs AF'!$D$17:$D$204,$C15,'F 7.1 Det bs AF'!AG$17:AG$204)","v":{"v":0,"d":"0.00"}},{"$f":"SUMIF('F 7.1 Det bs AF'!$D$17:$D$204,$C15,'F 7.1 Det bs AF'!AH$17:AH$204)","v":{"v":0,"d":"0.00"}},{"$f":"SUM(I15:T15)","v":{"v":0,"d":"0.00"}},{"v":6605.8099999999995,"d":"6,605.81"},{"$f":"G15-V15","v":{"v":0,"d":"0.00"}}]
[null,null,"336111",{"$f":"VLOOKUP(C16,TASAS!$C$6:$D$13,2,0)","v":"EQUIPO COMPUTO"},{"$f":"SUMIF('F 7.1 Det bs AF'!$D$17:$D$204,$C16,'F 7.1 Det bs AF'!I$17:I$204)","v":{"v":97830.93999999997,"d":"97,830.94"}},{"$f":"SUMIF('F 7.1 Det bs AF'!$D$17:$D$204,$C16,'F 7.1 Det bs AF'!J$17:J$204)","v":{"v":14238.98,"d":"14,238.98"}},{"v":112069.91999999997,"d":"112,069.92"},{"$f":"SUMIF('F 7.1 Det bs AF'!$D$17:$D$204,$C16,'F 7.1 Det bs AF'!V$17:V$204)","v":{"v":81405.19000000002,"d":"81,405.19"}},{"$f":"SUMIF('F 7.1 Det bs AF'!$D$17:$D$204,$C16,'F 7.1 Det bs AF'!W$17:W$204)","v":{"v":874.0760416666665,"d":"874.08"}},{"$f":"SUMIF('F 7.1 Det bs AF'!$D$17:$D$204,$C16,'F 7.1 Det bs AF'!X$17:X$204)","v":{"v":874.0760416666665,"d":"874.08"}},{"$f":"SUMIF('F 7.1 Det bs AF'!$D$17:$D$204,$C16,'F 7.1 Det bs AF'!Y$17:Y$204)","v":{"v":849.3554166666665,"d":"849.36"}},{"$f":"SUMIF('F 7.1 Det bs AF'!$D$17:$D$204,$C16,'F 7.1 Det bs AF'!Z$17:Z$204)","v":{"v":849.3525,"d":"849.35"}},{"$f":"SUMIF('F 7.1 Det bs AF'!$D$17:$D$204,$C16,'F 7.1 Det bs AF'!AA$17:AA$204)","v":{"v":849.3525,"d":"849.35"}},{"$f":"SUMIF('F 7.1 Det bs AF'!$D$17:$D$204,$C16,'F 7.1 Det bs AF'!AB$17:AB$204)","v":{"v":0,"d":"0.00"}},{"$f":"SUMIF('F 7.1 Det bs AF'!$D$17:$D$204,$C16,'F 7.1 Det bs AF'!AC$17:AC$204)","v":{"v":0,"d":"0.00"}},{"$f":"SUMIF('F 7.1 Det bs AF'!$D$17:$D$204,$C16,'F 7.1 Det bs AF'!AD$17:AD$204)","v":{"v":0,"d":"0.00"}},{"$f":"SUMIF('F 7.1 Det bs AF'!$D$17:$D$204,$C16,'F 7.1 Det bs AF'!AE$17:AE$204)","v":{"v":0,"d":"0.00"}},{"$f":"SUMIF('F 7.1 Det bs AF'!$D$17:$D$204,$C16,'F 7.1 Det bs AF'!AF$17:AF$204)","v":{"v":0,"d":"0.00"}},{"$f":"SUMIF('F 7.1 Det bs AF'!$D$17:$D$204,$C16,'F 7.1 Det bs AF'!AG$17:AG$204)","v":{"v":0,"d":"0.00"}},{"$f":"SUMIF('F 7.1 Det bs AF'!$D$17:$D$204,$C16,'F 7.1 Det bs AF'!AH$17:AH$204)","v":{"v":0,"d":"0.00"}},{"v":4296.2125,"d":"4,296.21"},{"v":85701.40250000001,"d":"85,701.40"},{"v":26368.517499999958,"d":"26,368.52"}]
[null,null,"336211",{"$f":"VLOOKUP(C17,TASAS!$C$6:$D$13,2,0)","v":"EQUIPO DE COMUNICACION"},{"$f":"SUMIF('F 7.1 Det bs AF'!$D$17:$D$204,$C17,'F 7.1 Det bs AF'!I$17:I$204)","v":{"v":12377.839999999997,"d":"12,377.84"}},{"$f":"SUMIF('F 7.1 Det bs AF'!$D$17:$D$204,$C17,'F 7.1 Det bs AF'!J$17:J$204)","v":{"v":0,"d":"0.00"}},{"v":12377.839999999997,"d":"12,377.84"},{"$f":"SUMIF('F 7.1 Det bs AF'!$D$17:$D$204,$C17,'F 7.1 Det bs AF'!V$17:V$204)","v":{"v":5527.460000000001,"d":"5,527.46"}},{"$f":"SUMIF('F 7.1 Det bs AF'!$D$17:$D$204,$C17,'F 7.1 Det bs AF'!W$17:W$204)","v":{"v":74.75183333333334,"d":"74.75"}},{"$f":"SUMIF('F 7.1 Det bs AF'!$D$17:$D$204,$C17,'F 7.1 Det bs AF'!X$17:X$204)","v":{"v":74.75183333333334,"d":"74.75"}},{"$f":"SUMIF('F 7.1 Det bs AF'!$D$17:$D$204,$C17,'F 7.1 Det bs AF'!Y$17:Y$204)","v":{"v":74.75183333333334,"d":"74.75"}},{"$f":"SUMIF('F 7.1 Det bs AF'!$D$17:$D$204,$C17,'F 7.1 Det bs AF'!Z$17:Z$204)","v":{"v":74.75183333333334,"d":"74.75"}},{"$f":"SUMIF('F 7.1 Det bs AF'!$D$17:$D$204,$C17,'F 7.1 Det bs AF'!AA$17:AA$204)","v":{"v":74.75183333333334,"d":"74.75"}},{"$f":"SUMIF('F 7.1 Det bs AF'!$D$17:$D$204,$C17,'F 7.1 Det bs AF'!AB$17:AB$204)","v":{"v":0,"d":"0.00"}},{"$f":"SUMIF('F 7.1 Det bs AF'!$D$17:$D$204,$C17,'F 7.1 Det bs AF'!AC$17:AC$204)","v":{"v":0,"d":"0.00"}},{"$f":"SUMIF('F 7.1 Det bs AF'!$D$17:$D$204,$C17,'F 7.1 Det bs AF'!AD$17:AD$204)","v":{"v":0,"d":"0.00"}},{"$f":"SUMIF('F 7.1 Det bs AF'!$D$17:$D$204,$C17,'F 7.1 Det bs AF'!AE$17:AE$204)","v":{"v":0,"d":"0.00"}},{"$f":"SUMIF('F 7.1 Det bs AF'!$D$17:$D$204,$C17,'F 7.1 Det bs AF'!AF$17:AF$204)","v":{"v":0,"d":"0.00"}},{"$f":"SUMIF('F 7.1 Det bs AF'!$D$17:$D$204,$C17,'F 7.1 Det bs AF'!AG$17:AG$204)","v":{"v":0,"d":"0.00"}},{"$f":"SUMIF('F 7.1 Det bs AF'!$D$17:$D$204,$C17,'F 7.1 Det bs AF'!AH$17:AH$204)","v":{"v":0,"d":"0.00"}},{"v":373.7591666666667,"d":"373.76"},{"v":5901.219166666668,"d":"5,901.22"},{"v":6476.620833333329,"d":"6,476.62"}]
[null,null,"336311",{"$f":"VLOOKUP(C18,TASAS!$C$6:$D$13,2,0)","v":"EQUIPOS DE SEGURIDAD"},{"$f":"SUMIF('F 7.1 Det bs AF'!$D$17:$D$204,$C18,'F 7.1 Det bs AF'!I$17:I$204)","v":{"v":6506.85,"d":"6,506.85"}},{"$f":"SUMIF('F 7.1 Det bs AF'!$D$17:$D$204,$C18,'F 7.1 Det bs AF'!J$17:J$204)","v":152.54},{"v":6659.39,"d":"6,659.39"},{"$f":"SUMIF('F 7.1 Det bs AF'!$D$17:$D$204,$C18,'F 7.1 Det bs AF'!V$17:V$204)","v":{"v":6506.85,"d":"6,506.85"}},{"$f":"SUMIF('F 7.1 Det bs AF'!$D$17:$D$204,$C18,'F 7.1 Det bs AF'!W$17:W$204)","v":{"v":1.2711666666666666,"d":"1.27"}},{"$f":"SUMIF('F 7.1 Det bs AF'!$D$17:$D$204,$C18,'F 7.1 Det bs AF'!X$17:X$204)","v":{"v":1.2711666666666666,"d":"1.27"}},{"$f":"SUMIF('F 7.1 Det bs AF'!$D$17:$D$204,$C18,'F 7.1 Det bs AF'!Y$17:Y$204)","v":{"v":1.2711666666666666,"d":"1.27"}},{"$f":"SUMIF('F 7.1 Det bs AF'!$D$17:$D$204,$C18,'F 7.1 Det bs AF'!Z$17:Z$204)","v":{"v":1.2711666666666666,"d":"1.27"}},{"$f":"SUMIF('F 7.1 Det bs AF'!$D$17:$D$204,$C18,'F 7.1 Det bs AF'!AA$17:AA$204)","v":{"v":1.2711666666666666,"d":"1.27"}},{"$f":"SUMIF('F 7.1 Det bs AF'!$D$17:$D$204,$C18,'F 7.1 Det bs AF'!AB$17:AB$204)","v":{"v":0,"d":"0.00"}},{"$f":"SUMIF('F 7.1 Det bs AF'!$D$17:$D$204,$C18,'F 7.1 Det bs AF'!AC$17:AC$204)","v":{"v":0,"d":"0.00"}},{"$f":"SUMIF('F 7.1 Det bs AF'!$D$17:$D$204,$C18,'F 7.1 Det bs AF'!AD$17:AD$204)","v":{"v":0,"d":"0.00"}},{"$f":"SUMIF('F 7.1 Det bs AF'!$D$17:$D$204,$C18,'F 7.1 Det bs AF'!AE$17:AE$204)","v":{"v":0,"d":"0.00"}},{"$f":"SUMIF('F 7.1 Det bs AF'!$D$17:$D$204,$C18,'F 7.1 Det bs AF'!AF$17:AF$204)","v":{"v":0,"d":"0.00"}},{"$f":"SUMIF('F 7.1 Det bs AF'!$D$17:$D$204,$C18,'F 7.1 Det bs AF'!AG$17:AG$204)","v":{"v":0,"d":"0.00"}},{"$f":"SUMIF('F 7.1 Det bs AF'!$D$17:$D$204,$C18,'F 7.1 Det bs AF'!AH$17:AH$204)","v":{"v":0,"d":"0.00"}},{"v":6.355833333333333,"d":"6.36"},{"v":6513.205833333333,"d":"6,513.21"},{"v":146.1841666666669,"d":"146.18"}]
[null,null,"336911",{"$f":"VLOOKUP(C19,TASAS!$C$6:$D$13,2,0)","v":"OTROS EQUIPOS"},{"$f":"SUMIF('F 7.1 Det bs AF'!$D$17:$D$204,$C19,'F 7.1 Det bs AF'!I$17:I$204)","v":{"v":87394.35,"d":"87,394.35"}},{"$f":"SUMIF('F 7.1 Det bs AF'!$D$17:$D$204,$C19,'F 7.1 Det bs AF'!J$17:J$204)","v":{"v":0,"d":"0.00"}},{"v":87394.35,"d":"87,394.35"},{"$f":"SUMIF('F 7.1 Det bs AF'!$D$17:$D$204,$C19,'F 7.1 Det bs AF'!V$17:V$204)","v":{"v":87241,"d":"87,241.00"}},{"$f":"SUMIF('F 7.1 Det bs AF'!$D$17:$D$204,$C19,'F 7.1 Det bs AF'!W$17:W$204)","v":{"v":13.120666666666667,"d":"13.12"}},{"$f":"SUMIF('F 7.1 Det bs AF'!$D$17:$D$204,$C19,'F 7.1 Det bs AF'!X$17:X$204)","v":{"v":13.120666666666667,"d":"13.12"}},{"$f":"SUMIF('F 7.1 Det bs AF'!$D$17:$D$204,$C19,'F 7.1 Det bs AF'!Y$17:Y$204)","v":{"v":13.120666666666667,"d":"13.12"}},{"$f":"SUMIF('F 7.1 Det bs AF'!$D$17:$D$204,$C19,'F 7.1 Det bs AF'!Z$17:Z$204)","v":{"v":13.120666666666667,"d":"13.12"}},{"$f":"SUMIF('F 7.1 Det bs AF'!$D$17:$D$204,$C19,'F 7.1 Det bs AF'!AA$17:AA$204)","v":{"v":13.120666666666667,"d":"13.12"}},{"$f":"SUMIF('F 7.1 Det bs AF'!$D$17:$D$204,$C19,'F 7.1 Det bs AF'!AB$17:AB$204)","v":{"v":0,"d":"0.00"}},{"$f":"SUMIF('F 7.1 Det bs AF'!$D$17:$D$204,$C19,'F 7.1 Det bs AF'!AC$17:AC$204)","v":{"v":0,"d":"0.00"}},{"$f":"SUMIF('F 7.1 Det bs AF'!$D$17:$D$204,$C19,'F 7.1 Det bs AF'!AD$17:AD$204)","v":{"v":0,"d":"0.00"}},{"$f":"SUMIF('F 7.1 Det bs AF'!$D$17:$D$204,$C19,'F 7.1 Det bs AF'!AE$17:AE$204)","v":{"v":0,"d":"0.00"}},{"$f":"SUMIF('F 7.1 Det bs AF'!$D$17:$D$204,$C19,'F 7.1 Det bs AF'!AF$17:AF$204)","v":{"v":0,"d":"0.00"}},{"$f":"SUMIF('F 7.1 Det bs AF'!$D$17:$D$204,$C19,'F 7.1 Det bs AF'!AG$17:AG$204)","v":{"v":0,"d":"0.00"}},{"$f":"SUMIF('F 7.1 Det bs AF'!$D$17:$D$204,$C19,'F 7.1 Det bs AF'!AH$17:AH$204)","v":{"v":0,"d":"0.00"}},{"v":65.60333333333334,"d":"65.60"},{"v":87306.60333333333,"d":"87,306.60"},{"v":87.74666666667326,"d":"87.75"}]
[null,null,"341211",{"$f":"VLOOKUP(C20,TASAS!$C$6:$D$13,2,0)","v":"LICENCIAS DE PROGRAMAS"},{"$f":"SUMIF('F 7.1 Det bs AF'!$D$17:$D$204,$C20,'F 7.1 Det bs AF'!I$17:I$204)","v":{"v":81561.84999999999,"d":"81,561.85"}},{"$f":"SUMIF('F 7.1 Det bs AF'!$D$17:$D$204,$C20,'F 7.1 Det bs AF'!J$17:J$204)","v":{"v":0,"d":"0.00"}},{"v":81561.84999999999,"d":"81,561.85"},{"$f":"SUMIF('F 7.1 Det bs AF'!$D$17:$D$204,$C20,'F 7.1 Det bs AF'!V$17:V$204)","v":{"v":80659.64,"d":"80,659.64"}},{"$f":"SUMIF('F 7.1 Det bs AF'!$D$17:$D$204,$C20,'F 7.1 Det bs AF'!W$17:W$204)","v":{"v":69.39999999999999,"d":"69.40"}},{"$f":"SUMIF('F 7.1 Det bs AF'!$D$17:$D$204,$C20,'F 7.1 Det bs AF'!X$17:X$204)","v":{"v":69.39999999999999,"d":"69.40"}},{"$f":"SUMIF('F 7.1 Det bs AF'!$D$17:$D$204,$C20,'F 7.1 Det bs AF'!Y$17:Y$204)","v":{"v":69.39999999999999,"d":"69.40"}},{"$f":"SUMIF('F 7.1 Det bs AF'!$D$17:$D$204,$C20,'F 7.1 Det bs AF'!Z$17:Z$204)","v":{"v":69.39999999999999,"d":"69.40"}},{"$f":"SUMIF('F 7.1 Det bs AF'!$D$17:$D$204,$C20,'F 7.1 Det bs AF'!AA$17:AA$204)","v":{"v":69.39999999999999,"d":"69.40"}},{"$f":"SUMIF('F 7.1 Det bs AF'!$D$17:$D$204,$C20,'F 7.1 Det bs AF'!AB$17:AB$204)","v":{"v":0,"d":"0.00"}},{"$f":"SUMIF('F 7.1 Det bs AF'!$D$17:$D$204,$C20,'F 7.1 Det bs AF'!AC$17:AC$204)","v":{"v":0,"d":"0.00"}},{"$f":"SUMIF('F 7.1 Det bs AF'!$D$17:$D$204,$C20,'F 7.1 Det bs AF'!AD$17:AD$204)","v":{"v":0,"d":"0.00"}},{"$f":"SUMIF('F 7.1 Det bs AF'!$D$17:$D$204,$C20,'F 7.1 Det bs AF'!AE$17:AE$204)","v":{"v":0,"d":"0.00"}},{"$f":"SUMIF('F 7.1 Det bs AF'!$D$17:$D$204,$C20,'F 7.1 Det bs AF'!AF$17:AF$204)","v":{"v":0,"d":"0.00"}},{"$f":"SUMIF('F 7.1 Det bs AF'!$D$17:$D$204,$C20,'F 7.1 Det bs AF'!AG$17:AG$204)","v":{"v":0,"d":"0.00"}},{"$f":"SUMIF('F 7.1 Det bs AF'!$D$17:$D$204,$C20,'F 7.1 Det bs AF'!AH$17:AH$204)","v":{"v":0,"d":"0.00"}},{"v":346.99999999999994,"d":"347.00"},{"v":81006.64,"d":"81,006.64"},{"v":555.2099999999919,"d":"555.21"}]
[null,null,"349111",{"$f":"VLOOKUP(C21,TASAS!$C$6:$D$13,2,0)","v":"OTROS ACTIVOS INTANGIBLES"},{"$f":"SUMIF('F 7.1 Det bs AF'!$D$17:$D$204,$C21,'F 7.1 Det bs AF'!I$17:I$204)","v":{"v":48580.11,"d":"48,580.11"}},{"$f":"SUMIF('F 7.1 Det bs AF'!$D$17:$D$204,$C21,'F 7.1 Det bs AF'!J$17:J$204)","v":{"v":0,"d":"0.00"}},{"v":48580.11,"d":"48,580.11"},{"$f":"SUMIF('F 7.1 Det bs AF'!$D$17:$D$204,$C21,'F 7.1 Det bs AF'!V$17:V$204)","v":{"v":48580.11,"d":"48,580.11"}},{"$f":"SUMIF('F 7.1 Det bs AF'!$D$17:$D$204,$C21,'F 7.1 Det bs AF'!W$17:W$204)","v":{"v":0,"d":"0.00"}},{"$f":"SUMIF('F 7.1 Det bs AF'!$D$17:$D$204,$C21,'F 7.1 Det bs AF'!X$17:X$204)","v":{"v":0,"d":"0.00"}},{"$f":"SUMIF('F 7.1 Det bs AF'!$D$17:$D$204,$C21,'F 7.1 Det bs AF'!Y$17:Y$204)","v":{"v":0,"d":"0.00"}},{"$f":"SUMIF('F 7.1 Det bs AF'!$D$17:$D$204,$C21,'F 7.1 Det bs AF'!Z$17:Z$204)","v":{"v":0,"d":"0.00"}},{"$f":"SUMIF('F 7.1 Det bs AF'!$D$17:$D$204,$C21,'F 7.1 Det bs AF'!AA$17:AA$204)","v":{"v":0,"d":"0.00"}},{"$f":"SUMIF('F 7.1 Det bs AF'!$D$17:$D$204,$C21,'F 7.1 Det bs AF'!AB$17:AB$204)","v":{"v":0,"d":"0.00"}},{"$f":"SUMIF('F 7.1 Det bs AF'!$D$17:$D$204,$C21,'F 7.1 Det bs AF'!AC$17:AC$204)","v":{"v":0,"d":"0.00"}},{"$f":"SUMIF('F 7.1 Det bs AF'!$D$17:$D$204,$C21,'F 7.1 Det bs AF'!AD$17:AD$204)","v":{"v":0,"d":"0.00"}},{"$f":"SUMIF('F 7.1 Det bs AF'!$D$17:$D$204,$C21,'F 7.1 Det bs AF'!AE$17:AE$204)","v":{"v":0,"d":"0.00"}},{"$f":"SUMIF('F 7.1 Det bs AF'!$D$17:$D$204,$C21,'F 7.1 Det bs AF'!AF$17:AF$204)","v":{"v":0,"d":"0.00"}},{"$f":"SUMIF('F 7.1 Det bs AF'!$D$17:$D$204,$C21,'F 7.1 Det bs AF'!AG$17:AG$204)","v":{"v":0,"d":"0.00"}},{"$f":"SUMIF('F 7.1 Det bs AF'!$D$17:$D$204,$C21,'F 7.1 Det bs AF'!AH$17:AH$204)","v":{"v":0,"d":"0.00"}},{"v":0,"d":"0.00"},{"v":48580.11,"d":"48,580.11"},{"v":0,"d":"0.00"}]
{"$rows_left_out":3}
{"sheet":"DO_HT","index":3,"n_rows":15,"n_cols":8,"rows_kept":15,"hidden":true}
[]
[]
[null,null,"FECHA","AÑO MES",null,"Etiquetas de fila",null,{"$f":"\"CUADRO DE ACTIVOS Y DEPRECIACION AL \"&TEXT(F4,\"DD/MM/\")&YEAR(F4)","v":"CUADRO DE ACTIVOS Y DEPRECIACION AL 31/05/2020"}]
[null,null,{"$f":"DATE(YEAR(TODAY()),ROWS(C$3:C4),0)","v":"2020-01-31"},{"$f":"YEAR(C4)&\" • \"&TEXT(C4,\"MM MMM\")","v":"2020 • 01 Ene"},null,"2020-05-31"]
[null,null,{"$f":"DATE(YEAR(TODAY()),ROWS(C$3:C5),0)","v":"2020-02-29"},"2020 • 02 Feb"]
[null,null,{"$f":"DATE(YEAR(TODAY()),ROWS(C$3:C6),0)","v":"2020-03-31"},"2020 • 03 Mar"]
[null,null,{"$f":"DATE(YEAR(TODAY()),ROWS(C$3:C7),0)","v":"2020-04-30"},"2020 • 04 Abr"]
[null,null,{"$f":"DATE(YEAR(TODAY()),ROWS(C$3:C8),0)","v":"2020-05-31"},"2020 • 05 May"]
[null,null,{"$f":"DATE(YEAR(TODAY()),ROWS(C$3:C9),0)","v":"2020-06-30"},"2020 • 06 Jun"]
[null,null,{"$f":"DATE(YEAR(TODAY()),ROWS(C$3:C10),0)","v":"2020-07-31"},"2020 • 07 Jul"]
[null,null,{"$f":"DATE(YEAR(TODAY()),ROWS(C$3:C11),0)","v":"2020-08-31"},"2020 • 08 Ago"]
[null,null,{"$f":"DATE(YEAR(TODAY()),ROWS(C$3:C12),0)","v":"2020-09-30"},"2020 • 09 Set"]
[null,null,{"$f":"DATE(YEAR(TODAY()),ROWS(C$3:C13),0)","v":"2020-10-31"},"2020 • 10 Oct"]
[null,null,{"$f":"DATE(YEAR(TODAY()),ROWS(C$3:C14),0)","v":"2020-11-30"},"2020 • 11 Nov"]
[null,null,{"$f":"DATE(YEAR(TODAY()),ROWS(C$3:C15),0)","v":"2020-12-31"},"2020 • 12 Dic"]