{"text_format":"3","workbook":"xlsx","n_sheets":4,"sheets":["TASAS","F 7.1 Det bs AF","RESUMEN","DO_HT"],"not_rendered":{"macros":1,"external_links":1,"defined_names":4,"pivot_tables":1},"read":"whole","date_system":"1900"}

{"sheet":"TASAS","index":0,"n_rows":13,"n_cols":5,"rows_kept":13}
[null,"Tasas • Registro de activos fijos y depreciación"]
[null,"MOS Expert CPC Martín Cruz • +51 998 401 784 | Excel No Convencional"]
[]
[]
[null,null,"CUENTA","NOMBRE","TASA"]
[null,null,"335111","MUEBLES",{"v":0.1,"d":"10%"}]
[null,null,"335211","ENSERES",{"v":0.1,"d":"10%"}]
[null,null,"336111","EQUIPO COMPUTO",{"v":0.25,"d":"25%"}]
[null,null,"336211","EQUIPO DE COMUNICACION",{"v":0.1,"d":"10%"}]
[null,null,"336311","EQUIPOS DE SEGURIDAD",{"v":0.1,"d":"10%"}]
[null,null,"336911","OTROS EQUIPOS",{"v":0.1,"d":"10%"}]
[null,null,"341211","LICENCIAS DE PROGRAMAS",{"v":0.25,"d":"25%"}]
[null,null,"349111","OTROS ACTIVOS INTANGIBLES",{"v":0.1,"d":"10%"}]

{"sheet":"F 7.1 Det bs AF","index":1,"n_rows":204,"n_cols":40,"rows_kept":204}
[null,"Hoja de trabajo • Registro de activos fijos y depreciación"]
[null,"MOS Expert CPC Martín Cruz • +51 998 401 784 | Excel No Convencional"]
[]
[]
[]
[null,null,"FORMATO 7.1: \"REGISTRO DE ACTIVOS FIJOS - DETALLE DE LOS ACTIVOS FIJOS\""]
[]
[null,null,"PERÍODO:",{"$f":"SELECCION","v":"2020-05-31"}]
[null,null,"RUC:"]
[null,null,"APELLIDOS Y NOMBRES, DENOMINACIÓN O RAZÓN SOCIAL:"]
[]
[null,null,"       CÓDIGO","     CUENTA","                                 DETALLE DEL ACTIVO FIJO",{"$nulls":8},"        VALOR",null,"        VALOR",null," FECHA DE INICIO ","              DEPRECIACIÓN",null,null,"     DEPRECIACIÓN",{"$nulls":13},"        DEPRECIACIÓN","DEPRECIACIÓN","  DEPRECIACIÓN  ","    AJUSTE POR","   DEPRECIACIÓN"]
[null,null,"   RELACIONADO ","  CONTABLE ",null,"     MARCA","    MODELO"," NÚMERO DE SERIE","       SALDO","     ADQUISICIONES","  MEJORAS","    RETIROS","        OTROS","     HISTÓRICO ","AJUSTE POR","     AJUSTADO","   FECHA DE","         DEL USO","   MÉTODO","   N° DE DOCUMENTO","   PORCENTAJE","     ACUMULADA AL",{"$nulls":12},"   DEPRECIACIÓN ","        DEL EJERCICIO "," RELACIONADA ","    ACUMULADA","      INFLACIÓN","     ACUMULADA"]
[null,null,"         CON EL","         DEL","    DESCRIPCIÓN","         DEL","         DEL","     Y/O PLACA DEL","        INICIAL","        ADICIONES",null,"        Y/O","      AJUSTES"," DEL ACTIVO FIJO","  INFLACIÓN"," DEL ACTIVO FIJO"," ADQUISICIÓN"," DEL ACTIVO FIJO","  APLICADO","            DE","            DE","     AL CIERRE DEL",{"$nulls":12},"   DEL EJERCICIO"," RELACIONADA CON  LOS","   CON OTROS","     HISTÓRICA","          DE LA","  AJUSTADA POR"]
[null,null,"    ACTIVO FIJO"," ACTIVO FIJO",null," ACTIVO FIJO"," ACTIVO FIJO","       ACTIVO FIJO",{"$nulls":3},"     BAJAS",null,"        AL 31.12",null,"        AL 31.12",{"$nulls":3},"    AUTORIZACIÓN","  DEPRECIACIÓN","EJERCICIO ANTERIOR",{"$nulls":13},"    RETIROS Y/O BAJAS","     AJUSTES",null,"  DEPRECIACIÓN","      INFLACIÓN"]
[null,null,"Columna1","Columna2","Columna3","Columna4","Columna5","Columna6","Columna7","Columna8","Columna9","Columna10","Columna11","Columna12","Columna13","Columna14","Columna15","Columna16","Columna17","Columna18","Columna19","Columna20","31/01/2020","29/02/2020","31/03/2020","30/04/2020","31/05/2020","30/06/2020","31/07/2020","31/08/2020","30/09/2020","31/10/2020","30/11/2020","31/12/2020","Columna21","Columna22","Columna23","Columna24","Columna25","Columna26"]
[null,null,1,"335111","ARCHIVADOR DE MADERA NEGRO C/4 GAVETAS",{"$nulls":3},168.55,{"$nulls":4},168.55,null,168.55,"2000-01-26","2000-02-01",null,null,{"v":0.1,"d":"10%"},168.55,{"$f":"IF(AND(W$16*1>=$R17,W$16*1<=$D$8,$R17<$D$8,$P17>SUM($V17:V17)),IF(SUM($P17*$U17/12,$V17:V17)>$P17,$P17-SUM($V17:V17),$P17*$U17/12),0)","v":{"v":0,"d":"0.00"}},{"$f":"IF(AND(X$16*1>=$R17,X$16*1<=$D$8,$R17<$D$8,$P17>SUM($V17:W17)),IF(SUM($P17*$U17/12,$V17:W17)>$P17,$P17-SUM($V17:W17),$P17*$U17/12),0)","v":{"v":0,"d":"0.00"}},{"$f":"IF(AND(Y$16*1>=$R17,Y$16*1<=$D$8,$R17<$D$8,$P17>SUM($V17:X17)),IF(SUM($P17*$U17/12,$V17:X17)>$P17,$P17-SUM($V17:X17),$P17*$U17/12),0)","v":{"v":0,"d":"0.00"}},{"$f":"IF(AND(Z$16*1>=$R17,Z$16*1<=$D$8,$R17<$D$8,$P17>SUM($V17:Y17)),IF(SUM($P17*$U17/12,$V17:Y17)>$P17,$P17-SUM($V17:Y17),$P17*$U17/12),0)","v":{"v":0,"d":"0.00"}},{"$f":"IF(AND(AA$16*1>=$R17,AA$16*1<=$D$8,$R17<$D$8,$P17>SUM($V17:Z17)),IF(SUM($P17*$U17/12,$V17:Z17)>$P17,$P17-SUM($V17:Z17),$P17*$U17/12),0)","v":{"v":0,"d":"0.00"}},{"$f":"IF(AND(AB$16*1>=$R17,AB$16*1<=$D$8,$R17<$D$8,$P17>SUM($V17:AA17)),IF(SUM($P17*$U17/12,$V17:AA17)>$P17,$P17-SUM($V17:AA17),$P17*$U17/12),0)","v":{"v":0,"d":"0.00"}},{"$f":"IF(AND(AC$16*1>=$R17,AC$16*1<=$D$8,$R17<$D$8,$P17>SUM($V17:AB17)),IF(SUM($P17*$U17/12,$V17:AB17)>$P17,$P17-SUM($V17:AB17),$P17*$U17/12),0)","v":{"v":0,"d":"0.00"}},{"$f":"IF(AND(AD$16*1>=$R17,AD$16*1<=$D$8,$R17<$D$8,$P17>SUM($V17:AC17)),IF(SUM($P17*$U17/12,$V17:AC17)>$P17,$P17-SUM($V17:AC17),$P17*$U17/12),0)","v":{"v":0,"d":"0.00"}},{"$f":"IF(AND(AE$16*1>=$R17,AE$16*1<=$D$8,$R17<$D$8,$P17>SUM($V17:AD17)),IF(SUM($P17*$U17/12,$V17:AD17)>$P17,$P17-SUM($V17:AD17),$P17*$U17/12),0)","v":{"v":0,"d":"0.00"}},{"$f":"IF(AND(AF$16*1>=$R17,AF$16*1<=$D$8,$R17<$D$8,$P17>SUM($V17:AE17)),IF(SUM($P17*$U17/12,$V17:AE17)>$P17,$P17-SUM($V17:AE17),$P17*$U17/12),0)","v":{"v":0,"d":"0.00"}},{"$f":"IF(AND(AG$16*1>=$R17,AG$16*1<=$D$8,$R17<$D$8,$P17>SUM($V17:AF17)),IF(SUM($P17*$U17/12,$V17:AF17)>$P17,$P17-SUM($V17:AF17),$P17*$U17/12),0)","v":{"v":0,"d":"0.00"}},{"$f":"IF(AND(AH$16*1>=$R17,AH$16*1<=$D$8,$R17<$D$8,$P17>SUM($V17:AG17)),IF(SUM($P17*$U17/12,$V17:AG17)>$P17,$P17-SUM($V17:AG17),$P17*$U17/12),0)","v":{"v":0,"d":"0.00"}},{"$f":"SUM(W17:AH17)","v":{"v":0,"d":"0.00"}},null,null,168.55,null,168.55]
[null,null,2,"335111","MODULO DE COMPUTO EN \"L\" NEGRO",{"$nulls":3},257.12,{"$nulls":4},257.12,null,257.12,"2000-01-26","2000-02-01",null,null,{"v":0.1,"d":"10%"},257.12,{"$f":"IF(AND(W$16*1>=$R18,W$16*1<=$D$8,$R18<$D$8,$P18>SUM($V18:V18)),IF(SUM($P18*$U18/12,$V18:V18)>$P18,$P18-SUM($V18:V18),$P18*$U18/12),0)","v":{"v":0,"d":"0.00"}},{"$f":"IF(AND(X$16*1>=$R18,X$16*1<=$D$8,$R18<$D$8,$P18>SUM($V18:W18)),IF(SUM($P18*$U18/12,$V18:W18)>$P18,$P18-SUM($V18:W18),$P18*$U18/12),0)","v":{"v":0,"d":"0.00"}},{"$f":"IF(AND(Y$16*1>=$R18,Y$16*1<=$D$8,$R18<$D$8,$P18>SUM($V18:X18)),IF(SUM($P18*$U18/12,$V18:X18)>$P18,$P18-SUM($V18:X18),$P18*$U18/12),0)","v":{"v":0,"d":"0.00"}},{"$f":"IF(AND(Z$16*1>=$R18,Z$16*1<=$D$8,$R18<$D$8,$P18>SUM($V18:Y18)),IF(SUM($P18*$U18/12,$V18:Y18)>$P18,$P18-SUM($V18:Y18),$P18*$U18/12),0)","v":{"v":0,"d":"0.00"}},{"$f":"IF(AND(AA$16*1>=$R18,AA$16*1<=$D$8,$R18<$D$8,$P18>SUM($V18:Z18)),IF(SUM($P18*$U18/12,$V18:Z18)>$P18,$P18-SUM($V18:Z18),$P18*$U18/12),0)","v":{"v":0,"d":"0.00"}},{"$f":"IF(AND(AB$16*1>=$R18,AB$16*1<=$D$8,$R18<$D$8,$P18>SUM($V18:AA18)),IF(SUM($P18*$U18/12,$V18:AA18)>$P18,$P18-SUM($V18:AA18),$P18*$U18/12),0)","v":{"v":0,"d":"0.00"}},{"$f":"IF(AND(AC$16*1>=$R18,AC$16*1<=$D$8,$R18<$D$8,$P18>SUM($V18:AB18)),IF(SUM($P18*$U18/12,$V18:AB18)>$P18,$P18-SUM($V18:AB18),$P18*$U18/12),0)","v":{"v":0,"d":"0.00"}},{"$f":"IF(AND(AD$16*1>=$R18,AD$16*1<=$D$8,$R18<$D$8,$P18>SUM($V18:AC18)),IF(SUM($P18*$U18/12,$V18:AC18)>$P18,$P18-SUM($V18:AC18),$P18*$U18/12),0)","v":{"v":0,"d":"0.00"}},{"$f":"IF(AND(AE$16*1>=$R18,AE$16*1<=$D$8,$R18<$D$8,$P18>SUM($V18:AD18)),IF(SUM($P18*$U18/12,$V18:AD18)>$P18,$P18-SUM($V18:AD18),$P18*$U18/12),0)","v":{"v":0,"d":"0.00"}},{"$f":"IF(AND(AF$16*1>=$R18,AF$16*1<=$D$8,$R18<$D$8,$P18>SUM($V18:AE18)),IF(SUM($P18*$U18/12,$V18:AE18)>$P18,$P18-SUM($V18:AE18),$P18*$U18/12),0)","v":{"v":0,"d":"0.00"}},{"$f":"IF(AND(AG$16*1>=$R18,AG$16*1<=$D$8,$R18<$D$8,$P18>SUM($V18:AF18)),IF(SUM($P18*$U18/12,$V18:AF18)>$P18,$P18-SUM($V18:AF18),$P18*$U18/12),0)","v":{"v":0,"d":"0.00"}},{"$f":"IF(AND(AH$16*1>=$R18,AH$16*1<=$D$8,$R18<$D$8,$P18>SUM($V18:AG18)),IF(SUM($P18*$U18/12,$V18:AG18)>$P18,$P18-SUM($V18:AG18),$P18*$U18/12),0)","v":{"v":0,"d":"0.00"}},{"v":0,"d":"0.00"},null,null,257.12,null,257.12]
[null,null,3,"335111","ESTANTE DE 2 MTS.",{"$nulls":3},282.99,{"$nulls":4},282.99,null,282.99,"2000-05-06","2000-06-01",null,null,{"v":0.1,"d":"10%"},282.99,{"$f":"IF(AND(W$16*1>=$R19,W$16*1<=$D$8,$R19<$D$8,$P19>SUM($V19:V19)),IF(SUM($P19*$U19/12,$V19:V19)>$P19,$P19-SUM($V19:V19),$P19*$U19/12),0)","v":{"v":0,"d":"0.00"}},{"$f":"IF(AND(X$16*1>=$R19,X$16*1<=$D$8,$R19<$D$8,$P19>SUM($V19:W19)),IF(SUM($P19*$U19/12,$V19:W19)>$P19,$P19-SUM($V19:W19),$P19*$U19/12),0)","v":{"v":0,"d":"0.00"}},{"$f":"IF(AND(Y$16*1>=$R19,Y$16*1<=$D$8,$R19<$D$8,$P19>SUM($V19:X19)),IF(SUM($P19*$U19/12,$V19:X19)>$P19,$P19-SUM($V19:X19),$P19*$U19/12),0)","v":{"v":0,"d":"0.00"}},{"$f":"IF(AND(Z$16*1>=$R19,Z$16*1<=$D$8,$R19<$D$8,$P19>SUM($V19:Y19)),IF(SUM($P19*$U19/12,$V19:Y19)>$P19,$P19-SUM($V19:Y19),$P19*$U19/12),0)","v":{"v":0,"d":"0.00"}},{"$f":"IF(AND(AA$16*1>=$R19,AA$16*1<=$D$8,$R19<$D$8,$P19>SUM($V19:Z19)),IF(SUM($P19*$U19/12,$V19:Z19)>$P19,$P19-SUM($V19:Z19),$P19*$U19/12),0)","v":{"v":0,"d":"0.00"}},{"$f":"IF(AND(AB$16*1>=$R19,AB$16*1<=$D$8,$R19<$D$8,$P19>SUM($V19:AA19)),IF(SUM($P19*$U19/12,$V19:AA19)>$P19,$P19-SUM($V19:AA19),$P19*$U19/12),0)","v":{"v":0,"d":"0.00"}},{"$f":"IF(AND(AC$16*1>=$R19,AC$16*1<=$D$8,$R19<$D$8,$P19>SUM($V19:AB19)),IF(SUM($P19*$U19/12,$V19:AB19)>$P19,$P19-SUM($V19:AB19),$P19*$U19/12),0)","v":{"v":0,"d":"0.00"}},{"$f":"IF(AND(AD$16*1>=$R19,AD$16*1<=$D$8,$R19<$D$8,$P19>SUM($V19:AC19)),IF(SUM($P19*$U19/12,$V19:AC19)>$P19,$P19-SUM($V19:AC19),$P19*$U19/12),0)","v":{"v":0,"d":"0.00"}},{"$f":"IF(AND(AE$16*1>=$R19,AE$16*1<=$D$8,$R19<$D$8,$P19>SUM($V19:AD19)),IF(SUM($P19*$U19/12,$V19:AD19)>$P19,$P19-SUM($V19:AD19),$P19*$U19/12),0)","v":{"v":0,"d":"0.00"}},{"$f":"IF(AND(AF$16*1>=$R19,AF$16*1<=$D$8,$R19<$D$8,$P19>SUM($V19:AE19)),IF(SUM($P19*$U19/12,$V19:AE19)>$P19,$P19-SUM($V19:AE19),$P19*$U19/12),0)","v":{"v":0,"d":"0.00"}},{"$f":"IF(AND(AG$16*1>=$R19,AG$16*1<=$D$8,$R19<$D$8,$P19>SUM($V19:AF19)),IF(SUM($P19*$U19/12,$V19:AF19)>$P19,$P19-SUM($V19:AF19),$P19*$U19/12),0)","v":{"v":0,"d":"0.00"}},{"$f":"IF(AND(AH$16*1>=$R19,AH$16*1<=$D$8,$R19<$D$8,$P19>SUM($V19:AG19)),IF(SUM($P19*$U19/12,$V19:AG19)>$P19,$P19-SUM($V19:AG19),$P19*$U19/12),0)","v":{"v":0,"d":"0.00"}},{"v":0,"d":"0.00"},null,null,282.99,null,282.99]
[null,null,4,"335111","MUEBLE NEGRO PARA COMPUTADORA",{"$nulls":3},799.22,{"$nulls":4},799.22,null,799.22,"2000-07-22","2000-08-01",null,null,{"v":0.1,"d":"10%"},799.22,{"$f":"IF(AND(W$16*1>=$R20,W$16*1<=$D$8,$R20<$D$8,$P20>SUM($V20:V20)),IF(SUM($P20*$U20/12,$V20:V20)>$P20,$P20-SUM($V20:V20),$P20*$U20/12),0)","v":{"v":0,"d":"0.00"}},{"$f":"IF(AND(X$16*1>=$R20,X$16*1<=$D$8,$R20<$D$8,$P20>SUM($V20:W20)),IF(SUM($P20*$U20/12,$V20:W20)>$P20,$P20-SUM($V20:W20),$P20*$U20/12),0)","v":{"v":0,"d":"0.00"}},{"$f":"IF(AND(Y$16*1>=$R20,Y$16*1<=$D$8,$R20<$D$8,$P20>SUM($V20:X20)),IF(SUM($P20*$U20/12,$V20:X20)>$P20,$P20-SUM($V20:X20),$P20*$U20/12),0)","v":{"v":0,"d":"0.00"}},{"$f":"IF(AND(Z$16*1>=$R20,Z$16*1<=$D$8,$R20<$D$8,$P20>SUM($V20:Y20)),IF(SUM($P20*$U20/12,$V20:Y20)>$P20,$P20-SUM($V20:Y20),$P20*$U20/12),0)","v":{"v":0,"d":"0.00"}},{"$f":"IF(AND(AA$16*1>=$R20,AA$16*1<=$D$8,$R20<$D$8,$P20>SUM($V20:Z20)),IF(SUM($P20*$U20/12,$V20:Z20)>$P20,$P20-SUM($V20:Z20),$P20*$U20/12),0)","v":{"v":0,"d":"0.00"}},{"$f":"IF(AND(AB$16*1>=$R20,AB$16*1<=$D$8,$R20<$D$8,$P20>SUM($V20:AA20)),IF(SUM($P20*$U20/12,$V20:AA20)>$P20,$P20-SUM($V20:AA20),$P20*$U20/12),0)","v":{"v":0,"d":"0.00"}},{"$f":"IF(AND(AC$16*1>=$R20,AC$16*1<=$D$8,$R20<$D$8,$P20>SUM($V20:AB20)),IF(SUM($P20*$U20/12,$V20:AB20)>$P20,$P20-SUM($V20:AB20),$P20*$U20/12),0)","v":{"v":0,"d":"0.00"}},{"$f":"IF(AND(AD$16*1>=$R20,AD$16*1<=$D$8,$R20<$D$8,$P20>SUM($V20:AC20)),IF(SUM($P20*$U20/12,$V20:AC20)>$P20,$P20-SUM($V20:AC20),$P20*$U20/12),0)","v":{"v":0,"d":"0.00"}},{"$f":"IF(AND(AE$16*1>=$R20,AE$16*1<=$D$8,$R20<$D$8,$P20>SUM($V20:AD20)),IF(SUM($P20*$U20/12,$V20:AD20)>$P20,$P20-SUM($V20:AD20),$P20*$U20/12),0)","v":{"v":0,"d":"0.00"}},{"$f":"IF(AND(AF$16*1>=$R20,AF$16*1<=$D$8,$R20<$D$8,$P20>SUM($V20:AE20)),IF(SUM($P20*$U20/12,$V20:AE20)>$P20,$P20-SUM($V20:AE20),$P20*$U20/12),0)","v":{"v":0,"d":"0.00"}},{"$f":"IF(AND(AG$16*1>=$R20,AG$16*1<=$D$8,$R20<$D$8,$P20>SUM($V20:AF20)),IF(SUM($P20*$U20/12,$V20:AF20)>$P20,$P20-SUM($V20:AF20),$P20*$U20/12),0)","v":{"v":0,"d":"0.00"}},{"$f":"IF(AND(AH$16*1>=$R20,AH$16*1<=$D$8,$R20<$D$8,$P20>SUM($V20:AG20)),IF(SUM($P20*$U20/12,$V20:AG20)>$P20,$P20-SUM($V20:AG20),$P20*$U20/12),0)","v":{"v":0,"d":"0.00"}},{"v":0,"d":"0.00"},null,null,799.22,null,799.22]
[null,null,5,"335111","ARCHIVADOR NEGRO C/4 GAVETAS",{"$nulls":3},356.79,{"$nulls":4},356.79,null,356.79,"2000-09-28","2000-10-01",null,null,{"v":0.1,"d":"10%"},356.79,{"$f":"IF(AND(W$16*1>=$R21,W$16*1<=$D$8,$R21<$D$8,$P21>SUM($V21:V21)),IF(SUM($P21*$U21/12,$V21:V21)>$P21,$P21-SUM($V21:V21),$P21*$U21/12),0)","v":{"v":0,"d":"0.00"}},{"$f":"IF(AND(X$16*1>=$R21,X$16*1<=$D$8,$R21<$D$8,$P21>SUM($V21:W21)),IF(SUM($P21*$U21/12,$V21:W21)>$P21,$P21-SUM($V21:W21),$P21*$U21/12),0)","v":{"v":0,"d":"0.00"}},{"$f":"IF(AND(Y$16*1>=$R21,Y$16*1<=$D$8,$R21<$D$8,$P21>SUM($V21:X21)),IF(SUM($P21*$U21/12,$V21:X21)>$P21,$P21-SUM($V21:X21),$P21*$U21/12),0)","v":{"v":0,"d":"0.00"}},{"$f":"IF(AND(Z$16*1>=$R21,Z$16*1<=$D$8,$R21<$D$8,$P21>SUM($V21:Y21)),IF(SUM($P21*$U21/12,$V21:Y21)>$P21,$P21-SUM($V21:Y21),$P21*$U21/12),0)","v":{"v":0,"d":"0.00"}},{"$f":"IF(AND(AA$16*1>=$R21,AA$16*1<=$D$8,$R21<$D$8,$P21>SUM($V21:Z21)),IF(SUM($P21*$U21/12,$V21:Z21)>$P21,$P21-SUM($V21:Z21),$P21*$U21/12),0)","v":{"v":0,"d":"0.00"}},{"$f":"IF(AND(AB$16*1>=$R21,AB$16*1<=$D$8,$R21<$D$8,$P21>SUM($V21:AA21)),IF(SUM($P21*$U21/12,$V21:AA21)>$P21,$P21-SUM($V21:AA21),$P21*$U21/12),0)","v":{"v":0,"d":"0.00"}},{"$f":"IF(AND(AC$16*1>=$R21,AC$16*1<=$D$8,$R21<$D$8,$P21>SUM($V21:AB21)),IF(SUM($P21*$U21/12,$V21:AB21)>$P21,$P21-SUM($V21:AB21),$P21*$U21/12),0)","v":{"v":0,"d":"0.00"}},{"$f":"IF(AND(AD$16*1>=$R21,AD$16*1<=$D$8,$R21<$D$8,$P21>SUM($V21:AC21)),IF(SUM($P21*$U21/12,$V21:AC21)>$P21,$P21-SUM($V21:AC21),$P21*$U21/12),0)","v":{"v":0,"d":"0.00"}},{"$f":"IF(AND(AE$16*1>=$R21,AE$16*1<=$D$8,$R21<$D$8,$P21>SUM($V21:AD21)),IF(SUM($P21*$U21/12,$V21:AD21)>$P21,$P21-SUM($V21:AD21),$P21*$U21/12),0)","v":{"v":0,"d":"0.00"}},{"$f":"IF(AND(AF$16*1>=$R21,AF$16*1<=$D$8,$R21<$D$8,$P21>SUM($V21:AE21)),IF(SUM($P21*$U21/12,$V21:AE21)>$P21,$P21-SUM($V21:AE21),$P21*$U21/12),0)","v":{"v":0,"d":"0.00"}},{"$f":"IF(AND(AG$16*1>=$R21,AG$16*1<=$D$8,$R21<$D$8,$P21>SUM($V21:AF21)),IF(SUM($P21*$U21/12,$V21:AF21)>$P21,$P21-SUM($V21:AF21),$P21*$U21/12),0)","v":{"v":0,"d":"0.00"}},{"$f":"IF(AND(AH$16*1>=$R21,AH$16*1<=$D$8,$R21<$D$8,$P21>SUM($V21:AG21)),IF(SUM($P21*$U21/12,$V21:AG21)>$P21,$P21-SUM($V21:AG21),$P21*$U21/12),0)","v":{"v":0,"d":"0.00"}},{"v":0,"d":"0.00"},null,null,356.79,null,356.79]
[null,null,6,"335111","ARCHIVADOR DE 4 GAVETAS NEGRO",{"$nulls":3},306.9,{"$nulls":4},306.9,null,{"v":306.9,"d":"306.90"},"2002-04-27","2002-05-01",null,null,{"v":0.1,"d":"10%"},{"v":306.9,"d":"306.90"},{"$f":"IF(AND(W$16*1>=$R22,W$16*1<=$D$8,$R22<$D$8,$P22>SUM($V22:V22)),IF(SUM($P22*$U22/12,$V22:V22)>$P22,$P22-SUM($V22:V22),$P22*$U22/12),0)","v":{"v":0,"d":"0.00"}},{"$f":"IF(AND(X$16*1>=$R22,X$16*1<=$D$8,$R22<$D$8,$P22>SUM($V22:W22)),IF(SUM($P22*$U22/12,$V22:W22)>$P22,$P22-SUM($V22:W22),$P22*$U22/12),0)","v":{"v":0,"d":"0.00"}},{"$f":"IF(AND(Y$16*1>=$R22,Y$16*1<=$D$8,$R22<$D$8,$P22>SUM($V22:X22)),IF(SUM($P22*$U22/12,$V22:X22)>$P22,$P22-SUM($V22:X22),$P22*$U22/12),0)","v":{"v":0,"d":"0.00"}},{"$f":"IF(AND(Z$16*1>=$R22,Z$16*1<=$D$8,$R22<$D$8,$P22>SUM($V22:Y22)),IF(SUM($P22*$U22/12,$V22:Y22)>$P22,$P22-SUM($V22:Y22),$P22*$U22/12),0)","v":{"v":0,"d":"0.00"}},{"$f":"IF(AND(AA$16*1>=$R22,AA$16*1<=$D$8,$R22<$D$8,$P22>SUM($V22:Z22)),IF(SUM($P22*$U22/12,$V22:Z22)>$P22,$P22-SUM($V22:Z22),$P22*$U22/12),0)","v":{"v":0,"d":"0.00"}},{"$f":"IF(AND(AB$16*1>=$R22,AB$16*1<=$D$8,$R22<$D$8,$P22>SUM($V22:AA22)),IF(SUM($P22*$U22/12,$V22:AA22)>$P22,$P22-SUM($V22:AA22),$P22*$U22/12),0)","v":{"v":0,"d":"0.00"}},{"$f":"IF(AND(AC$16*1>=$R22,AC$16*1<=$D$8,$R22<$D$8,$P22>SUM($V22:AB22)),IF(SUM($P22*$U22/12,$V22:AB22)>$P22,$P22-SUM($V22:AB22),$P22*$U22/12),0)","v":{"v":0,"d":"0.00"}},{"$f":"IF(AND(AD$16*1>=$R22,AD$16*1<=$D$8,$R22<$D$8,$P22>SUM($V22:AC22)),IF(SUM($P22*$U22/12,$V22:AC22)>$P22,$P22-SUM($V22:AC22),$P22*$U22/12),0)","v":{"v":0,"d":"0.00"}},{"$f":"IF(AND(AE$16*1>=$R22,AE$16*1<=$D$8,$R22<$D$8,$P22>SUM($V22:AD22)),IF(SUM($P22*$U22/12,$V22:AD22)>$P22,$P22-SUM($V22:AD22),$P22*$U22/12),0)","v":{"v":0,"d":"0.00"}},{"$f":"IF(AND(AF$16*1>=$R22,AF$16*1<=$D$8,$R22<$D$8,$P22>SUM($V22:AE22)),IF(SUM($P22*$U22/12,$V22:AE22)>$P22,$P22-SUM($V22:AE22),$P22*$U22/12),0)","v":{"v":0,"d":"0.00"}},{"$f":"IF(AND(AG$16*1>=$R22,AG$16*1<=$D$8,$R22<$D$8,$P22>SUM($V22:AF22)),IF(SUM($P22*$U22/12,$V22:AF22)>$P22,$P22-SUM($V22:AF22),$P22*$U22/12),0)","v":{"v":0,"d":"0.00"}},{"$f":"IF(AND(AH$16*1>=$R22,AH$16*1<=$D$8,$R22<$D$8,$P22>SUM($V22:AG22)),IF(SUM($P22*$U22/12,$V22:AG22)>$P22,$P22-SUM($V22:AG22),$P22*$U22/12),0)","v":{"v":0,"d":"0.00"}},{"v":0,"d":"0.00"},null,null,{"v":306.9,"d":"306.90"},null,{"v":306.9,"d":"306.90"}]
[null,null,7,"335111","ARCHIVADOR DE 4 GAVETAS NEGRO",{"$nulls":3},301.59,{"$nulls":4},301.59,null,301.59,"2002-06-10","2002-07-01",null,null,{"v":0.1,"d":"10%"},301.59,{"$f":"IF(AND(W$16*1>=$R23,W$16*1<=$D$8,$R23<$D$8,$P23>SUM($V23:V23)),IF(SUM($P23*$U23/12,$V23:V23)>$P23,$P23-SUM($V23:V23),$P23*$U23/12),0)","v":{"v":0,"d":"0.00"}},{"$f":"IF(AND(X$16*1>=$R23,X$16*1<=$D$8,$R23<$D$8,$P23>SUM($V23:W23)),IF(SUM($P23*$U23/12,$V23:W23)>$P23,$P23-SUM($V23:W23),$P23*$U23/12),0)","v":{"v":0,"d":"0.00"}},{"$f":"IF(AND(Y$16*1>=$R23,Y$16*1<=$D$8,$R23<$D$8,$P23>SUM($V23:X23)),IF(SUM($P23*$U23/12,$V23:X23)>$P23,$P23-SUM($V23:X23),$P23*$U23/12),0)","v":{"v":0,"d":"0.00"}},{"$f":"IF(AND(Z$16*1>=$R23,Z$16*1<=$D$8,$R23<$D$8,$P23>SUM($V23:Y23)),IF(SUM($P23*$U23/12,$V23:Y23)>$P23,$P23-SUM($V23:Y23),$P23*$U23/12),0)","v":{"v":0,"d":"0.00"}},{"$f":"IF(AND(AA$16*1>=$R23,AA$16*1<=$D$8,$R23<$D$8,$P23>SUM($V23:Z23)),IF(SUM($P23*$U23/12,$V23:Z23)>$P23,$P23-SUM($V23:Z23),$P23*$U23/12),0)","v":{"v":0,"d":"0.00"}},{"$f":"IF(AND(AB$16*1>=$R23,AB$16*1<=$D$8,$R23<$D$8,$P23>SUM($V23:AA23)),IF(SUM($P23*$U23/12,$V23:AA23)>$P23,$P23-SUM($V23:AA23),$P23*$U23/12),0)","v":{"v":0,"d":"0.00"}},{"$f":"IF(AND(AC$16*1>=$R23,AC$16*1<=$D$8,$R23<$D$8,$P23>SUM($V23:AB23)),IF(SUM($P23*$U23/12,$V23:AB23)>$P23,$P23-SUM($V23:AB23),$P23*$U23/12),0)","v":{"v":0,"d":"0.00"}},{"$f":"IF(AND(AD$16*1>=$R23,AD$16*1<=$D$8,$R23<$D$8,$P23>SUM($V23:AC23)),IF(SUM($P23*$U23/12,$V23:AC23)>$P23,$P23-SUM($V23:AC23),$P23*$U23/12),0)","v":{"v":0,"d":"0.00"}},{"$f":"IF(AND(AE$16*1>=$R23,AE$16*1<=$D$8,$R23<$D$8,$P23>SUM($V23:AD23)),IF(SUM($P23*$U23/12,$V23:AD23)>$P23,$P23-SUM($V23:AD23),$P23*$U23/12),0)","v":{"v":0,"d":"0.00"}},{"$f":"IF(AND(AF$16*1>=$R23,AF$16*1<=$D$8,$R23<$D$8,$P23>SUM($V23:AE23)),IF(SUM($P23*$U23/12,$V23:AE23)>$P23,$P23-SUM($V23:AE23),$P23*$U23/12),0)","v":{"v":0,"d":"0.00"}},{"$f":"IF(AND(AG$16*1>=$R23,AG$16*1<=$D$8,$R23<$D$8,$P23>SUM($V23:AF23)),IF(SUM($P23*$U23/12,$V23:AF23)>$P23,$P23-SUM($V23:AF23),$P23*$U23/12),0)","v":{"v":0,"d":"0.00"}},{"$f":"IF(AND(AH$16*1>=$R23,AH$16*1<=$D$8,$R23<$D$8,$P23>SUM($V23:AG23)),IF(SUM($P23*$U23/12,$V23:AG23)>$P23,$P23-SUM($V23:AG23),$P23*$U23/12),0)","v":{"v":0,"d":"0.00"}},{"v":0,"d":"0.00"},null,null,301.59,null,301.59]
[null,null,8,"335111","ARCHIVADOR DE 4 GAVETAS NEGRO",{"$nulls":3},299.22,{"$nulls":4},299.22,null,299.22,"2002-09-01","2002-10-01",null,null,{"v":0.1,"d":"10%"},299.22,{"$f":"IF(AND(W$16*1>=$R24,W$16*1<=$D$8,$R24<$D$8,$P24>SUM($V24:V24)),IF(SUM($P24*$U24/12,$V24:V24)>$P24,$P24-SUM($V24:V24),$P24*$U24/12),0)","v":{"v":0,"d":"0.00"}},{"$f":"IF(AND(X$16*1>=$R24,X$16*1<=$D$8,$R24<$D$8,$P24>SUM($V24:W24)),IF(SUM($P24*$U24/12,$V24:W24)>$P24,$P24-SUM($V24:W24),$P24*$U24/12),0)","v":{"v":0,"d":"0.00"}},{"$f":"IF(AND(Y$16*1>=$R24,Y$16*1<=$D$8,$R24<$D$8,$P24>SUM($V24:X24)),IF(SUM($P24*$U24/12,$V24:X24)>$P24,$P24-SUM($V24:X24),$P24*$U24/12),0)","v":{"v":0,"d":"0.00"}},{"$f":"IF(AND(Z$16*1>=$R24,Z$16*1<=$D$8,$R24<$D$8,$P24>SUM($V24:Y24)),IF(SUM($P24*$U24/12,$V24:Y24)>$P24,$P24-SUM($V24:Y24),$P24*$U24/12),0)","v":{"v":0,"d":"0.00"}},{"$f":"IF(AND(AA$16*1>=$R24,AA$16*1<=$D$8,$R24<$D$8,$P24>SUM($V24:Z24)),IF(SUM($P24*$U24/12,$V24:Z24)>$P24,$P24-SUM($V24:Z24),$P24*$U24/12),0)","v":{"v":0,"d":"0.00"}},{"$f":"IF(AND(AB$16*1>=$R24,AB$16*1<=$D$8,$R24<$D$8,$P24>SUM($V24:AA24)),IF(SUM($P24*$U24/12,$V24:AA24)>$P24,$P24-SUM($V24:AA24),$P24*$U24/12),0)","v":{"v":0,"d":"0.00"}},{"$f":"IF(AND(AC$16*1>=$R24,AC$16*1<=$D$8,$R24<$D$8,$P24>SUM($V24:AB24)),IF(SUM($P24*$U24/12,$V24:AB24)>$P24,$P24-SUM($V24:AB24),$P24*$U24/12),0)","v":{"v":0,"d":"0.00"}},{"$f":"IF(AND(AD$16*1>=$R24,AD$16*1<=$D$8,$R24<$D$8,$P24>SUM($V24:AC24)),IF(SUM($P24*$U24/12,$V24:AC24)>$P24,$P24-SUM($V24:AC24),$P24*$U24/12),0)","v":{"v":0,"d":"0.00"}},{"$f":"IF(AND(AE$16*1>=$R24,AE$16*1<=$D$8,$R24<$D$8,$P24>SUM($V24:AD24)),IF(SUM($P24*$U24/12,$V24:AD24)>$P24,$P24-SUM($V24:AD24),$P24*$U24/12),0)","v":{"v":0,"d":"0.00"}},{"$f":"IF(AND(AF$16*1>=$R24,AF$16*1<=$D$8,$R24<$D$8,$P24>SUM($V24:AE24)),IF(SUM($P24*$U24/12,$V24:AE24)>$P24,$P24-SUM($V24:AE24),$P24*$U24/12),0)","v":{"v":0,"d":"0.00"}},{"$f":"IF(AND(AG$16*1>=$R24,AG$16*1<=$D$8,$R24<$D$8,$P24>SUM($V24:AF24)),IF(SUM($P24*$U24/12,$V24:AF24)>$P24,$P24-SUM($V24:AF24),$P24*$U24/12),0)","v":{"v":0,"d":"0.00"}},{"$f":"IF(AND(AH$16*1>=$R24,AH$16*1<=$D$8,$R24<$D$8,$P24>SUM($V24:AG24)),IF(SUM($P24*$U24/12,$V24:AG24)>$P24,$P24-SUM($V24:AG24),$P24*$U24/12),0)","v":{"v":0,"d":"0.00"}},{"v":0,"d":"0.00"},null,null,299.22,null,299.22]
[null,null,9,"335111","ESCRITORIO DE 1.20 M.",{"$nulls":3},245.79,{"$nulls":4},245.79,null,245.79,"2002-09-15","2002-10-01",null,null,{"v":0.1,"d":"10%"},245.79,{"$f":"IF(AND(W$16*1>=$R25,W$16*1<=$D$8,$R25<$D$8,$P25>SUM($V25:V25)),IF(SUM($P25*$U25/12,$V25:V25)>$P25,$P25-SUM($V25:V25),$P25*$U25/12),0)","v":{"v":0,"d":"0.00"}},{"$f":"IF(AND(X$16*1>=$R25,X$16*1<=$D$8,$R25<$D$8,$P25>SUM($V25:W25)),IF(SUM($P25*$U25/12,$V25:W25)>$P25,$P25-SUM($V25:W25),$P25*$U25/12),0)","v":{"v":0,"d":"0.00"}},{"$f":"IF(AND(Y$16*1>=$R25,Y$16*1<=$D$8,$R25<$D$8,$P25>SUM($V25:X25)),IF(SUM($P25*$U25/12,$V25:X25)>$P25,$P25-SUM($V25:X25),$P25*$U25/12),0)","v":{"v":0,"d":"0.00"}},{"$f":"IF(AND(Z$16*1>=$R25,Z$16*1<=$D$8,$R25<$D$8,$P25>SUM($V25:Y25)),IF(SUM($P25*$U25/12,$V25:Y25)>$P25,$P25-SUM($V25:Y25),$P25*$U25/12),0)","v":{"v":0,"d":"0.00"}},{"$f":"IF(AND(AA$16*1>=$R25,AA$16*1<=$D$8,$R25<$D$8,$P25>SUM($V25:Z25)),IF(SUM($P25*$U25/12,$V25:Z25)>$P25,$P25-SUM($V25:Z25),$P25*$U25/12),0)","v":{"v":0,"d":"0.00"}},{"$f":"IF(AND(AB$16*1>=$R25,AB$16*1<=$D$8,$R25<$D$8,$P25>SUM($V25:AA25)),IF(SUM($P25*$U25/12,$V25:AA25)>$P25,$P25-SUM($V25:AA25),$P25*$U25/12),0)","v":{"v":0,"d":"0.00"}},{"$f":"IF(AND(AC$16*1>=$R25,AC$16*1<=$D$8,$R25<$D$8,$P25>SUM($V25:AB25)),IF(SUM($P25*$U25/12,$V25:AB25)>$P25,$P25-SUM($V25:AB25),$P25*$U25/12),0)","v":{"v":0,"d":"0.00"}},{"$f":"IF(AND(AD$16*1>=$R25,AD$16*1<=$D$8,$R25<$D$8,$P25>SUM($V25:AC25)),IF(SUM($P25*$U25/12,$V25:AC25)>$P25,$P25-SUM($V25:AC25),$P25*$U25/12),0)","v":{"v":0,"d":"0.00"}},{"$f":"IF(AND(AE$16*1>=$R25,AE$16*1<=$D$8,$R25<$D$8,$P25>SUM($V25:AD25)),IF(SUM($P25*$U25/12,$V25:AD25)>$P25,$P25-SUM($V25:AD25),$P25*$U25/12),0)","v":{"v":0,"d":"0.00"}},{"$f":"IF(AND(AF$16*1>=$R25,AF$16*1<=$D$8,$R25<$D$8,$P25>SUM($V25:AE25)),IF(SUM($P25*$U25/12,$V25:AE25)>$P25,$P25-SUM($V25:AE25),$P25*$U25/12),0)","v":{"v":0,"d":"0.00"}},{"$f":"IF(AND(AG$16*1>=$R25,AG$16*1<=$D$8,$R25<$D$8,$P25>SUM($V25:AF25)),IF(SUM($P25*$U25/12,$V25:AF25)>$P25,$P25-SUM($V25:AF25),$P25*$U25/12),0)","v":{"v":0,"d":"0.00"}},{"$f":"IF(AND(AH$16*1>=$R25,AH$16*1<=$D$8,$R25<$D$8,$P25>SUM($V25:AG25)),IF(SUM($P25*$U25/12,$V25:AG25)>$P25,$P25-SUM($V25:AG25),$P25*$U25/12),0)","v":{"v":0,"d":"0.00"}},{"v":0,"d":"0.00"},null,null,245.79,null,245.79]
[null,null,10,"335111","ARCHIVADOR DE 4 GAVETAS",{"$nulls":3},295.68,{"$nulls":4},295.68,null,295.68,"2002-11-06","2002-12-01",null,null,{"v":0.1,"d":"10%"},295.68,{"$f":"IF(AND(W$16*1>=$R26,W$16*1<=$D$8,$R26<$D$8,$P26>SUM($V26:V26)),IF(SUM($P26*$U26/12,$V26:V26)>$P26,$P26-SUM($V26:V26),$P26*$U26/12),0)","v":{"v":0,"d":"0.00"}},{"$f":"IF(AND(X$16*1>=$R26,X$16*1<=$D$8,$R26<$D$8,$P26>SUM($V26:W26)),IF(SUM($P26*$U26/12,$V26:W26)>$P26,$P26-SUM($V26:W26),$P26*$U26/12),0)","v":{"v":0,"d":"0.00"}},{"$f":"IF(AND(Y$16*1>=$R26,Y$16*1<=$D$8,$R26<$D$8,$P26>SUM($V26:X26)),IF(SUM($P26*$U26/12,$V26:X26)>$P26,$P26-SUM($V26:X26),$P26*$U26/12),0)","v":{"v":0,"d":"0.00"}},{"$f":"IF(AND(Z$16*1>=$R26,Z$16*1<=$D$8,$R26<$D$8,$P26>SUM($V26:Y26)),IF(SUM($P26*$U26/12,$V26:Y26)>$P26,$P26-SUM($V26:Y26),$P26*$U26/12),0)","v":{"v":0,"d":"0.00"}},{"$f":"IF(AND(AA$16*1>=$R26,AA$16*1<=$D$8,$R26<$D$8,$P26>SUM($V26:Z26)),IF(SUM($P26*$U26/12,$V26:Z26)>$P26,$P26-SUM($V26:Z26),$P26*$U26/12),0)","v":{"v":0,"d":"0.00"}},{"$f":"IF(AND(AB$16*1>=$R26,AB$16*1<=$D$8,$R26<$D$8,$P26>SUM($V26:AA26)),IF(SUM($P26*$U26/12,$V26:AA26)>$P26,$P26-SUM($V26:AA26),$P26*$U26/12),0)","v":{"v":0,"d":"0.00"}},{"$f":"IF(AND(AC$16*1>=$R26,AC$16*1<=$D$8,$R26<$D$8,$P26>SUM($V26:AB26)),IF(SUM($P26*$U26/12,$V26:AB26)>$P26,$P26-SUM($V26:AB26),$P26*$U26/12),0)","v":{"v":0,"d":"0.00"}},{"$f":"IF(AND(AD$16*1>=$R26,AD$16*1<=$D$8,$R26<$D$8,$P26>SUM($V26:AC26)),IF(SUM($P26*$U26/12,$V26:AC26)>$P26,$P26-SUM($V26:AC26),$P26*$U26/12),0)","v":{"v":0,"d":"0.00"}},{"$f":"IF(AND(AE$16*1>=$R26,AE$16*1<=$D$8,$R26<$D$8,$P26>SUM($V26:AD26)),IF(SUM($P26*$U26/12,$V26:AD26)>$P26,$P26-SUM($V26:AD26),$P26*$U26/12),0)","v":{"v":0,"d":"0.00"}},{"$f":"IF(AND(AF$16*1>=$R26,AF$16*1<=$D$8,$R26<$D$8,$P26>SUM($V26:AE26)),IF(SUM($P26*$U26/12,$V26:AE26)>$P26,$P26-SUM($V26:AE26),$P26*$U26/12),0)","v":{"v":0,"d":"0.00"}},{"$f":"IF(AND(AG$16*1>=$R26,AG$16*1<=$D$8,$R26<$D$8,$P26>SUM($V26:AF26)),IF(SUM($P26*$U26/12,$V26:AF26)>$P26,$P26-SUM($V26:AF26),$P26*$U26/12),0)","v":{"v":0,"d":"0.00"}},{"$f":"IF(AND(AH$16*1>=$R26,AH$16*1<=$D$8,$R26<$D$8,$P26>SUM($V26:AG26)),IF(SUM($P26*$U26/12,$V26:AG26)>$P26,$P26-SUM($V26:AG26),$P26*$U26/12),0)","v":{"v":0,"d":"0.00"}},{"v":0,"d":"0.00"},null,null,295.68,null,295.68]
[null,null,11,"335111","COUNTER RECEPCION CEDRO",{"$nulls":3},2832.34,{"$nulls":4},2832.34,null,{"v":2832.34,"d":"2,832.34"},"2004-04-11","2004-05-01",null,null,{"v":0.1,"d":"10%"},{"v":2832.34,"d":"2,832.34"},{"$f":"IF(AND(W$16*1>=$R27,W$16*1<=$D$8,$R27<$D$8,$P27>SUM($V27:V27)),IF(SUM($P27*$U27/12,$V27:V27)>$P27,$P27-SUM($V27:V27),$P27*$U27/12),0)","v":{"v":0,"d":"0.00"}},{"$f":"IF(AND(X$16*1>=$R27,X$16*1<=$D$8,$R27<$D$8,$P27>SUM($V27:W27)),IF(SUM($P27*$U27/12,$V27:W27)>$P27,$P27-SUM($V27:W27),$P27*$U27/12),0)","v":{"v":0,"d":"0.00"}},{"$f":"IF(AND(Y$16*1>=$R27,Y$16*1<=$D$8,$R27<$D$8,$P27>SUM($V27:X27)),IF(SUM($P27*$U27/12,$V27:X27)>$P27,$P27-SUM($V27:X27),$P27*$U27/12),0)","v":{"v":0,"d":"0.00"}},{"$f":"IF(AND(Z$16*1>=$R27,Z$16*1<=$D$8,$R27<$D$8,$P27>SUM($V27:Y27)),IF(SUM($P27*$U27/12,$V27:Y27)>$P27,$P27-SUM($V27:Y27),$P27*$U27/12),0)","v":{"v":0,"d":"0.00"}},{"$f":"IF(AND(AA$16*1>=$R27,AA$16*1<=$D$8,$R27<$D$8,$P27>SUM($V27:Z27)),IF(SUM($P27*$U27/12,$V27:Z27)>$P27,$P27-SUM($V27:Z27),$P27*$U27/12),0)","v":{"v":0,"d":"0.00"}},{"$f":"IF(AND(AB$16*1>=$R27,AB$16*1<=$D$8,$R27<$D$8,$P27>SUM($V27:AA27)),IF(SUM($P27*$U27/12,$V27:AA27)>$P27,$P27-SUM($V27:AA27),$P27*$U27/12),0)","v":{"v":0,"d":"0.00"}},{"$f":"IF(AND(AC$16*1>=$R27,AC$16*1<=$D$8,$R27<$D$8,$P27>SUM($V27:AB27)),IF(SUM($P27*$U27/12,$V27:AB27)>$P27,$P27-SUM($V27:AB27),$P27*$U27/12),0)","v":{"v":0,"d":"0.00"}},{"$f":"IF(AND(AD$16*1>=$R27,AD$16*1<=$D$8,$R27<$D$8,$P27>SUM($V27:AC27)),IF(SUM($P27*$U27/12,$V27:AC27)>$P27,$P27-SUM($V27:AC27),$P27*$U27/12),0)","v":{"v":0,"d":"0.00"}},{"$f":"IF(AND(AE$16*1>=$R27,AE$16*1<=$D$8,$R27<$D$8,$P27>SUM($V27:AD27)),IF(SUM($P27*$U27/12,$V27:AD27)>$P27,$P27-SUM($V27:AD27),$P27*$U27/12),0)","v":{"v":0,"d":"0.00"}},{"$f":"IF(AND(AF$16*1>=$R27,AF$16*1<=$D$8,$R27<$D$8,$P27>SUM($V27:AE27)),IF(SUM($P27*$U27/12,$V27:AE27)>$P27,$P27-SUM($V27:AE27),$P27*$U27/12),0)","v":{"v":0,"d":"0.00"}},{"$f":"IF(AND(AG$16*1>=$R27,AG$16*1<=$D$8,$R27<$D$8,$P27>SUM($V27:AF27)),IF(SUM($P27*$U27/12,$V27:AF27)>$P27,$P27-SUM($V27:AF27),$P27*$U27/12),0)","v":{"v":0,"d":"0.00"}},{"$f":"IF(AND(AH$16*1>=$R27,AH$16*1<=$D$8,$R27<$D$8,$P27>SUM($V27:AG27)),IF(SUM($P27*$U27/12,$V27:AG27)>$P27,$P27-SUM($V27:AG27),$P27*$U27/12),0)","v":{"v":0,"d":"0.00"}},{"v":0,"d":"0.00"},null,null,{"v":2832.34,"d":"2,832.34"},null,{"v":2832.34,"d":"2,832.34"}]
[null,null,12,"335111","2 LLAVES, CAJA MOLDEADA",{"$nulls":3},1383.66,{"$nulls":4},1383.66,null,{"v":1383.66,"d":"1,383.66"},"2004-11-15","2004-12-01",null,null,{"v":0.1,"d":"10%"},{"v":1383.66,"d":"1,383.66"},{"$f":"IF(AND(W$16*1>=$R28,W$16*1<=$D$8,$R28<$D$8,$P28>SUM($V28:V28)),IF(SUM($P28*$U28/12,$V28:V28)>$P28,$P28-SUM($V28:V28),$P28*$U28/12),0)","v":{"v":0,"d":"0.00"}},{"$f":"IF(AND(X$16*1>=$R28,X$16*1<=$D$8,$R28<$D$8,$P28>SUM($V28:W28)),IF(SUM($P28*$U28/12,$V28:W28)>$P28,$P28-SUM($V28:W28),$P28*$U28/12),0)","v":{"v":0,"d":"0.00"}},{"$f":"IF(AND(Y$16*1>=$R28,Y$16*1<=$D$8,$R28<$D$8,$P28>SUM($V28:X28)),IF(SUM($P28*$U28/12,$V28:X28)>$P28,$P28-SUM($V28:X28),$P28*$U28/12),0)","v":{"v":0,"d":"0.00"}},{"$f":"IF(AND(Z$16*1>=$R28,Z$16*1<=$D$8,$R28<$D$8,$P28>SUM($V28:Y28)),IF(SUM($P28*$U28/12,$V28:Y28)>$P28,$P28-SUM($V28:Y28),$P28*$U28/12),0)","v":{"v":0,"d":"0.00"}},{"$f":"IF(AND(AA$16*1>=$R28,AA$16*1<=$D$8,$R28<$D$8,$P28>SUM($V28:Z28)),IF(SUM($P28*$U28/12,$V28:Z28)>$P28,$P28-SUM($V28:Z28),$P28*$U28/12),0)","v":{"v":0,"d":"0.00"}},{"$f":"IF(AND(AB$16*1>=$R28,AB$16*1<=$D$8,$R28<$D$8,$P28>SUM($V28:AA28)),IF(SUM($P28*$U28/12,$V28:AA28)>$P28,$P28-SUM($V28:AA28),$P28*$U28/12),0)","v":{"v":0,"d":"0.00"}},{"$f":"IF(AND(AC$16*1>=$R28,AC$16*1<=$D$8,$R28<$D$8,$P28>SUM($V28:AB28)),IF(SUM($P28*$U28/12,$V28:AB28)>$P28,$P28-SUM($V28:AB28),$P28*$U28/12),0)","v":{"v":0,"d":"0.00"}},{"$f":"IF(AND(AD$16*1>=$R28,AD$16*1<=$D$8,$R28<$D$8,$P28>SUM($V28:AC28)),IF(SUM($P28*$U28/12,$V28:AC28)>$P28,$P28-SUM($V28:AC28),$P28*$U28/12),0)","v":{"v":0,"d":"0.00"}},{"$f":"IF(AND(AE$16*1>=$R28,AE$16*1<=$D$8,$R28<$D$8,$P28>SUM($V28:AD28)),IF(SUM($P28*$U28/12,$V28:AD28)>$P28,$P28-SUM($V28:AD28),$P28*$U28/12),0)","v":{"v":0,"d":"0.00"}},{"$f":"IF(AND(AF$16*1>=$R28,AF$16*1<=$D$8,$R28<$D$8,$P28>SUM($V28:AE28)),IF(SUM($P28*$U28/12,$V28:AE28)>$P28,$P28-SUM($V28:AE28),$P28*$U28/12),0)","v":{"v":0,"d":"0.00"}},{"$f":"IF(AND(AG$16*1>=$R28,AG$16*1<=$D$8,$R28<$D$8,$P28>SUM($V28:AF28)),IF(SUM($P28*$U28/12,$V28:AF28)>$P28,$P28-SUM($V28:AF28),$P28*$U28/12),0)","v":{"v":0,"d":"0.00"}},{"$f":"IF(AND(AH$16*1>=$R28,AH$16*1<=$D$8,$R28<$D$8,$P28>SUM($V28:AG28)),IF(SUM($P28*$U28/12,$V28:AG28)>$P28,$P28-SUM($V28:AG28),$P28*$U28/12),0)","v":{"v":0,"d":"0.00"}},{"v":0,"d":"0.00"},null,null,{"v":1383.66,"d":"1,383.66"},null,{"v":1383.66,"d":"1,383.66"}]
[null,null,13,"335111","SALA GENOVA CUERINA CREMA 3-2-1",{"$nulls":3},3752.16,{"$nulls":4},3752.16,null,{"v":3752.16,"d":"3,752.16"},"2004-11-25","2004-12-01",null,null,{"v":0.1,"d":"10%"},{"v":3752.16,"d":"3,752.16"},{"$f":"IF(AND(W$16*1>=$R29,W$16*1<=$D$8,$R29<$D$8,$P29>SUM($V29:V29)),IF(SUM($P29*$U29/12,$V29:V29)>$P29,$P29-SUM($V29:V29),$P29*$U29/12),0)","v":{"v":0,"d":"0.00"}},{"$f":"IF(AND(X$16*1>=$R29,X$16*1<=$D$8,$R29<$D$8,$P29>SUM($V29:W29)),IF(SUM($P29*$U29/12,$V29:W29)>$P29,$P29-SUM($V29:W29),$P29*$U29/12),0)","v":{"v":0,"d":"0.00"}},{"$f":"IF(AND(Y$16*1>=$R29,Y$16*1<=$D$8,$R29<$D$8,$P29>SUM($V29:X29)),IF(SUM($P29*$U29/12,$V29:X29)>$P29,$P29-SUM($V29:X29),$P29*$U29/12),0)","v":{"v":0,"d":"0.00"}},{"$f":"IF(AND(Z$16*1>=$R29,Z$16*1<=$D$8,$R29<$D$8,$P29>SUM($V29:Y29)),IF(SUM($P29*$U29/12,$V29:Y29)>$P29,$P29-SUM($V29:Y29),$P29*$U29/12),0)","v":{"v":0,"d":"0.00"}},{"$f":"IF(AND(AA$16*1>=$R29,AA$16*1<=$D$8,$R29<$D$8,$P29>SUM($V29:Z29)),IF(SUM($P29*$U29/12,$V29:Z29)>$P29,$P29-SUM($V29:Z29),$P29*$U29/12),0)","v":{"v":0,"d":"0.00"}},{"$f":"IF(AND(AB$16*1>=$R29,AB$16*1<=$D$8,$R29<$D$8,$P29>SUM($V29:AA29)),IF(SUM($P29*$U29/12,$V29:AA29)>$P29,$P29-SUM($V29:AA29),$P29*$U29/12),0)","v":{"v":0,"d":"0.00"}},{"$f":"IF(AND(AC$16*1>=$R29,AC$16*1<=$D$8,$R29<$D$8,$P29>SUM($V29:AB29)),IF(SUM($P29*$U29/12,$V29:AB29)>$P29,$P29-SUM($V29:AB29),$P29*$U29/12),0)","v":{"v":0,"d":"0.00"}},{"$f":"IF(AND(AD$16*1>=$R29,AD$16*1<=$D$8,$R29<$D$8,$P29>SUM($V29:AC29)),IF(SUM($P29*$U29/12,$V29:AC29)>$P29,$P29-SUM($V29:AC29),$P29*$U29/12),0)","v":{"v":0,"d":"0.00"}},{"$f":"IF(AND(AE$16*1>=$R29,AE$16*1<=$D$8,$R29<$D$8,$P29>SUM($V29:AD29)),IF(SUM($P29*$U29/12,$V29:AD29)>$P29,$P29-SUM($V29:AD29),$P29*$U29/12),0)","v":{"v":0,"d":"0.00"}},{"$f":"IF(AND(AF$16*1>=$R29,AF$16*1<=$D$8,$R29<$D$8,$P29>SUM($V29:AE29)),IF(SUM($P29*$U29/12,$V29:AE29)>$P29,$P29-SUM($V29:AE29),$P29*$U29/12),0)","v":{"v":0,"d":"0.00"}},{"$f":"IF(AND(AG$16*1>=$R29,AG$16*1<=$D$8,$R29<$D$8,$P29>SUM($V29:AF29)),IF(SUM($P29*$U29/12,$V29:AF29)>$P29,$P29-SUM($V29:AF29),$P29*$U29/12),0)","v":{"v":0,"d":"0.00"}},{"$f":"IF(AND(AH$16*1>=$R29,AH$16*1<=$D$8,$R29<$D$8,$P29>SUM($V29:AG29)),IF(SUM($P29*$U29/12,$V29:AG29)>$P29,$P29-SUM($V29:AG29),$P29*$U29/12),0)","v":{"v":0,"d":"0.00"}},{"v":0,"d":"0.00"},null,null,{"v":3752.16,"d":"3,752.16"},null,{"v":3752.16,"d":"3,752.16"}]
[null,null,14,"335111","PUERTA METALICA",{"$nulls":3},907.96,{"$nulls":4},907.96,null,907.96,"2004-12-14","2005-01-01",null,null,{"v":0.1,"d":"10%"},907.96,{"$f":"IF(AND(W$16*1>=$R30,W$16*1<=$D$8,$R30<$D$8,$P30>SUM($V30:V30)),IF(SUM($P30*$U30/12,$V30:V30)>$P30,$P30-SUM($V30:V30),$P30*$U30/12),0)","v":{"v":0,"d":"0.00"}},{"$f":"IF(AND(X$16*1>=$R30,X$16*1<=$D$8,$R30<$D$8,$P30>SUM($V30:W30)),IF(SUM($P30*$U30/12,$V30:W30)>$P30,$P30-SUM($V30:W30),$P30*$U30/12),0)","v":{"v":0,"d":"0.00"}},{"$f":"IF(AND(Y$16*1>=$R30,Y$16*1<=$D$8,$R30<$D$8,$P30>SUM($V30:X30)),IF(SUM($P30*$U30/12,$V30:X30)>$P30,$P30-SUM($V30:X30),$P30*$U30/12),0)","v":{"v":0,"d":"0.00"}},{"$f":"IF(AND(Z$16*1>=$R30,Z$16*1<=$D$8,$R30<$D$8,$P30>SUM($V30:Y30)),IF(SUM($P30*$U30/12,$V30:Y30)>$P30,$P30-SUM($V30:Y30),$P30*$U30/12),0)","v":{"v":0,"d":"0.00"}},{"$f":"IF(AND(AA$16*1>=$R30,AA$16*1<=$D$8,$R30<$D$8,$P30>SUM($V30:Z30)),IF(SUM($P30*$U30/12,$V30:Z30)>$P30,$P30-SUM($V30:Z30),$P30*$U30/12),0)","v":{"v":0,"d":"0.00"}},{"$f":"IF(AND(AB$16*1>=$R30,AB$16*1<=$D$8,$R30<$D$8,$P30>SUM($V30:AA30)),IF(SUM($P30*$U30/12,$V30:AA30)>$P30,$P30-SUM($V30:AA30),$P30*$U30/12),0)","v":{"v":0,"d":"0.00"}},{"$f":"IF(AND(AC$16*1>=$R30,AC$16*1<=$D$8,$R30<$D$8,$P30>SUM($V30:AB30)),IF(SUM($P30*$U30/12,$V30:AB30)>$P30,$P30-SUM($V30:AB30),$P30*$U30/12),0)","v":{"v":0,"d":"0.00"}},{"$f":"IF(AND(AD$16*1>=$R30,AD$16*1<=$D$8,$R30<$D$8,$P30>SUM($V30:AC30)),IF(SUM($P30*$U30/12,$V30:AC30)>$P30,$P30-SUM($V30:AC30),$P30*$U30/12),0)","v":{"v":0,"d":"0.00"}},{"$f":"IF(AND(AE$16*1>=$R30,AE$16*1<=$D$8,$R30<$D$8,$P30>SUM($V30:AD30)),IF(SUM($P30*$U30/12,$V30:AD30)>$P30,$P30-SUM($V30:AD30),$P30*$U30/12),0)","v":{"v":0,"d":"0.00"}},{"$f":"IF(AND(AF$16*1>=$R30,AF$16*1<=$D$8,$R30<$D$8,$P30>SUM($V30:AE30)),IF(SUM($P30*$U30/12,$V30:AE30)>$P30,$P30-SUM($V30:AE30),$P30*$U30/12),0)","v":{"v":0,"d":"0.00"}},{"$f":"IF(AND(AG$16*1>=$R30,AG$16*1<=$D$8,$R30<$D$8,$P30>SUM($V30:AF30)),IF(SUM($P30*$U30/12,$V30:AF30)>$P30,$P30-SUM($V30:AF30),$P30*$U30/12),0)","v":{"v":0,"d":"0.00"}},{"$f":"IF(AND(AH$16*1>=$R30,AH$16*1<=$D$8,$R30<$D$8,$P30>SUM($V30:AG30)),IF(SUM($P30*$U30/12,$V30:AG30)>$P30,$P30-SUM($V30:AG30),$P30*$U30/12),0)","v":{"v":0,"d":"0.00"}},{"v":0,"d":"0.00"},null,null,907.96,null,907.96]
[null,null,15,"335111","MAMPARA FIERRO",{"$nulls":3},1471.89,{"$nulls":4},1471.89,null,{"v":1471.89,"d":"1,471.89"},"2005-01-15","2005-02-01",null,null,{"v":0.1,"d":"10%"},{"v":1471.89,"d":"1,471.89"},{"$f":"IF(AND(W$16*1>=$R31,W$16*1<=$D$8,$R31<$D$8,$P31>SUM($V31:V31)),IF(SUM($P31*$U31/12,$V31:V31)>$P31,$P31-SUM($V31:V31),$P31*$U31/12),0)","v":{"v":0,"d":"0.00"}},{"$f":"IF(AND(X$16*1>=$R31,X$16*1<=$D$8,$R31<$D$8,$P31>SUM($V31:W31)),IF(SUM($P31*$U31/12,$V31:W31)>$P31,$P31-SUM($V31:W31),$P31*$U31/12),0)","v":{"v":0,"d":"0.00"}},{"$f":"IF(AND(Y$16*1>=$R31,Y$16*1<=$D$8,$R31<$D$8,$P31>SUM($V31:X31)),IF(SUM($P31*$U31/12,$V31:X31)>$P31,$P31-SUM($V31:X31),$P31*$U31/12),0)","v":{"v":0,"d":"0.00"}},{"$f":"IF(AND(Z$16*1>=$R31,Z$16*1<=$D$8,$R31<$D$8,$P31>SUM($V31:Y31)),IF(SUM($P31*$U31/12,$V31:Y31)>$P31,$P31-SUM($V31:Y31),$P31*$U31/12),0)","v":{"v":0,"d":"0.00"}},{"$f":"IF(AND(AA$16*1>=$R31,AA$16*1<=$D$8,$R31<$D$8,$P31>SUM($V31:Z31)),IF(SUM($P31*$U31/12,$V31:Z31)>$P31,$P31-SUM($V31:Z31),$P31*$U31/12),0)","v":{"v":0,"d":"0.00"}},{"$f":"IF(AND(AB$16*1>=$R31,AB$16*1<=$D$8,$R31<$D$8,$P31>SUM($V31:AA31)),IF(SUM($P31*$U31/12,$V31:AA31)>$P31,$P31-SUM($V31:AA31),$P31*$U31/12),0)","v":{"v":0,"d":"0.00"}},{"$f":"IF(AND(AC$16*1>=$R31,AC$16*1<=$D$8,$R31<$D$8,$P31>SUM($V31:AB31)),IF(SUM($P31*$U31/12,$V31:AB31)>$P31,$P31-SUM($V31:AB31),$P31*$U31/12),0)","v":{"v":0,"d":"0.00"}},{"$f":"IF(AND(AD$16*1>=$R31,AD$16*1<=$D$8,$R31<$D$8,$P31>SUM($V31:AC31)),IF(SUM($P31*$U31/12,$V31:AC31)>$P31,$P31-SUM($V31:AC31),$P31*$U31/12),0)","v":{"v":0,"d":"0.00"}},{"$f":"IF(AND(AE$16*1>=$R31,AE$16*1<=$D$8,$R31<$D$8,$P31>SUM($V31:AD31)),IF(SUM($P31*$U31/12,$V31:AD31)>$P31,$P31-SUM($V31:AD31),$P31*$U31/12),0)","v":{"v":0,"d":"0.00"}},{"$f":"IF(AND(AF$16*1>=$R31,AF$16*1<=$D$8,$R31<$D$8,$P31>SUM($V31:AE31)),IF(SUM($P31*$U31/12,$V31:AE31)>$P31,$P31-SUM($V31:AE31),$P31*$U31/12),0)","v":{"v":0,"d":"0.00"}},{"$f":"IF(AND(AG$16*1>=$R31,AG$16*1<=$D$8,$R31<$D$8,$P31>SUM($V31:AF31)),IF(SUM($P31*$U31/12,$V31:AF31)>$P31,$P31-SUM($V31:AF31),$P31*$U31/12),0)","v":{"v":0,"d":"0.00"}},{"$f":"IF(AND(AH$16*1>=$R31,AH$16*1<=$D$8,$R31<$D$8,$P31>SUM($V31:AG31)),IF(SUM($P31*$U31/12,$V31:AG31)>$P31,$P31-SUM($V31:AG31),$P31*$U31/12),0)","v":{"v":0,"d":"0.00"}},{"v":0,"d":"0.00"},null,null,{"v":1471.89,"d":"1,471.89"},null,{"v":1471.89,"d":"1,471.89"}]
[null,null,16,"335111","ESCRITORIO DIRECCIONAL CF",{"$nulls":3},5341.74,{"$nulls":4},5341.74,null,{"v":5341.74,"d":"5,341.74"},"2005-01-22","2005-02-01",null,null,{"v":0.1,"d":"10%"},{"v":5341.74,"d":"5,341.74"},{"$f":"IF(AND(W$16*1>=$R32,W$16*1<=$D$8,$R32<$D$8,$P32>SUM($V32:V32)),IF(SUM($P32*$U32/12,$V32:V32)>$P32,$P32-SUM($V32:V32),$P32*$U32/12),0)","v":{"v":0,"d":"0.00"}},{"$f":"IF(AND(X$16*1>=$R32,X$16*1<=$D$8,$R32<$D$8,$P32>SUM($V32:W32)),IF(SUM($P32*$U32/12,$V32:W32)>$P32,$P32-SUM($V32:W32),$P32*$U32/12),0)","v":{"v":0,"d":"0.00"}},{"$f":"IF(AND(Y$16*1>=$R32,Y$16*1<=$D$8,$R32<$D$8,$P32>SUM($V32:X32)),IF(SUM($P32*$U32/12,$V32:X32)>$P32,$P32-SUM($V32:X32),$P32*$U32/12),0)","v":{"v":0,"d":"0.00"}},{"$f":"IF(AND(Z$16*1>=$R32,Z$16*1<=$D$8,$R32<$D$8,$P32>SUM($V32:Y32)),IF(SUM($P32*$U32/12,$V32:Y32)>$P32,$P32-SUM($V32:Y32),$P32*$U32/12),0)","v":{"v":0,"d":"0.00"}},{"$f":"IF(AND(AA$16*1>=$R32,AA$16*1<=$D$8,$R32<$D$8,$P32>SUM($V32:Z32)),IF(SUM($P32*$U32/12,$V32:Z32)>$P32,$P32-SUM($V32:Z32),$P32*$U32/12),0)","v":{"v":0,"d":"0.00"}},{"$f":"IF(AND(AB$16*1>=$R32,AB$16*1<=$D$8,$R32<$D$8,$P32>SUM($V32:AA32)),IF(SUM($P32*$U32/12,$V32:AA32)>$P32,$P32-SUM($V32:AA32),$P32*$U32/12),0)","v":{"v":0,"d":"0.00"}},{"$f":"IF(AND(AC$16*1>=$R32,AC$16*1<=$D$8,$R32<$D$8,$P32>SUM($V32:AB32)),IF(SUM($P32*$U32/12,$V32:AB32)>$P32,$P32-SUM($V32:AB32),$P32*$U32/12),0)","v":{"v":0,"d":"0.00"}},{"$f":"IF(AND(AD$16*1>=$R32,AD$16*1<=$D$8,$R32<$D$8,$P32>SUM($V32:AC32)),IF(SUM($P32*$U32/12,$V32:AC32)>$P32,$P32-SUM($V32:AC32),$P32*$U32/12),0)","v":{"v":0,"d":"0.00"}},{"$f":"IF(AND(AE$16*1>=$R32,AE$16*1<=$D$8,$R32<$D$8,$P32>SUM($V32:AD32)),IF(SUM($P32*$U32/12,$V32:AD32)>$P32,$P32-SUM($V32:AD32),$P32*$U32/12),0)","v":{"v":0,"d":"0.00"}},{"$f":"IF(AND(AF$16*1>=$R32,AF$16*1<=$D$8,$R32<$D$8,$P32>SUM($V32:AE32)),IF(SUM($P32*$U32/12,$V32:AE32)>$P32,$P32-SUM($V32:AE32),$P32*$U32/12),0)","v":{"v":0,"d":"0.00"}},{"$f":"IF(AND(AG$16*1>=$R32,AG$16*1<=$D$8,$R32<$D$8,$P32>SUM($V32:AF32)),IF(SUM($P32*$U32/12,$V32:AF32)>$P32,$P32-SUM($V32:AF32),$P32*$U32/12),0)","v":{"v":0,"d":"0.00"}},{"$f":"IF(AND(AH$16*1>=$R32,AH$16*1<=$D$8,$R32<$D$8,$P32>SUM($V32:AG32)),IF(SUM($P32*$U32/12,$V32:AG32)>$P32,$P32-SUM($V32:AG32),$P32*$U32/12),0)","v":{"v":0,"d":"0.00"}},{"v":0,"d":"0.00"},null,null,{"v":5341.74,"d":"5,341.74"},null,{"v":5341.74,"d":"5,341.74"}]
[null,null,17,"335111","CREDENZA CORTA CF",{"$nulls":3},2653.87,{"$nulls":4},2653.87,null,{"v":2653.87,"d":"2,653.87"},"2005-01-22","2005-02-01",null,null,{"v":0.1,"d":"10%"},{"v":2653.87,"d":"2,653.87"},{"$f":"IF(AND(W$16*1>=$R33,W$16*1<=$D$8,$R33<$D$8,$P33>SUM($V33:V33)),IF(SUM($P33*$U33/12,$V33:V33)>$P33,$P33-SUM($V33:V33),$P33*$U33/12),0)","v":{"v":0,"d":"0.00"}},{"$f":"IF(AND(X$16*1>=$R33,X$16*1<=$D$8,$R33<$D$8,$P33>SUM($V33:W33)),IF(SUM($P33*$U33/12,$V33:W33)>$P33,$P33-SUM($V33:W33),$P33*$U33/12),0)","v":{"v":0,"d":"0.00"}},{"$f":"IF(AND(Y$16*1>=$R33,Y$16*1<=$D$8,$R33<$D$8,$P33>SUM($V33:X33)),IF(SUM($P33*$U33/12,$V33:X33)>$P33,$P33-SUM($V33:X33),$P33*$U33/12),0)","v":{"v":0,"d":"0.00"}},{"$f":"IF(AND(Z$16*1>=$R33,Z$16*1<=$D$8,$R33<$D$8,$P33>SUM($V33:Y33)),IF(SUM($P33*$U33/12,$V33:Y33)>$P33,$P33-SUM($V33:Y33),$P33*$U33/12),0)","v":{"v":0,"d":"0.00"}},{"$f":"IF(AND(AA$16*1>=$R33,AA$16*1<=$D$8,$R33<$D$8,$P33>SUM($V33:Z33)),IF(SUM($P33*$U33/12,$V33:Z33)>$P33,$P33-SUM($V33:Z33),$P33*$U33/12),0)","v":{"v":0,"d":"0.00"}},{"$f":"IF(AND(AB$16*1>=$R33,AB$16*1<=$D$8,$R33<$D$8,$P33>SUM($V33:AA33)),IF(SUM($P33*$U33/12,$V33:AA33)>$P33,$P33-SUM($V33:AA33),$P33*$U33/12),0)","v":{"v":0,"d":"0.00"}},{"$f":"IF(AND(AC$16*1>=$R33,AC$16*1<=$D$8,$R33<$D$8,$P33>SUM($V33:AB33)),IF(SUM($P33*$U33/12,$V33:AB33)>$P33,$P33-SUM($V33:AB33),$P33*$U33/12),0)","v":{"v":0,"d":"0.00"}},{"$f":"IF(AND(AD$16*1>=$R33,AD$16*1<=$D$8,$R33<$D$8,$P33>SUM($V33:AC33)),IF(SUM($P33*$U33/12,$V33:AC33)>$P33,$P33-SUM($V33:AC33),$P33*$U33/12),0)","v":{"v":0,"d":"0.00"}},{"$f":"IF(AND(AE$16*1>=$R33,AE$16*1<=$D$8,$R33<$D$8,$P33>SUM($V33:AD33)),IF(SUM($P33*$U33/12,$V33:AD33)>$P33,$P33-SUM($V33:AD33),$P33*$U33/12),0)","v":{"v":0,"d":"0.00"}},{"$f":"IF(AND(AF$16*1>=$R33,AF$16*1<=$D$8,$R33<$D$8,$P33>SUM($V33:AE33)),IF(SUM($P33*$U33/12,$V33:AE33)>$P33,$P33-SUM($V33:AE33),$P33*$U33/12),0)","v":{"v":0,"d":"0.00"}},{"$f":"IF(AND(AG$16*1>=$R33,AG$16*1<=$D$8,$R33<$D$8,$P33>SUM($V33:AF33)),IF(SUM($P33*$U33/12,$V33:AF33)>$P33,$P33-SUM($V33:AF33),$P33*$U33/12),0)","v":{"v":0,"d":"0.00"}},{"$f":"IF(AND(AH$16*1>=$R33,AH$16*1<=$D$8,$R33<$D$8,$P33>SUM($V33:AG33)),IF(SUM($P33*$U33/12,$V33:AG33)>$P33,$P33-SUM($V33:AG33),$P33*$U33/12),0)","v":{"v":0,"d":"0.00"}},{"v":0,"d":"0.00"},null,null,{"v":2653.87,"d":"2,653.87"},null,{"v":2653.87,"d":"2,653.87"}]
[null,null,18,"335111","ESCRITORIO AUXILIAR CF",{"$nulls":3},2194.53,{"$nulls":4},2194.53,null,{"v":2194.53,"d":"2,194.53"},"2005-01-22","2005-02-01",null,null,{"v":0.1,"d":"10%"},{"v":2194.53,"d":"2,194.53"},{"$f":"IF(AND(W$16*1>=$R34,W$16*1<=$D$8,$R34<$D$8,$P34>SUM($V34:V34)),IF(SUM($P34*$U34/12,$V34:V34)>$P34,$P34-SUM($V34:V34),$P34*$U34/12),0)","v":{"v":0,"d":"0.00"}},{"$f":"IF(AND(X$16*1>=$R34,X$16*1<=$D$8,$R34<$D$8,$P34>SUM($V34:W34)),IF(SUM($P34*$U34/12,$V34:W34)>$P34,$P34-SUM($V34:W34),$P34*$U34/12),0)","v":{"v":0,"d":"0.00"}},{"$f":"IF(AND(Y$16*1>=$R34,Y$16*1<=$D$8,$R34<$D$8,$P34>SUM($V34:X34)),IF(SUM($P34*$U34/12,$V34:X34)>$P34,$P34-SUM($V34:X34),$P34*$U34/12),0)","v":{"v":0,"d":"0.00"}},{"$f":"IF(AND(Z$16*1>=$R34,Z$16*1<=$D$8,$R34<$D$8,$P34>SUM($V34:Y34)),IF(SUM($P34*$U34/12,$V34:Y34)>$P34,$P34-SUM($V34:Y34),$P34*$U34/12),0)","v":{"v":0,"d":"0.00"}},{"$f":"IF(AND(AA$16*1>=$R34,AA$16*1<=$D$8,$R34<$D$8,$P34>SUM($V34:Z34)),IF(SUM($P34*$U34/12,$V34:Z34)>$P34,$P34-SUM($V34:Z34),$P34*$U34/12),0)","v":{"v":0,"d":"0.00"}},{"$f":"IF(AND(AB$16*1>=$R34,AB$16*1<=$D$8,$R34<$D$8,$P34>SUM($V34:AA34)),IF(SUM($P34*$U34/12,$V34:AA34)>$P34,$P34-SUM($V34:AA34),$P34*$U34/12),0)","v":{"v":0,"d":"0.00"}},{"$f":"IF(AND(AC$16*1>=$R34,AC$16*1<=$D$8,$R34<$D$8,$P34>SUM($V34:AB34)),IF(SUM($P34*$U34/12,$V34:AB34)>$P34,$P34-SUM($V34:AB34),$P34*$U34/12),0)","v":{"v":0,"d":"0.00"}},{"$f":"IF(AND(AD$16*1>=$R34,AD$16*1<=$D$8,$R34<$D$8,$P34>SUM($V34:AC34)),IF(SUM($P34*$U34/12,$V34:AC34)>$P34,$P34-SUM($V34:AC34),$P34*$U34/12),0)","v":{"v":0,"d":"0.00"}},{"$f":"IF(AND(AE$16*1>=$R34,AE$16*1<=$D$8,$R34<$D$8,$P34>SUM($V34:AD34)),IF(SUM($P34*$U34/12,$V34:AD34)>$P34,$P34-SUM($V34:AD34),$P34*$U34/12),0)","v":{"v":0,"d":"0.00"}},{"$f":"IF(AND(AF$16*1>=$R34,AF$16*1<=$D$8,$R34<$D$8,$P34>SUM($V34:AE34)),IF(SUM($P34*$U34/12,$V34:AE34)>$P34,$P34-SUM($V34:AE34),$P34*$U34/12),0)","v":{"v":0,"d":"0.00"}},{"$f":"IF(AND(AG$16*1>=$R34,AG$16*1<=$D$8,$R34<$D$8,$P34>SUM($V34:AF34)),IF(SUM($P34*$U34/12,$V34:AF34)>$P34,$P34-SUM($V34:AF34),$P34*$U34/12),0)","v":{"v":0,"d":"0.00"}},{"$f":"IF(AND(AH$16*1>=$R34,AH$16*1<=$D$8,$R34<$D$8,$P34>SUM($V34:AG34)),IF(SUM($P34*$U34/12,$V34:AG34)>$P34,$P34-SUM($V34:AG34),$P34*$U34/12),0)","v":{"v":0,"d":"0.00"}},{"v":0,"d":"0.00"},null,null,{"v":2194.53,"d":"2,194.53"},null,{"v":2194.53,"d":"2,194.53"}]
[null,null,19,"335111","2 SILLONES NEGROS DIRECTORIO",{"$nulls":3},919.66,{"$nulls":4},919.66,null,919.66,"2005-03-26","2005-04-01",null,null,{"v":0.1,"d":"10%"},919.66,{"$f":"IF(AND(W$16*1>=$R35,W$16*1<=$D$8,$R35<$D$8,$P35>SUM($V35:V35)),IF(SUM($P35*$U35/12,$V35:V35)>$P35,$P35-SUM($V35:V35),$P35*$U35/12),0)","v":{"v":0,"d":"0.00"}},{"$f":"IF(AND(X$16*1>=$R35,X$16*1<=$D$8,$R35<$D$8,$P35>SUM($V35:W35)),IF(SUM($P35*$U35/12,$V35:W35)>$P35,$P35-SUM($V35:W35),$P35*$U35/12),0)","v":{"v":0,"d":"0.00"}},{"$f":"IF(AND(Y$16*1>=$R35,Y$16*1<=$D$8,$R35<$D$8,$P35>SUM($V35:X35)),IF(SUM($P35*$U35/12,$V35:X35)>$P35,$P35-SUM($V35:X35),$P35*$U35/12),0)","v":{"v":0,"d":"0.00"}},{"$f":"IF(AND(Z$16*1>=$R35,Z$16*1<=$D$8,$R35<$D$8,$P35>SUM($V35:Y35)),IF(SUM($P35*$U35/12,$V35:Y35)>$P35,$P35-SUM($V35:Y35),$P35*$U35/12),0)","v":{"v":0,"d":"0.00"}},{"$f":"IF(AND(AA$16*1>=$R35,AA$16*1<=$D$8,$R35<$D$8,$P35>SUM($V35:Z35)),IF(SUM($P35*$U35/12,$V35:Z35)>$P35,$P35-SUM($V35:Z35),$P35*$U35/12),0)","v":{"v":0,"d":"0.00"}},{"$f":"IF(AND(AB$16*1>=$R35,AB$16*1<=$D$8,$R35<$D$8,$P35>SUM($V35:AA35)),IF(SUM($P35*$U35/12,$V35:AA35)>$P35,$P35-SUM($V35:AA35),$P35*$U35/12),0)","v":{"v":0,"d":"0.00"}},{"$f":"IF(AND(AC$16*1>=$R35,AC$16*1<=$D$8,$R35<$D$8,$P35>SUM($V35:AB35)),IF(SUM($P35*$U35/12,$V35:AB35)>$P35,$P35-SUM($V35:AB35),$P35*$U35/12),0)","v":{"v":0,"d":"0.00"}},{"$f":"IF(AND(AD$16*1>=$R35,AD$16*1<=$D$8,$R35<$D$8,$P35>SUM($V35:AC35)),IF(SUM($P35*$U35/12,$V35:AC35)>$P35,$P35-SUM($V35:AC35),$P35*$U35/12),0)","v":{"v":0,"d":"0.00"}},{"$f":"IF(AND(AE$16*1>=$R35,AE$16*1<=$D$8,$R35<$D$8,$P35>SUM($V35:AD35)),IF(SUM($P35*$U35/12,$V35:AD35)>$P35,$P35-SUM($V35:AD35),$P35*$U35/12),0)","v":{"v":0,"d":"0.00"}},{"$f":"IF(AND(AF$16*1>=$R35,AF$16*1<=$D$8,$R35<$D$8,$P35>SUM($V35:AE35)),IF(SUM($P35*$U35/12,$V35:AE35)>$P35,$P35-SUM($V35:AE35),$P35*$U35/12),0)","v":{"v":0,"d":"0.00"}},{"$f":"IF(AND(AG$16*1>=$R35,AG$16*1<=$D$8,$R35<$D$8,$P35>SUM($V35:AF35)),IF(SUM($P35*$U35/12,$V35:AF35)>$P35,$P35-SUM($V35:AF35),$P35*$U35/12),0)","v":{"v":0,"d":"0.00"}},{"$f":"IF(AND(AH$16*1>=$R35,AH$16*1<=$D$8,$R35<$D$8,$P35>SUM($V35:AG35)),IF(SUM($P35*$U35/12,$V35:AG35)>$P35,$P35-SUM($V35:AG35),$P35*$U35/12),0)","v":{"v":0,"d":"0.00"}},{"v":0,"d":"0.00"},null,null,919.66,null,919.66]
[null,null,20,"335111","8 SILLONES NEGROS DIRECTORIO",{"$nulls":3},3638.41,{"$nulls":4},3638.41,null,{"v":3638.41,"d":"3,638.41"},"2005-03-30","2005-04-01",null,null,{"v":0.1,"d":"10%"},{"v":3638.41,"d":"3,638.41"},{"$f":"IF(AND(W$16*1>=$R36,W$16*1<=$D$8,$R36<$D$8,$P36>SUM($V36:V36)),IF(SUM($P36*$U36/12,$V36:V36)>$P36,$P36-SUM($V36:V36),$P36*$U36/12),0)","v":{"v":0,"d":"0.00"}},{"$f":"IF(AND(X$16*1>=$R36,X$16*1<=$D$8,$R36<$D$8,$P36>SUM($V36:W36)),IF(SUM($P36*$U36/12,$V36:W36)>$P36,$P36-SUM($V36:W36),$P36*$U36/12),0)","v":{"v":0,"d":"0.00"}},{"$f":"IF(AND(Y$16*1>=$R36,Y$16*1<=$D$8,$R36<$D$8,$P36>SUM($V36:X36)),IF(SUM($P36*$U36/12,$V36:X36)>$P36,$P36-SUM($V36:X36),$P36*$U36/12),0)","v":{"v":0,"d":"0.00"}},{"$f":"IF(AND(Z$16*1>=$R36,Z$16*1<=$D$8,$R36<$D$8,$P36>SUM($V36:Y36)),IF(SUM($P36*$U36/12,$V36:Y36)>$P36,$P36-SUM($V36:Y36),$P36*$U36/12),0)","v":{"v":0,"d":"0.00"}},{"$f":"IF(AND(AA$16*1>=$R36,AA$16*1<=$D$8,$R36<$D$8,$P36>SUM($V36:Z36)),IF(SUM($P36*$U36/12,$V36:Z36)>$P36,$P36-SUM($V36:Z36),$P36*$U36/12),0)","v":{"v":0,"d":"0.00"}},{"$f":"IF(AND(AB$16*1>=$R36,AB$16*1<=$D$8,$R36<$D$8,$P36>SUM($V36:AA36)),IF(SUM($P36*$U36/12,$V36:AA36)>$P36,$P36-SUM($V36:AA36),$P36*$U36/12),0)","v":{"v":0,"d":"0.00"}},{"$f":"IF(AND(AC$16*1>=$R36,AC$16*1<=$D$8,$R36<$D$8,$P36>SUM($V36:AB36)),IF(SUM($P36*$U36/12,$V36:AB36)>$P36,$P36-SUM($V36:AB36),$P36*$U36/12),0)","v":{"v":0,"d":"0.00"}},{"$f":"IF(AND(AD$16*1>=$R36,AD$16*1<=$D$8,$R36<$D$8,$P36>SUM($V36:AC36)),IF(SUM($P36*$U36/12,$V36:AC36)>$P36,$P36-SUM($V36:AC36),$P36*$U36/12),0)","v":{"v":0,"d":"0.00"}},{"$f":"IF(AND(AE$16*1>=$R36,AE$16*1<=$D$8,$R36<$D$8,$P36>SUM($V36:AD36)),IF(SUM($P36*$U36/12,$V36:AD36)>$P36,$P36-SUM($V36:AD36),$P36*$U36/12),0)","v":{"v":0,"d":"0.00"}},{"$f":"IF(AND(AF$16*1>=$R36,AF$16*1<=$D$8,$R36<$D$8,$P36>SUM($V36:AE36)),IF(SUM($P36*$U36/12,$V36:AE36)>$P36,$P36-SUM($V36:AE36),$P36*$U36/12),0)","v":{"v":0,"d":"0.00"}},{"$f":"IF(AND(AG$16*1>=$R36,AG$16*1<=$D$8,$R36<$D$8,$P36>SUM($V36:AF36)),IF(SUM($P36*$U36/12,$V36:AF36)>$P36,$P36-SUM($V36:AF36),$P36*$U36/12),0)","v":{"v":0,"d":"0.00"}},{"$f":"IF(AND(AH$16*1>=$R36,AH$16*1<=$D$8,$R36<$D$8,$P36>SUM($V36:AG36)),IF(SUM($P36*$U36/12,$V36:AG36)>$P36,$P36-SUM($V36:AG36),$P36*$U36/12),0)","v":{"v":0,"d":"0.00"}},{"v":0,"d":"0.00"},null,null,{"v":3638.41,"d":"3,638.41"},null,{"v":3638.41,"d":"3,638.41"}]
[null,null,21,"335111","REJAS METALICAS PUERTA CORREDIZA",{"$nulls":3},1385.3,{"$nulls":4},1385.3,null,{"v":1385.3,"d":"1,385.30"},"2005-05-07","2005-06-01",null,null,{"v":0.1,"d":"10%"},{"v":1385.3,"d":"1,385.30"},{"$f":"IF(AND(W$16*1>=$R37,W$16*1<=$D$8,$R37<$D$8,$P37>SUM($V37:V37)),IF(SUM($P37*$U37/12,$V37:V37)>$P37,$P37-SUM($V37:V37),$P37*$U37/12),0)","v":{"v":0,"d":"0.00"}},{"$f":"IF(AND(X$16*1>=$R37,X$16*1<=$D$8,$R37<$D$8,$P37>SUM($V37:W37)),IF(SUM($P37*$U37/12,$V37:W37)>$P37,$P37-SUM($V37:W37),$P37*$U37/12),0)","v":{"v":0,"d":"0.00"}},{"$f":"IF(AND(Y$16*1>=$R37,Y$16*1<=$D$8,$R37<$D$8,$P37>SUM($V37:X37)),IF(SUM($P37*$U37/12,$V37:X37)>$P37,$P37-SUM($V37:X37),$P37*$U37/12),0)","v":{"v":0,"d":"0.00"}},{"$f":"IF(AND(Z$16*1>=$R37,Z$16*1<=$D$8,$R37<$D$8,$P37>SUM($V37:Y37)),IF(SUM($P37*$U37/12,$V37:Y37)>$P37,$P37-SUM($V37:Y37),$P37*$U37/12),0)","v":{"v":0,"d":"0.00"}},{"$f":"IF(AND(AA$16*1>=$R37,AA$16*1<=$D$8,$R37<$D$8,$P37>SUM($V37:Z37)),IF(SUM($P37*$U37/12,$V37:Z37)>$P37,$P37-SUM($V37:Z37),$P37*$U37/12),0)","v":{"v":0,"d":"0.00"}},{"$f":"IF(AND(AB$16*1>=$R37,AB$16*1<=$D$8,$R37<$D$8,$P37>SUM($V37:AA37)),IF(SUM($P37*$U37/12,$V37:AA37)>$P37,$P37-SUM($V37:AA37),$P37*$U37/12),0)","v":{"v":0,"d":"0.00"}},{"$f":"IF(AND(AC$16*1>=$R37,AC$16*1<=$D$8,$R37<$D$8,$P37>SUM($V37:AB37)),IF(SUM($P37*$U37/12,$V37:AB37)>$P37,$P37-SUM($V37:AB37),$P37*$U37/12),0)","v":{"v":0,"d":"0.00"}},{"$f":"IF(AND(AD$16*1>=$R37,AD$16*1<=$D$8,$R37<$D$8,$P37>SUM($V37:AC37)),IF(SUM($P37*$U37/12,$V37:AC37)>$P37,$P37-SUM($V37:AC37),$P37*$U37/12),0)","v":{"v":0,"d":"0.00"}},{"$f":"IF(AND(AE$16*1>=$R37,AE$16*1<=$D$8,$R37<$D$8,$P37>SUM($V37:AD37)),IF(SUM($P37*$U37/12,$V37:AD37)>$P37,$P37-SUM($V37:AD37),$P37*$U37/12),0)","v":{"v":0,"d":"0.00"}},{"$f":"IF(AND(AF$16*1>=$R37,AF$16*1<=$D$8,$R37<$D$8,$P37>SUM($V37:AE37)),IF(SUM($P37*$U37/12,$V37:AE37)>$P37,$P37-SUM($V37:AE37),$P37*$U37/12),0)","v":{"v":0,"d":"0.00"}},{"$f":"IF(AND(AG$16*1>=$R37,AG$16*1<=$D$8,$R37<$D$8,$P37>SUM($V37:AF37)),IF(SUM($P37*$U37/12,$V37:AF37)>$P37,$P37-SUM($V37:AF37),$P37*$U37/12),0)","v":{"v":0,"d":"0.00"}},{"$f":"IF(AND(AH$16*1>=$R37,AH$16*1<=$D$8,$R37<$D$8,$P37>SUM($V37:AG37)),IF(SUM($P37*$U37/12,$V37:AG37)>$P37,$P37-SUM($V37:AG37),$P37*$U37/12),0)","v":{"v":0,"d":"0.00"}},{"v":0,"d":"0.00"},null,null,{"v":1385.3,"d":"1,385.30"},null,{"v":1385.3,"d":"1,385.30"}]
[null,null,22,"335111","MESA CEMENTO PULIDO DIRECTORIO",{"$nulls":3},1255.99,{"$nulls":4},1255.99,null,{"v":1255.99,"d":"1,255.99"},"2005-05-15","2005-06-01",null,null,{"v":0.1,"d":"10%"},{"v":1255.99,"d":"1,255.99"},{"$f":"IF(AND(W$16*1>=$R38,W$16*1<=$D$8,$R38<$D$8,$P38>SUM($V38:V38)),IF(SUM($P38*$U38/12,$V38:V38)>$P38,$P38-SUM($V38:V38),$P38*$U38/12),0)","v":{"v":0,"d":"0.00"}},{"$f":"IF(AND(X$16*1>=$R38,X$16*1<=$D$8,$R38<$D$8,$P38>SUM($V38:W38)),IF(SUM($P38*$U38/12,$V38:W38)>$P38,$P38-SUM($V38:W38),$P38*$U38/12),0)","v":{"v":0,"d":"0.00"}},{"$f":"IF(AND(Y$16*1>=$R38,Y$16*1<=$D$8,$R38<$D$8,$P38>SUM($V38:X38)),IF(SUM($P38*$U38/12,$V38:X38)>$P38,$P38-SUM($V38:X38),$P38*$U38/12),0)","v":{"v":0,"d":"0.00"}},{"$f":"IF(AND(Z$16*1>=$R38,Z$16*1<=$D$8,$R38<$D$8,$P38>SUM($V38:Y38)),IF(SUM($P38*$U38/12,$V38:Y38)>$P38,$P38-SUM($V38:Y38),$P38*$U38/12),0)","v":{"v":0,"d":"0.00"}},{"$f":"IF(AND(AA$16*1>=$R38,AA$16*1<=$D$8,$R38<$D$8,$P38>SUM($V38:Z38)),IF(SUM($P38*$U38/12,$V38:Z38)>$P38,$P38-SUM($V38:Z38),$P38*$U38/12),0)","v":{"v":0,"d":"0.00"}},{"$f":"IF(AND(AB$16*1>=$R38,AB$16*1<=$D$8,$R38<$D$8,$P38>SUM($V38:AA38)),IF(SUM($P38*$U38/12,$V38:AA38)>$P38,$P38-SUM($V38:AA38),$P38*$U38/12),0)","v":{"v":0,"d":"0.00"}},{"$f":"IF(AND(AC$16*1>=$R38,AC$16*1<=$D$8,$R38<$D$8,$P38>SUM($V38:AB38)),IF(SUM($P38*$U38/12,$V38:AB38)>$P38,$P38-SUM($V38:AB38),$P38*$U38/12),0)","v":{"v":0,"d":"0.00"}},{"$f":"IF(AND(AD$16*1>=$R38,AD$16*1<=$D$8,$R38<$D$8,$P38>SUM($V38:AC38)),IF(SUM($P38*$U38/12,$V38:AC38)>$P38,$P38-SUM($V38:AC38),$P38*$U38/12),0)","v":{"v":0,"d":"0.00"}},{"$f":"IF(AND(AE$16*1>=$R38,AE$16*1<=$D$8,$R38<$D$8,$P38>SUM($V38:AD38)),IF(SUM($P38*$U38/12,$V38:AD38)>$P38,$P38-SUM($V38:AD38),$P38*$U38/12),0)","v":{"v":0,"d":"0.00"}},{"$f":"IF(AND(AF$16*1>=$R38,AF$16*1<=$D$8,$R38<$D$8,$P38>SUM($V38:AE38)),IF(SUM($P38*$U38/12,$V38:AE38)>$P38,$P38-SUM($V38:AE38),$P38*$U38/12),0)","v":{"v":0,"d":"0.00"}},{"$f":"IF(AND(AG$16*1>=$R38,AG$16*1<=$D$8,$R38<$D$8,$P38>SUM($V38:AF38)),IF(SUM($P38*$U38/12,$V38:AF38)>$P38,$P38-SUM($V38:AF38),$P38*$U38/12),0)","v":{"v":0,"d":"0.00"}},{"$f":"IF(AND(AH$16*1>=$R38,AH$16*1<=$D$8,$R38<$D$8,$P38>SUM($V38:AG38)),IF(SUM($P38*$U38/12,$V38:AG38)>$P38,$P38-SUM($V38:AG38),$P38*$U38/12),0)","v":{"v":0,"d":"0.00"}},{"v":0,"d":"0.00"},null,null,{"v":1255.99,"d":"1,255.99"},null,{"v":1255.99,"d":"1,255.99"}]
[null,null,23,"335111","REJA METALICA VENTANA",{"$nulls":3},494.01,{"$nulls":4},494.01,null,494.01,"2006-03-25","2006-04-01",null,null,{"v":0.1,"d":"10%"},494.01,{"$f":"IF(AND(W$16*1>=$R39,W$16*1<=$D$8,$R39<$D$8,$P39>SUM($V39:V39)),IF(SUM($P39*$U39/12,$V39:V39)>$P39,$P39-SUM($V39:V39),$P39*$U39/12),0)","v":{"v":0,"d":"0.00"}},{"$f":"IF(AND(X$16*1>=$R39,X$16*1<=$D$8,$R39<$D$8,$P39>SUM($V39:W39)),IF(SUM($P39*$U39/12,$V39:W39)>$P39,$P39-SUM($V39:W39),$P39*$U39/12),0)","v":{"v":0,"d":"0.00"}},{"$f":"IF(AND(Y$16*1>=$R39,Y$16*1<=$D$8,$R39<$D$8,$P39>SUM($V39:X39)),IF(SUM($P39*$U39/12,$V39:X39)>$P39,$P39-SUM($V39:X39),$P39*$U39/12),0)","v":{"v":0,"d":"0.00"}},{"$f":"IF(AND(Z$16*1>=$R39,Z$16*1<=$D$8,$R39<$D$8,$P39>SUM($V39:Y39)),IF(SUM($P39*$U39/12,$V39:Y39)>$P39,$P39-SUM($V39:Y39),$P39*$U39/12),0)","v":{"v":0,"d":"0.00"}},{"$f":"IF(AND(AA$16*1>=$R39,AA$16*1<=$D$8,$R39<$D$8,$P39>SUM($V39:Z39)),IF(SUM($P39*$U39/12,$V39:Z39)>$P39,$P39-SUM($V39:Z39),$P39*$U39/12),0)","v":{"v":0,"d":"0.00"}},{"$f":"IF(AND(AB$16*1>=$R39,AB$16*1<=$D$8,$R39<$D$8,$P39>SUM($V39:AA39)),IF(SUM($P39*$U39/12,$V39:AA39)>$P39,$P39-SUM($V39:AA39),$P39*$U39/12),0)","v":{"v":0,"d":"0.00"}},{"$f":"IF(AND(AC$16*1>=$R39,AC$16*1<=$D$8,$R39<$D$8,$P39>SUM($V39:AB39)),IF(SUM($P39*$U39/12,$V39:AB39)>$P39,$P39-SUM($V39:AB39),$P39*$U39/12),0)","v":{"v":0,"d":"0.00"}},{"$f":"IF(AND(AD$16*1>=$R39,AD$16*1<=$D$8,$R39<$D$8,$P39>SUM($V39:AC39)),IF(SUM($P39*$U39/12,$V39:AC39)>$P39,$P39-SUM($V39:AC39),$P39*$U39/12),0)","v":{"v":0,"d":"0.00"}},{"$f":"IF(AND(AE$16*1>=$R39,AE$16*1<=$D$8,$R39<$D$8,$P39>SUM($V39:AD39)),IF(SUM($P39*$U39/12,$V39:AD39)>$P39,$P39-SUM($V39:AD39),$P39*$U39/12),0)","v":{"v":0,"d":"0.00"}},{"$f":"IF(AND(AF$16*1>=$R39,AF$16*1<=$D$8,$R39<$D$8,$P39>SUM($V39:AE39)),IF(SUM($P39*$U39/12,$V39:AE39)>$P39,$P39-SUM($V39:AE39),$P39*$U39/12),0)","v":{"v":0,"d":"0.00"}},{"$f":"IF(AND(AG$16*1>=$R39,AG$16*1<=$D$8,$R39<$D$8,$P39>SUM($V39:AF39)),IF(SUM($P39*$U39/12,$V39:AF39)>$P39,$P39-SUM($V39:AF39),$P39*$U39/12),0)","v":{"v":0,"d":"0.00"}},{"$f":"IF(AND(AH$16*1>=$R39,AH$16*1<=$D$8,$R39<$D$8,$P39>SUM($V39:AG39)),IF(SUM($P39*$U39/12,$V39:AG39)>$P39,$P39-SUM($V39:AG39),$P39*$U39/12),0)","v":{"v":0,"d":"0.00"}},{"v":0,"d":"0.00"},null,null,494.01,null,494.01]
[null,null,24,"335111","PUERTA REJA METALICA",{"$nulls":3},341.32,{"$nulls":4},341.32,null,341.32,"2006-03-25","2006-04-01",null,null,{"v":0.1,"d":"10%"},341.32,{"$f":"IF(AND(W$16*1>=$R40,W$16*1<=$D$8,$R40<$D$8,$P40>SUM($V40:V40)),IF(SUM($P40*$U40/12,$V40:V40)>$P40,$P40-SUM($V40:V40),$P40*$U40/12),0)","v":{"v":0,"d":"0.00"}},{"$f":"IF(AND(X$16*1>=$R40,X$16*1<=$D$8,$R40<$D$8,$P40>SUM($V40:W40)),IF(SUM($P40*$U40/12,$V40:W40)>$P40,$P40-SUM($V40:W40),$P40*$U40/12),0)","v":{"v":0,"d":"0.00"}},{"$f":"IF(AND(Y$16*1>=$R40,Y$16*1<=$D$8,$R40<$D$8,$P40>SUM($V40:X40)),IF(SUM($P40*$U40/12,$V40:X40)>$P40,$P40-SUM($V40:X40),$P40*$U40/12),0)","v":{"v":0,"d":"0.00"}},{"$f":"IF(AND(Z$16*1>=$R40,Z$16*1<=$D$8,$R40<$D$8,$P40>SUM($V40:Y40)),IF(SUM($P40*$U40/12,$V40:Y40)>$P40,$P40-SUM($V40:Y40),$P40*$U40/12),0)","v":{"v":0,"d":"0.00"}},{"$f":"IF(AND(AA$16*1>=$R40,AA$16*1<=$D$8,$R40<$D$8,$P40>SUM($V40:Z40)),IF(SUM($P40*$U40/12,$V40:Z40)>$P40,$P40-SUM($V40:Z40),$P40*$U40/12),0)","v":{"v":0,"d":"0.00"}},{"$f":"IF(AND(AB$16*1>=$R40,AB$16*1<=$D$8,$R40<$D$8,$P40>SUM($V40:AA40)),IF(SUM($P40*$U40/12,$V40:AA40)>$P40,$P40-SUM($V40:AA40),$P40*$U40/12),0)","v":{"v":0,"d":"0.00"}},{"$f":"IF(AND(AC$16*1>=$R40,AC$16*1<=$D$8,$R40<$D$8,$P40>SUM($V40:AB40)),IF(SUM($P40*$U40/12,$V40:AB40)>$P40,$P40-SUM($V40:AB40),$P40*$U40/12),0)","v":{"v":0,"d":"0.00"}},{"$f":"IF(AND(AD$16*1>=$R40,AD$16*1<=$D$8,$R40<$D$8,$P40>SUM($V40:AC40)),IF(SUM($P40*$U40/12,$V40:AC40)>$P40,$P40-SUM($V40:AC40),$P40*$U40/12),0)","v":{"v":0,"d":"0.00"}},{"$f":"IF(AND(AE$16*1>=$R40,AE$16*1<=$D$8,$R40<$D$8,$P40>SUM($V40:AD40)),IF(SUM($P40*$U40/12,$V40:AD40)>$P40,$P40-SUM($V40:AD40),$P40*$U40/12),0)","v":{"v":0,"d":"0.00"}},{"$f":"IF(AND(AF$16*1>=$R40,AF$16*1<=$D$8,$R40<$D$8,$P40>SUM($V40:AE40)),IF(SUM($P40*$U40/12,$V40:AE40)>$P40,$P40-SUM($V40:AE40),$P40*$U40/12),0)","v":{"v":0,"d":"0.00"}},{"$f":"IF(AND(AG$16*1>=$R40,AG$16*1<=$D$8,$R40<$D$8,$P40>SUM($V40:AF40)),IF(SUM($P40*$U40/12,$V40:AF40)>$P40,$P40-SUM($V40:AF40),$P40*$U40/12),0)","v":{"v":0,"d":"0.00"}},{"$f":"IF(AND(AH$16*1>=$R40,AH$16*1<=$D$8,$R40<$D$8,$P40>SUM($V40:AG40)),IF(SUM($P40*$U40/12,$V40:AG40)>$P40,$P40-SUM($V40:AG40),$P40*$U40/12),0)","v":{"v":0,"d":"0.00"}},{"v":0,"d":"0.00"},null,null,341.32,null,341.32]
[null,null,25,"335111","BARANDA ESCALERA ENTRADA",{"$nulls":3},749.36,{"$nulls":4},749.36,null,749.36,"2007-04-01","2007-05-01",null,null,{"v":0.1,"d":"10%"},749.36,{"$f":"IF(AND(W$16*1>=$R41,W$16*1<=$D$8,$R41<$D$8,$P41>SUM($V41:V41)),IF(SUM($P41*$U41/12,$V41:V41)>$P41,$P41-SUM($V41:V41),$P41*$U41/12),0)","v":{"v":0,"d":"0.00"}},{"$f":"IF(AND(X$16*1>=$R41,X$16*1<=$D$8,$R41<$D$8,$P41>SUM($V41:W41)),IF(SUM($P41*$U41/12,$V41:W41)>$P41,$P41-SUM($V41:W41),$P41*$U41/12),0)","v":{"v":0,"d":"0.00"}},{"$f":"IF(AND(Y$16*1>=$R41,Y$16*1<=$D$8,$R41<$D$8,$P41>SUM($V41:X41)),IF(SUM($P41*$U41/12,$V41:X41)>$P41,$P41-SUM($V41:X41),$P41*$U41/12),0)","v":{"v":0,"d":"0.00"}},{"$f":"IF(AND(Z$16*1>=$R41,Z$16*1<=$D$8,$R41<$D$8,$P41>SUM($V41:Y41)),IF(SUM($P41*$U41/12,$V41:Y41)>$P41,$P41-SUM($V41:Y41),$P41*$U41/12),0)","v":{"v":0,"d":"0.00"}},{"$f":"IF(AND(AA$16*1>=$R41,AA$16*1<=$D$8,$R41<$D$8,$P41>SUM($V41:Z41)),IF(SUM($P41*$U41/12,$V41:Z41)>$P41,$P41-SUM($V41:Z41),$P41*$U41/12),0)","v":{"v":0,"d":"0.00"}},{"$f":"IF(AND(AB$16*1>=$R41,AB$16*1<=$D$8,$R41<$D$8,$P41>SUM($V41:AA41)),IF(SUM($P41*$U41/12,$V41:AA41)>$P41,$P41-SUM($V41:AA41),$P41*$U41/12),0)","v":{"v":0,"d":"0.00"}},{"$f":"IF(AND(AC$16*1>=$R41,AC$16*1<=$D$8,$R41<$D$8,$P41>SUM($V41:AB41)),IF(SUM($P41*$U41/12,$V41:AB41)>$P41,$P41-SUM($V41:AB41),$P41*$U41/12),0)","v":{"v":0,"d":"0.00"}},{"$f":"IF(AND(AD$16*1>=$R41,AD$16*1<=$D$8,$R41<$D$8,$P41>SUM($V41:AC41)),IF(SUM($P41*$U41/12,$V41:AC41)>$P41,$P41-SUM($V41:AC41),$P41*$U41/12),0)","v":{"v":0,"d":"0.00"}},{"$f":"IF(AND(AE$16*1>=$R41,AE$16*1<=$D$8,$R41<$D$8,$P41>SUM($V41:AD41)),IF(SUM($P41*$U41/12,$V41:AD41)>$P41,$P41-SUM($V41:AD41),$P41*$U41/12),0)","v":{"v":0,"d":"0.00"}},{"$f":"IF(AND(AF$16*1>=$R41,AF$16*1<=$D$8,$R41<$D$8,$P41>SUM($V41:AE41)),IF(SUM($P41*$U41/12,$V41:AE41)>$P41,$P41-SUM($V41:AE41),$P41*$U41/12),0)","v":{"v":0,"d":"0.00"}},{"$f":"IF(AND(AG$16*1>=$R41,AG$16*1<=$D$8,$R41<$D$8,$P41>SUM($V41:AF41)),IF(SUM($P41*$U41/12,$V41:AF41)>$P41,$P41-SUM($V41:AF41),$P41*$U41/12),0)","v":{"v":0,"d":"0.00"}},{"$f":"IF(AND(AH$16*1>=$R41,AH$16*1<=$D$8,$R41<$D$8,$P41>SUM($V41:AG41)),IF(SUM($P41*$U41/12,$V41:AG41)>$P41,$P41-SUM($V41:AG41),$P41*$U41/12),0)","v":{"v":0,"d":"0.00"}},{"v":0,"d":"0.00"},null,null,749.36,null,749.36]
[null,null,26,"335111","CERCO PUAS METALICAS",{"$nulls":3},639.18,{"$nulls":4},639.18,null,639.18,"2007-08-28","2007-09-01",null,null,{"v":0.1,"d":"10%"},639.18,{"$f":"IF(AND(W$16*1>=$R42,W$16*1<=$D$8,$R42<$D$8,$P42>SUM($V42:V42)),IF(SUM($P42*$U42/12,$V42:V42)>$P42,$P42-SUM($V42:V42),$P42*$U42/12),0)","v":{"v":0,"d":"0.00"}},{"$f":"IF(AND(X$16*1>=$R42,X$16*1<=$D$8,$R42<$D$8,$P42>SUM($V42:W42)),IF(SUM($P42*$U42/12,$V42:W42)>$P42,$P42-SUM($V42:W42),$P42*$U42/12),0)","v":{"v":0,"d":"0.00"}},{"$f":"IF(AND(Y$16*1>=$R42,Y$16*1<=$D$8,$R42<$D$8,$P42>SUM($V42:X42)),IF(SUM($P42*$U42/12,$V42:X42)>$P42,$P42-SUM($V42:X42),$P42*$U42/12),0)","v":{"v":0,"d":"0.00"}},{"$f":"IF(AND(Z$16*1>=$R42,Z$16*1<=$D$8,$R42<$D$8,$P42>SUM($V42:Y42)),IF(SUM($P42*$U42/12,$V42:Y42)>$P42,$P42-SUM($V42:Y42),$P42*$U42/12),0)","v":{"v":0,"d":"0.00"}},{"$f":"IF(AND(AA$16*1>=$R42,AA$16*1<=$D$8,$R42<$D$8,$P42>SUM($V42:Z42)),IF(SUM($P42*$U42/12,$V42:Z42)>$P42,$P42-SUM($V42:Z42),$P42*$U42/12),0)","v":{"v":0,"d":"0.00"}},{"$f":"IF(AND(AB$16*1>=$R42,AB$16*1<=$D$8,$R42<$D$8,$P42>SUM($V42:AA42)),IF(SUM($P42*$U42/12,$V42:AA42)>$P42,$P42-SUM($V42:AA42),$P42*$U42/12),0)","v":{"v":0,"d":"0.00"}},{"$f":"IF(AND(AC$16*1>=$R42,AC$16*1<=$D$8,$R42<$D$8,$P42>SUM($V42:AB42)),IF(SUM($P42*$U42/12,$V42:AB42)>$P42,$P42-SUM($V42:AB42),$P42*$U42/12),0)","v":{"v":0,"d":"0.00"}},{"$f":"IF(AND(AD$16*1>=$R42,AD$16*1<=$D$8,$R42<$D$8,$P42>SUM($V42:AC42)),IF(SUM($P42*$U42/12,$V42:AC42)>$P42,$P42-SUM($V42:AC42),$P42*$U42/12),0)","v":{"v":0,"d":"0.00"}},{"$f":"IF(AND(AE$16*1>=$R42,AE$16*1<=$D$8,$R42<$D$8,$P42>SUM($V42:AD42)),IF(SUM($P42*$U42/12,$V42:AD42)>$P42,$P42-SUM($V42:AD42),$P42*$U42/12),0)","v":{"v":0,"d":"0.00"}},{"$f":"IF(AND(AF$16*1>=$R42,AF$16*1<=$D$8,$R42<$D$8,$P42>SUM($V42:AE42)),IF(SUM($P42*$U42/12,$V42:AE42)>$P42,$P42-SUM($V42:AE42),$P42*$U42/12),0)","v":{"v":0,"d":"0.00"}},{"$f":"IF(AND(AG$16*1>=$R42,AG$16*1<=$D$8,$R42<$D$8,$P42>SUM($V42:AF42)),IF(SUM($P42*$U42/12,$V42:AF42)>$P42,$P42-SUM($V42:AF42),$P42*$U42/12),0)","v":{"v":0,"d":"0.00"}},{"$f":"IF(AND(AH$16*1>=$R42,AH$16*1<=$D$8,$R42<$D$8,$P42>SUM($V42:AG42)),IF(SUM($P42*$U42/12,$V42:AG42)>$P42,$P42-SUM($V42:AG42),$P42*$U42/12),0)","v":{"v":0,"d":"0.00"}},{"v":0,"d":"0.00"},null,null,639.18,null,639.18]
[null,null,27,"335111","ESCRITORIO NEGRO EN L (AG)",{"$nulls":3},557.23,{"$nulls":4},557.23,null,557.23,"2008-04-27","2008-05-01",null,null,{"v":0.1,"d":"10%"},557.23,{"$f":"IF(AND(W$16*1>=$R43,W$16*1<=$D$8,$R43<$D$8,$P43>SUM($V43:V43)),IF(SUM($P43*$U43/12,$V43:V43)>$P43,$P43-SUM($V43:V43),$P43*$U43/12),0)","v":{"v":0,"d":"0.00"}},{"$f":"IF(AND(X$16*1>=$R43,X$16*1<=$D$8,$R43<$D$8,$P43>SUM($V43:W43)),IF(SUM($P43*$U43/12,$V43:W43)>$P43,$P43-SUM($V43:W43),$P43*$U43/12),0)","v":{"v":0,"d":"0.00"}},{"$f":"IF(AND(Y$16*1>=$R43,Y$16*1<=$D$8,$R43<$D$8,$P43>SUM($V43:X43)),IF(SUM($P43*$U43/12,$V43:X43)>$P43,$P43-SUM($V43:X43),$P43*$U43/12),0)","v":{"v":0,"d":"0.00"}},{"$f":"IF(AND(Z$16*1>=$R43,Z$16*1<=$D$8,$R43<$D$8,$P43>SUM($V43:Y43)),IF(SUM($P43*$U43/12,$V43:Y43)>$P43,$P43-SUM($V43:Y43),$P43*$U43/12),0)","v":{"v":0,"d":"0.00"}},{"$f":"IF(AND(AA$16*1>=$R43,AA$16*1<=$D$8,$R43<$D$8,$P43>SUM($V43:Z43)),IF(SUM($P43*$U43/12,$V43:Z43)>$P43,$P43-SUM($V43:Z43),$P43*$U43/12),0)","v":{"v":0,"d":"0.00"}},{"$f":"IF(AND(AB$16*1>=$R43,AB$16*1<=$D$8,$R43<$D$8,$P43>SUM($V43:AA43)),IF(SUM($P43*$U43/12,$V43:AA43)>$P43,$P43-SUM($V43:AA43),$P43*$U43/12),0)","v":{"v":0,"d":"0.00"}},{"$f":"IF(AND(AC$16*1>=$R43,AC$16*1<=$D$8,$R43<$D$8,$P43>SUM($V43:AB43)),IF(SUM($P43*$U43/12,$V43:AB43)>$P43,$P43-SUM($V43:AB43),$P43*$U43/12),0)","v":{"v":0,"d":"0.00"}},{"$f":"IF(AND(AD$16*1>=$R43,AD$16*1<=$D$8,$R43<$D$8,$P43>SUM($V43:AC43)),IF(SUM($P43*$U43/12,$V43:AC43)>$P43,$P43-SUM($V43:AC43),$P43*$U43/12),0)","v":{"v":0,"d":"0.00"}},{"$f":"IF(AND(AE$16*1>=$R43,AE$16*1<=$D$8,$R43<$D$8,$P43>SUM($V43:AD43)),IF(SUM($P43*$U43/12,$V43:AD43)>$P43,$P43-SUM($V43:AD43),$P43*$U43/12),0)","v":{"v":0,"d":"0.00"}},{"$f":"IF(AND(AF$16*1>=$R43,AF$16*1<=$D$8,$R43<$D$8,$P43>SUM($V43:AE43)),IF(SUM($P43*$U43/12,$V43:AE43)>$P43,$P43-SUM($V43:AE43),$P43*$U43/12),0)","v":{"v":0,"d":"0.00"}},{"$f":"IF(AND(AG$16*1>=$R43,AG$16*1<=$D$8,$R43<$D$8,$P43>SUM($V43:AF43)),IF(SUM($P43*$U43/12,$V43:AF43)>$P43,$P43-SUM($V43:AF43),$P43*$U43/12),0)","v":{"v":0,"d":"0.00"}},{"$f":"IF(AND(AH$16*1>=$R43,AH$16*1<=$D$8,$R43<$D$8,$P43>SUM($V43:AG43)),IF(SUM($P43*$U43/12,$V43:AG43)>$P43,$P43-SUM($V43:AG43),$P43*$U43/12),0)","v":{"v":0,"d":"0.00"}},{"v":0,"d":"0.00"},null,null,557.23,null,557.23]
[null,null,28,"335111","ESCRITORIO NEGRO EN L (MG)",{"$nulls":3},647.11,{"$nulls":4},647.11,null,647.11,"2008-04-27","2008-05-01",null,null,{"v":0.1,"d":"10%"},647.11,{"$f":"IF(AND(W$16*1>=$R44,W$16*1<=$D$8,$R44<$D$8,$P44>SUM($V44:V44)),IF(SUM($P44*$U44/12,$V44:V44)>$P44,$P44-SUM($V44:V44),$P44*$U44/12),0)","v":{"v":0,"d":"0.00"}},{"$f":"IF(AND(X$16*1>=$R44,X$16*1<=$D$8,$R44<$D$8,$P44>SUM($V44:W44)),IF(SUM($P44*$U44/12,$V44:W44)>$P44,$P44-SUM($V44:W44),$P44*$U44/12),0)","v":{"v":0,"d":"0.00"}},{"$f":"IF(AND(Y$16*1>=$R44,Y$16*1<=$D$8,$R44<$D$8,$P44>SUM($V44:X44)),IF(SUM($P44*$U44/12,$V44:X44)>$P44,$P44-SUM($V44:X44),$P44*$U44/12),0)","v":{"v":0,"d":"0.00"}},{"$f":"IF(AND(Z$16*1>=$R44,Z$16*1<=$D$8,$R44<$D$8,$P44>SUM($V44:Y44)),IF(SUM($P44*$U44/12,$V44:Y44)>$P44,$P44-SUM($V44:Y44),$P44*$U44/12),0)","v":{"v":0,"d":"0.00"}},{"$f":"IF(AND(AA$16*1>=$R44,AA$16*1<=$D$8,$R44<$D$8,$P44>SUM($V44:Z44)),IF(SUM($P44*$U44/12,$V44:Z44)>$P44,$P44-SUM($V44:Z44),$P44*$U44/12),0)","v":{"v":0,"d":"0.00"}},{"$f":"IF(AND(AB$16*1>=$R44,AB$16*1<=$D$8,$R44<$D$8,$P44>SUM($V44:AA44)),IF(SUM($P44*$U44/12,$V44:AA44)>$P44,$P44-SUM($V44:AA44),$P44*$U44/12),0)","v":{"v":0,"d":"0.00"}},{"$f":"IF(AND(AC$16*1>=$R44,AC$16*1<=$D$8,$R44<$D$8,$P44>SUM($V44:AB44)),IF(SUM($P44*$U44/12,$V44:AB44)>$P44,$P44-SUM($V44:AB44),$P44*$U44/12),0)","v":{"v":0,"d":"0.00"}},{"$f":"IF(AND(AD$16*1>=$R44,AD$16*1<=$D$8,$R44<$D$8,$P44>SUM($V44:AC44)),IF(SUM($P44*$U44/12,$V44:AC44)>$P44,$P44-SUM($V44:AC44),$P44*$U44/12),0)","v":{"v":0,"d":"0.00"}},{"$f":"IF(AND(AE$16*1>=$R44,AE$16*1<=$D$8,$R44<$D$8,$P44>SUM($V44:AD44)),IF(SUM($P44*$U44/12,$V44:AD44)>$P44,$P44-SUM($V44:AD44),$P44*$U44/12),0)","v":{"v":0,"d":"0.00"}},{"$f":"IF(AND(AF$16*1>=$R44,AF$16*1<=$D$8,$R44<$D$8,$P44>SUM($V44:AE44)),IF(SUM($P44*$U44/12,$V44:AE44)>$P44,$P44-SUM($V44:AE44),$P44*$U44/12),0)","v":{"v":0,"d":"0.00"}},{"$f":"IF(AND(AG$16*1>=$R44,AG$16*1<=$D$8,$R44<$D$8,$P44>SUM($V44:AF44)),IF(SUM($P44*$U44/12,$V44:AF44)>$P44,$P44-SUM($V44:AF44),$P44*$U44/12),0)","v":{"v":0,"d":"0.00"}},{"$f":"IF(AND(AH$16*1>=$R44,AH$16*1<=$D$8,$R44<$D$8,$P44>SUM($V44:AG44)),IF(SUM($P44*$U44/12,$V44:AG44)>$P44,$P44-SUM($V44:AG44),$P44*$U44/12),0)","v":{"v":0,"d":"0.00"}},{"v":0,"d":"0.00"},null,null,647.11,null,647.11]
[null,null,29,"335111","SILLA GIRATORIA GRIS S/BRAZOS ",{"$nulls":3},124.02,{"$nulls":4},124.02,null,124.02,"2008-09-01","2008-10-01",null,null,{"v":0.1,"d":"10%"},124.02,{"$f":"IF(AND(W$16*1>=$R45,W$16*1<=$D$8,$R45<$D$8,$P45>SUM($V45:V45)),IF(SUM($P45*$U45/12,$V45:V45)>$P45,$P45-SUM($V45:V45),$P45*$U45/12),0)","v":{"v":0,"d":"0.00"}},{"$f":"IF(AND(X$16*1>=$R45,X$16*1<=$D$8,$R45<$D$8,$P45>SUM($V45:W45)),IF(SUM($P45*$U45/12,$V45:W45)>$P45,$P45-SUM($V45:W45),$P45*$U45/12),0)","v":{"v":0,"d":"0.00"}},{"$f":"IF(AND(Y$16*1>=$R45,Y$16*1<=$D$8,$R45<$D$8,$P45>SUM($V45:X45)),IF(SUM($P45*$U45/12,$V45:X45)>$P45,$P45-SUM($V45:X45),$P45*$U45/12),0)","v":{"v":0,"d":"0.00"}},{"$f":"IF(AND(Z$16*1>=$R45,Z$16*1<=$D$8,$R45<$D$8,$P45>SUM($V45:Y45)),IF(SUM($P45*$U45/12,$V45:Y45)>$P45,$P45-SUM($V45:Y45),$P45*$U45/12),0)","v":{"v":0,"d":"0.00"}},{"$f":"IF(AND(AA$16*1>=$R45,AA$16*1<=$D$8,$R45<$D$8,$P45>SUM($V45:Z45)),IF(SUM($P45*$U45/12,$V45:Z45)>$P45,$P45-SUM($V45:Z45),$P45*$U45/12),0)","v":{"v":0,"d":"0.00"}},{"$f":"IF(AND(AB$16*1>=$R45,AB$16*1<=$D$8,$R45<$D$8,$P45>SUM($V45:AA45)),IF(SUM($P45*$U45/12,$V45:AA45)>$P45,$P45-SUM($V45:AA45),$P45*$U45/12),0)","v":{"v":0,"d":"0.00"}},{"$f":"IF(AND(AC$16*1>=$R45,AC$16*1<=$D$8,$R45<$D$8,$P45>SUM($V45:AB45)),IF(SUM($P45*$U45/12,$V45:AB45)>$P45,$P45-SUM($V45:AB45),$P45*$U45/12),0)","v":{"v":0,"d":"0.00"}},{"$f":"IF(AND(AD$16*1>=$R45,AD$16*1<=$D$8,$R45<$D$8,$P45>SUM($V45:AC45)),IF(SUM($P45*$U45/12,$V45:AC45)>$P45,$P45-SUM($V45:AC45),$P45*$U45/12),0)","v":{"v":0,"d":"0.00"}},{"$f":"IF(AND(AE$16*1>=$R45,AE$16*1<=$D$8,$R45<$D$8,$P45>SUM($V45:AD45)),IF(SUM($P45*$U45/12,$V45:AD45)>$P45,$P45-SUM($V45:AD45),$P45*$U45/12),0)","v":{"v":0,"d":"0.00"}},{"$f":"IF(AND(AF$16*1>=$R45,AF$16*1<=$D$8,$R45<$D$8,$P45>SUM($V45:AE45)),IF(SUM($P45*$U45/12,$V45:AE45)>$P45,$P45-SUM($V45:AE45),$P45*$U45/12),0)","v":{"v":0,"d":"0.00"}},{"$f":"IF(AND(AG$16*1>=$R45,AG$16*1<=$D$8,$R45<$D$8,$P45>SUM($V45:AF45)),IF(SUM($P45*$U45/12,$V45:AF45)>$P45,$P45-SUM($V45:AF45),$P45*$U45/12),0)","v":{"v":0,"d":"0.00"}},{"$f":"IF(AND(AH$16*1>=$R45,AH$16*1<=$D$8,$R45<$D$8,$P45>SUM($V45:AG45)),IF(SUM($P45*$U45/12,$V45:AG45)>$P45,$P45-SUM($V45:AG45),$P45*$U45/12),0)","v":{"v":0,"d":"0.00"}},{"v":0,"d":"0.00"},null,null,124.02,null,124.02]
[null,null,30,"335111","ECRAN CON TRIPODE",{"$nulls":3},545.85,{"$nulls":4},545.85,null,545.85,"2008-12-28","2009-01-01",null,null,{"v":0.1,"d":"10%"},545.85,{"$f":"IF(AND(W$16*1>=$R46,W$16*1<=$D$8,$R46<$D$8,$P46>SUM($V46:V46)),IF(SUM($P46*$U46/12,$V46:V46)>$P46,$P46-SUM($V46:V46),$P46*$U46/12),0)","v":{"v":0,"d":"0.00"}},{"$f":"IF(AND(X$16*1>=$R46,X$16*1<=$D$8,$R46<$D$8,$P46>SUM($V46:W46)),IF(SUM($P46*$U46/12,$V46:W46)>$P46,$P46-SUM($V46:W46),$P46*$U46/12),0)","v":{"v":0,"d":"0.00"}},{"$f":"IF(AND(Y$16*1>=$R46,Y$16*1<=$D$8,$R46<$D$8,$P46>SUM($V46:X46)),IF(SUM($P46*$U46/12,$V46:X46)>$P46,$P46-SUM($V46:X46),$P46*$U46/12),0)","v":{"v":0,"d":"0.00"}},{"$f":"IF(AND(Z$16*1>=$R46,Z$16*1<=$D$8,$R46<$D$8,$P46>SUM($V46:Y46)),IF(SUM($P46*$U46/12,$V46:Y46)>$P46,$P46-SUM($V46:Y46),$P46*$U46/12),0)","v":{"v":0,"d":"0.00"}},{"$f":"IF(AND(AA$16*1>=$R46,AA$16*1<=$D$8,$R46<$D$8,$P46>SUM($V46:Z46)),IF(SUM($P46*$U46/12,$V46:Z46)>$P46,$P46-SUM($V46:Z46),$P46*$U46/12),0)","v":{"v":0,"d":"0.00"}},{"$f":"IF(AND(AB$16*1>=$R46,AB$16*1<=$D$8,$R46<$D$8,$P46>SUM($V46:AA46)),IF(SUM($P46*$U46/12,$V46:AA46)>$P46,$P46-SUM($V46:AA46),$P46*$U46/12),0)","v":{"v":0,"d":"0.00"}},{"$f":"IF(AND(AC$16*1>=$R46,AC$16*1<=$D$8,$R46<$D$8,$P46>SUM($V46:AB46)),IF(SUM($P46*$U46/12,$V46:AB46)>$P46,$P46-SUM($V46:AB46),$P46*$U46/12),0)","v":{"v":0,"d":"0.00"}},{"$f":"IF(AND(AD$16*1>=$R46,AD$16*1<=$D$8,$R46<$D$8,$P46>SUM($V46:AC46)),IF(SUM($P46*$U46/12,$V46:AC46)>$P46,$P46-SUM($V46:AC46),$P46*$U46/12),0)","v":{"v":0,"d":"0.00"}},{"$f":"IF(AND(AE$16*1>=$R46,AE$16*1<=$D$8,$R46<$D$8,$P46>SUM($V46:AD46)),IF(SUM($P46*$U46/12,$V46:AD46)>$P46,$P46-SUM($V46:AD46),$P46*$U46/12),0)","v":{"v":0,"d":"0.00"}},{"$f":"IF(AND(AF$16*1>=$R46,AF$16*1<=$D$8,$R46<$D$8,$P46>SUM($V46:AE46)),IF(SUM($P46*$U46/12,$V46:AE46)>$P46,$P46-SUM($V46:AE46),$P46*$U46/12),0)","v":{"v":0,"d":"0.00"}},{"$f":"IF(AND(AG$16*1>=$R46,AG$16*1<=$D$8,$R46<$D$8,$P46>SUM($V46:AF46)),IF(SUM($P46*$U46/12,$V46:AF46)>$P46,$P46-SUM($V46:AF46),$P46*$U46/12),0)","v":{"v":0,"d":"0.00"}},{"$f":"IF(AND(AH$16*1>=$R46,AH$16*1<=$D$8,$R46<$D$8,$P46>SUM($V46:AG46)),IF(SUM($P46*$U46/12,$V46:AG46)>$P46,$P46-SUM($V46:AG46),$P46*$U46/12),0)","v":{"v":0,"d":"0.00"}},{"v":0,"d":"0.00"},null,null,545.85,null,545.85]
[null,null,31,"335111","ARCHIVADOR 4 GAVETAS",{"$nulls":3},192.82,{"$nulls":4},192.82,null,192.82,"2009-01-10","2009-02-01",null,null,{"v":0.1,"d":"10%"},{"v":191.2,"d":"191.20"},{"$f":"IF(AND(W$16*1>=$R47,W$16*1<=$D$8,$R47<$D$8,$P47>SUM($V47:V47)),IF(SUM($P47*$U47/12,$V47:V47)>$P47,$P47-SUM($V47:V47),$P47*$U47/12),0)","v":{"v":1.6068333333333333,"d":"1.61"}},{"$f":"IF(AND(X$16*1>=$R47,X$16*1<=$D$8,$R47<$D$8,$P47>SUM($V47:W47)),IF(SUM($P47*$U47/12,$V47:W47)>$P47,$P47-SUM($V47:W47),$P47*$U47/12),0)","v":{"v":0.013166666666677429,"d":"0.01"}},{"$f":"IF(AND(Y$16*1>=$R47,Y$16*1<=$D$8,$R47<$D$8,$P47>SUM($V47:X47)),IF(SUM($P47*$U47/12,$V47:X47)>$P47,$P47-SUM($V47:X47),$P47*$U47/12),0)","v":{"v":0,"d":"0.00"}},{"$f":"IF(AND(Z$16*1>=$R47,Z$16*1<=$D$8,$R47<$D$8,$P47>SUM($V47:Y47)),IF(SUM($P47*$U47/12,$V47:Y47)>$P47,$P47-SUM($V47:Y47),$P47*$U47/12),0)","v":{"v":0,"d":"0.00"}},{"$f":"IF(AND(AA$16*1>=$R47,AA$16*1<=$D$8,$R47<$D$8,$P47>SUM($V47:Z47)),IF(SUM($P47*$U47/12,$V47:Z47)>$P47,$P47-SUM($V47:Z47),$P47*$U47/12),0)","v":{"v":0,"d":"0.00"}},{"$f":"IF(AND(AB$16*1>=$R47,AB$16*1<=$D$8,$R47<$D$8,$P47>SUM($V47:AA47)),IF(SUM($P47*$U47/12,$V47:AA47)>$P47,$P47-SUM($V47:AA47),$P47*$U47/12),0)","v":{"v":0,"d":"0.00"}},{"$f":"IF(AND(AC$16*1>=$R47,AC$16*1<=$D$8,$R47<$D$8,$P47>SUM($V47:AB47)),IF(SUM($P47*$U47/12,$V47:AB47)>$P47,$P47-SUM($V47:AB47),$P47*$U47/12),0)","v":{"v":0,"d":"0.00"}},{"$f":"IF(AND(AD$16*1>=$R47,AD$16*1<=$D$8,$R47<$D$8,$P47>SUM($V47:AC47)),IF(SUM($P47*$U47/12,$V47:AC47)>$P47,$P47-SUM($V47:AC47),$P47*$U47/12),0)","v":{"v":0,"d":"0.00"}},{"$f":"IF(AND(AE$16*1>=$R47,AE$16*1<=$D$8,$R47<$D$8,$P47>SUM($V47:AD47)),IF(SUM($P47*$U47/12,$V47:AD47)>$P47,$P47-SUM($V47:AD47),$P47*$U47/12),0)","v":{"v":0,"d":"0.00"}},{"$f":"IF(AND(AF$16*1>=$R47,AF$16*1<=$D$8,$R47<$D$8,$P47>SUM($V47:AE47)),IF(SUM($P47*$U47/12,$V47:AE47)>$P47,$P47-SUM($V47:AE47),$P47*$U47/12),0)","v":{"v":0,"d":"0.00"}},{"$f":"IF(AND(AG$16*1>=$R47,AG$16*1<=$D$8,$R47<$D$8,$P47>SUM($V47:AF47)),IF(SUM($P47*$U47/12,$V47:AF47)>$P47,$P47-SUM($V47:AF47),$P47*$U47/12),0)","v":{"v":0,"d":"0.00"}},{"$f":"IF(AND(AH$16*1>=$R47,AH$16*1<=$D$8,$R47<$D$8,$P47>SUM($V47:AG47)),IF(SUM($P47*$U47/12,$V47:AG47)>$P47,$P47-SUM($V47:AG47),$P47*$U47/12),0)","v":{"v":0,"d":"0.00"}},{"v":1.6200000000000108,"d":"1.62"},null,null,192.82,null,192.82]
[null,null,32,"335111","REJA METALICA FACHADA",{"$nulls":3},4837.68,{"$nulls":4},4837.68,null,{"v":4837.68,"d":"4,837.68"},"2009-08-24","2009-09-01",null,null,{"v":0.1,"d":"10%"},{"v":4515.19,"d":"4,515.19"},{"$f":"IF(AND(W$16*1>=$R48,W$16*1<=$D$8,$R48<$D$8,$P48>SUM($V48:V48)),IF(SUM($P48*$U48/12,$V48:V48)>$P48,$P48-SUM($V48:V48),$P48*$U48/12),0)","v":{"v":40.314,"d":"40.31"}},{"$f":"IF(AND(X$16*1>=$R48,X$16*1<=$D$8,$R48<$D$8,$P48>SUM($V48:W48)),IF(SUM($P48*$U48/12,$V48:W48)>$P48,$P48-SUM($V48:W48),$P48*$U48/12),0)","v":{"v":40.314,"d":"40.31"}},{"$f":"IF(AND(Y$16*1>=$R48,Y$16*1<=$D$8,$R48<$D$8,$P48>SUM($V48:X48)),IF(SUM($P48*$U48/12,$V48:X48)>$P48,$P48-SUM($V48:X48),$P48*$U48/12),0)","v":{"v":40.314,"d":"40.31"}},{"$f":"IF(AND(Z$16*1>=$R48,Z$16*1<=$D$8,$R48<$D$8,$P48>SUM($V48:Y48)),IF(SUM($P48*$U48/12,$V48:Y48)>$P48,$P48-SUM($V48:Y48),$P48*$U48/12),0)","v":{"v":40.314,"d":"40.31"}},{"$f":"IF(AND(AA$16*1>=$R48,AA$16*1<=$D$8,$R48<$D$8,$P48>SUM($V48:Z48)),IF(SUM($P48*$U48/12,$V48:Z48)>$P48,$P48-SUM($V48:Z48),$P48*$U48/12),0)","v":{"v":40.314,"d":"40.31"}},{"$f":"IF(AND(AB$16*1>=$R48,AB$16*1<=$D$8,$R48<$D$8,$P48>SUM($V48:AA48)),IF(SUM($P48*$U48/12,$V48:AA48)>$P48,$P48-SUM($V48:AA48),$P48*$U48/12),0)","v":{"v":0,"d":"0.00"}},{"$f":"IF(AND(AC$16*1>=$R48,AC$16*1<=$D$8,$R48<$D$8,$P48>SUM($V48:AB48)),IF(SUM($P48*$U48/12,$V48:AB48)>$P48,$P48-SUM($V48:AB48),$P48*$U48/12),0)","v":{"v":0,"d":"0.00"}},{"$f":"IF(AND(AD$16*1>=$R48,AD$16*1<=$D$8,$R48<$D$8,$P48>SUM($V48:AC48)),IF(SUM($P48*$U48/12,$V48:AC48)>$P48,$P48-SUM($V48:AC48),$P48*$U48/12),0)","v":{"v":0,"d":"0.00"}},{"$f":"IF(AND(AE$16*1>=$R48,AE$16*1<=$D$8,$R48<$D$8,$P48>SUM($V48:AD48)),IF(SUM($P48*$U48/12,$V48:AD48)>$P48,$P48-SUM($V48:AD48),$P48*$U48/12),0)","v":{"v":0,"d":"0.00"}},{"$f":"IF(AND(AF$16*1>=$R48,AF$16*1<=$D$8,$R48<$D$8,$P48>SUM($V48:AE48)),IF(SUM($P48*$U48/12,$V48:AE48)>$P48,$P48-SUM($V48:AE48),$P48*$U48/12),0)","v":{"v":0,"d":"0.00"}},{"$f":"IF(AND(AG$16*1>=$R48,AG$16*1<=$D$8,$R48<$D$8,$P48>SUM($V48:AF48)),IF(SUM($P48*$U48/12,$V48:AF48)>$P48,$P48-SUM($V48:AF48),$P48*$U48/12),0)","v":{"v":0,"d":"0.00"}},{"$f":"IF(AND(AH$16*1>=$R48,AH$16*1<=$D$8,$R48<$D$8,$P48>SUM($V48:AG48)),IF(SUM($P48*$U48/12,$V48:AG48)>$P48,$P48-SUM($V48:AG48),$P48*$U48/12),0)","v":{"v":0,"d":"0.00"}},201.57,null,null,{"v":4636.132,"d":"4,636.13"},null,{"v":4636.132,"d":"4,636.13"}]
[null,null,33,"335111","REJA METAL AREA LIBROS",{"$nulls":3},420.17,{"$nulls":4},420.17,null,420.17,"2011-06-11","2011-07-01",null,null,{"v":0.1,"d":"10%"},315.15,{"$f":"IF(AND(W$16*1>=$R49,W$16*1<=$D$8,$R49<$D$8,$P49>SUM($V49:V49)),IF(SUM($P49*$U49/12,$V49:V49)>$P49,$P49-SUM($V49:V49),$P49*$U49/12),0)","v":{"v":3.501416666666667,"d":"3.50"}},{"$f":"IF(AND(X$16*1>=$R49,X$16*1<=$D$8,$R49<$D$8,$P49>SUM($V49:W49)),IF(SUM($P49*$U49/12,$V49:W49)>$P49,$P49-SUM($V49:W49),$P49*$U49/12),0)","v":{"v":3.501416666666667,"d":"3.50"}},{"$f":"IF(AND(Y$16*1>=$R49,Y$16*1<=$D$8,$R49<$D$8,$P49>SUM($V49:X49)),IF(SUM($P49*$U49/12,$V49:X49)>$P49,$P49-SUM($V49:X49),$P49*$U49/12),0)","v":{"v":3.501416666666667,"d":"3.50"}},{"$f":"IF(AND(Z$16*1>=$R49,Z$16*1<=$D$8,$R49<$D$8,$P49>SUM($V49:Y49)),IF(SUM($P49*$U49/12,$V49:Y49)>$P49,$P49-SUM($V49:Y49),$P49*$U49/12),0)","v":{"v":3.501416666666667,"d":"3.50"}},{"$f":"IF(AND(AA$16*1>=$R49,AA$16*1<=$D$8,$R49<$D$8,$P49>SUM($V49:Z49)),IF(SUM($P49*$U49/12,$V49:Z49)>$P49,$P49-SUM($V49:Z49),$P49*$U49/12),0)","v":{"v":3.501416666666667,"d":"3.50"}},{"$f":"IF(AND(AB$16*1>=$R49,AB$16*1<=$D$8,$R49<$D$8,$P49>SUM($V49:AA49)),IF(SUM($P49*$U49/12,$V49:AA49)>$P49,$P49-SUM($V49:AA49),$P49*$U49/12),0)","v":{"v":0,"d":"0.00"}},{"$f":"IF(AND(AC$16*1>=$R49,AC$16*1<=$D$8,$R49<$D$8,$P49>SUM($V49:AB49)),IF(SUM($P49*$U49/12,$V49:AB49)>$P49,$P49-SUM($V49:AB49),$P49*$U49/12),0)","v":{"v":0,"d":"0.00"}},{"$f":"IF(AND(AD$16*1>=$R49,AD$16*1<=$D$8,$R49<$D$8,$P49>SUM($V49:AC49)),IF(SUM($P49*$U49/12,$V49:AC49)>$P49,$P49-SUM($V49:AC49),$P49*$U49/12),0)","v":{"v":0,"d":"0.00"}},{"$f":"IF(AND(AE$16*1>=$R49,AE$16*1<=$D$8,$R49<$D$8,$P49>SUM($V49:AD49)),IF(SUM($P49*$U49/12,$V49:AD49)>$P49,$P49-SUM($V49:AD49),$P49*$U49/12),0)","v":{"v":0,"d":"0.00"}},{"$f":"IF(AND(AF$16*1>=$R49,AF$16*1<=$D$8,$R49<$D$8,$P49>SUM($V49:AE49)),IF(SUM($P49*$U49/12,$V49:AE49)>$P49,$P49-SUM($V49:AE49),$P49*$U49/12),0)","v":{"v":0,"d":"0.00"}},{"$f":"IF(AND(AG$16*1>=$R49,AG$16*1<=$D$8,$R49<$D$8,$P49>SUM($V49:AF49)),IF(SUM($P49*$U49/12,$V49:AF49)>$P49,$P49-SUM($V49:AF49),$P49*$U49/12),0)","v":{"v":0,"d":"0.00"}},{"$f":"IF(AND(AH$16*1>=$R49,AH$16*1<=$D$8,$R49<$D$8,$P49>SUM($V49:AG49)),IF(SUM($P49*$U49/12,$V49:AG49)>$P49,$P49-SUM($V49:AG49),$P49*$U49/12),0)","v":{"v":0,"d":"0.00"}},{"v":17.507083333333334,"d":"17.51"},null,null,{"v":325.65425,"d":"325.65"},null,{"v":325.65425,"d":"325.65"}]
[null,null,34,"335111","5 ARCHIVADORES MADERA MARRON 4 GAVETAS",{"$nulls":3},1134.45,{"$nulls":4},1134.45,null,{"v":1134.45,"d":"1,134.45"},"2011-11-22","2011-12-01",null,null,{"v":0.1,"d":"10%"},{"v":803.6,"d":"803.60"},{"$f":"IF(AND(W$16*1>=$R50,W$16*1<=$D$8,$R50<$D$8,$P50>SUM($V50:V50)),IF(SUM($P50*$U50/12,$V50:V50)>$P50,$P50-SUM($V50:V50),$P50*$U50/12),0)","v":{"v":9.453750000000001,"d":"9.45"}},{"$f":"IF(AND(X$16*1>=$R50,X$16*1<=$D$8,$R50<$D$8,$P50>SUM($V50:W50)),IF(SUM($P50*$U50/12,$V50:W50)>$P50,$P50-SUM($V50:W50),$P50*$U50/12),0)","v":{"v":9.453750000000001,"d":"9.45"}},{"$f":"IF(AND(Y$16*1>=$R50,Y$16*1<=$D$8,$R50<$D$8,$P50>SUM($V50:X50)),IF(SUM($P50*$U50/12,$V50:X50)>$P50,$P50-SUM($V50:X50),$P50*$U50/12),0)","v":{"v":9.453750000000001,"d":"9.45"}},{"$f":"IF(AND(Z$16*1>=$R50,Z$16*1<=$D$8,$R50<$D$8,$P50>SUM($V50:Y50)),IF(SUM($P50*$U50/12,$V50:Y50)>$P50,$P50-SUM($V50:Y50),$P50*$U50/12),0)","v":{"v":9.453750000000001,"d":"9.45"}},{"$f":"IF(AND(AA$16*1>=$R50,AA$16*1<=$D$8,$R50<$D$8,$P50>SUM($V50:Z50)),IF(SUM($P50*$U50/12,$V50:Z50)>$P50,$P50-SUM($V50:Z50),$P50*$U50/12),0)","v":{"v":9.453750000000001,"d":"9.45"}},{"$f":"IF(AND(AB$16*1>=$R50,AB$16*1<=$D$8,$R50<$D$8,$P50>SUM($V50:AA50)),IF(SUM($P50*$U50/12,$V50:AA50)>$P50,$P50-SUM($V50:AA50),$P50*$U50/12),0)","v":{"v":0,"d":"0.00"}},{"$f":"IF(AND(AC$16*1>=$R50,AC$16*1<=$D$8,$R50<$D$8,$P50>SUM($V50:AB50)),IF(SUM($P50*$U50/12,$V50:AB50)>$P50,$P50-SUM($V50:AB50),$P50*$U50/12),0)","v":{"v":0,"d":"0.00"}},{"$f":"IF(AND(AD$16*1>=$R50,AD$16*1<=$D$8,$R50<$D$8,$P50>SUM($V50:AC50)),IF(SUM($P50*$U50/12,$V50:AC50)>$P50,$P50-SUM($V50:AC50),$P50*$U50/12),0)","v":{"v":0,"d":"0.00"}},{"$f":"IF(AND(AE$16*1>=$R50,AE$16*1<=$D$8,$R50<$D$8,$P50>SUM($V50:AD50)),IF(SUM($P50*$U50/12,$V50:AD50)>$P50,$P50-SUM($V50:AD50),$P50*$U50/12),0)","v":{"v":0,"d":"0.00"}},{"$f":"IF(AND(AF$16*1>=$R50,AF$16*1<=$D$8,$R50<$D$8,$P50>SUM($V50:AE50)),IF(SUM($P50*$U50/12,$V50:AE50)>$P50,$P50-SUM($V50:AE50),$P50*$U50/12),0)","v":{"v":0,"d":"0.00"}},{"$f":"IF(AND(AG$16*1>=$R50,AG$16*1<=$D$8,$R50<$D$8,$P50>SUM($V50:AF50)),IF(SUM($P50*$U50/12,$V50:AF50)>$P50,$P50-SUM($V50:AF50),$P50*$U50/12),0)","v":{"v":0,"d":"0.00"}},{"$f":"IF(AND(AH$16*1>=$R50,AH$16*1<=$D$8,$R50<$D$8,$P50>SUM($V50:AG50)),IF(SUM($P50*$U50/12,$V50:AG50)>$P50,$P50-SUM($V50:AG50),$P50*$U50/12),0)","v":{"v":0,"d":"0.00"}},{"v":47.268750000000004,"d":"47.27"},null,null,{"v":831.9612500000001,"d":"831.96"},null,{"v":831.9612500000001,"d":"831.96"}]
[null,null,35,"335111","2 ARMARIOS METAL NEGRO 2 PTAS.",{"$nulls":3},546.22,{"$nulls":4},546.22,null,546.22,"2011-11-26","2011-12-01",null,null,{"v":0.1,"d":"10%"},386.89,{"$f":"IF(AND(W$16*1>=$R51,W$16*1<=$D$8,$R51<$D$8,$P51>SUM($V51:V51)),IF(SUM($P51*$U51/12,$V51:V51)>$P51,$P51-SUM($V51:V51),$P51*$U51/12),0)","v":{"v":4.551833333333334,"d":"4.55"}},{"$f":"IF(AND(X$16*1>=$R51,X$16*1<=$D$8,$R51<$D$8,$P51>SUM($V51:W51)),IF(SUM($P51*$U51/12,$V51:W51)>$P51,$P51-SUM($V51:W51),$P51*$U51/12),0)","v":{"v":4.551833333333334,"d":"4.55"}},{"$f":"IF(AND(Y$16*1>=$R51,Y$16*1<=$D$8,$R51<$D$8,$P51>SUM($V51:X51)),IF(SUM($P51*$U51/12,$V51:X51)>$P51,$P51-SUM($V51:X51),$P51*$U51/12),0)","v":{"v":4.551833333333334,"d":"4.55"}},{"$f":"IF(AND(Z$16*1>=$R51,Z$16*1<=$D$8,$R51<$D$8,$P51>SUM($V51:Y51)),IF(SUM($P51*$U51/12,$V51:Y51)>$P51,$P51-SUM($V51:Y51),$P51*$U51/12),0)","v":{"v":4.551833333333334,"d":"4.55"}},{"$f":"IF(AND(AA$16*1>=$R51,AA$16*1<=$D$8,$R51<$D$8,$P51>SUM($V51:Z51)),IF(SUM($P51*$U51/12,$V51:Z51)>$P51,$P51-SUM($V51:Z51),$P51*$U51/12),0)","v":{"v":4.551833333333334,"d":"4.55"}},{"$f":"IF(AND(AB$16*1>=$R51,AB$16*1<=$D$8,$R51<$D$8,$P51>SUM($V51:AA51)),IF(SUM($P51*$U51/12,$V51:AA51)>$P51,$P51-SUM($V51:AA51),$P51*$U51/12),0)","v":{"v":0,"d":"0.00"}},{"$f":"IF(AND(AC$16*1>=$R51,AC$16*1<=$D$8,$R51<$D$8,$P51>SUM($V51:AB51)),IF(SUM($P51*$U51/12,$V51:AB51)>$P51,$P51-SUM($V51:AB51),$P51*$U51/12),0)","v":{"v":0,"d":"0.00"}},{"$f":"IF(AND(AD$16*1>=$R51,AD$16*1<=$D$8,$R51<$D$8,$P51>SUM($V51:AC51)),IF(SUM($P51*$U51/12,$V51:AC51)>$P51,$P51-SUM($V51:AC51),$P51*$U51/12),0)","v":{"v":0,"d":"0.00"}},{"$f":"IF(AND(AE$16*1>=$R51,AE$16*1<=$D$8,$R51<$D$8,$P51>SUM($V51:AD51)),IF(SUM($P51*$U51/12,$V51:AD51)>$P51,$P51-SUM($V51:AD51),$P51*$U51/12),0)","v":{"v":0,"d":"0.00"}},{"$f":"IF(AND(AF$16*1>=$R51,AF$16*1<=$D$8,$R51<$D$8,$P51>SUM($V51:AE51)),IF(SUM($P51*$U51/12,$V51:AE51)>$P51,$P51-SUM($V51:AE51),$P51*$U51/12),0)","v":{"v":0,"d":"0.00"}},{"$f":"IF(AND(AG$16*1>=$R51,AG$16*1<=$D$8,$R51<$D$8,$P51>SUM($V51:AF51)),IF(SUM($P51*$U51/12,$V51:AF51)>$P51,$P51-SUM($V51:AF51),$P51*$U51/12),0)","v":{"v":0,"d":"0.00"}},{"$f":"IF(AND(AH$16*1>=$R51,AH$16*1<=$D$8,$R51<$D$8,$P51>SUM($V51:AG51)),IF(SUM($P51*$U51/12,$V51:AG51)>$P51,$P51-SUM($V51:AG51),$P51*$U51/12),0)","v":{"v":0,"d":"0.00"}},{"v":22.75916666666667,"d":"22.76"},null,null,{"v":400.5455,"d":"400.55"},null,{"v":400.5455,"d":"400.55"}]
[null,null,36,"335111","ARMARIO METAL NEGRO 2 PTAS.",{"$nulls":3},273.11,{"$nulls":4},273.11,null,273.11,"2012-04-17","2012-05-01",null,null,{"v":0.1,"d":"10%"},182.07,{"$f":"IF(AND(W$16*1>=$R52,W$16*1<=$D$8,$R52<$D$8,$P52>SUM($V52:V52)),IF(SUM($P52*$U52/12,$V52:V52)>$P52,$P52-SUM($V52:V52),$P52*$U52/12),0)","v":{"v":2.275916666666667,"d":"2.28"}},{"$f":"IF(AND(X$16*1>=$R52,X$16*1<=$D$8,$R52<$D$8,$P52>SUM($V52:W52)),IF(SUM($P52*$U52/12,$V52:W52)>$P52,$P52-SUM($V52:W52),$P52*$U52/12),0)","v":{"v":2.275916666666667,"d":"2.28"}},{"$f":"IF(AND(Y$16*1>=$R52,Y$16*1<=$D$8,$R52<$D$8,$P52>SUM($V52:X52)),IF(SUM($P52*$U52/12,$V52:X52)>$P52,$P52-SUM($V52:X52),$P52*$U52/12),0)","v":{"v":2.275916666666667,"d":"2.28"}},{"$f":"IF(AND(Z$16*1>=$R52,Z$16*1<=$D$8,$R52<$D$8,$P52>SUM($V52:Y52)),IF(SUM($P52*$U52/12,$V52:Y52)>$P52,$P52-SUM($V52:Y52),$P52*$U52/12),0)","v":{"v":2.275916666666667,"d":"2.28"}},{"$f":"IF(AND(AA$16*1>=$R52,AA$16*1<=$D$8,$R52<$D$8,$P52>SUM($V52:Z52)),IF(SUM($P52*$U52/12,$V52:Z52)>$P52,$P52-SUM($V52:Z52),$P52*$U52/12),0)","v":{"v":2.275916666666667,"d":"2.28"}},{"$f":"IF(AND(AB$16*1>=$R52,AB$16*1<=$D$8,$R52<$D$8,$P52>SUM($V52:AA52)),IF(SUM($P52*$U52/12,$V52:AA52)>$P52,$P52-SUM($V52:AA52),$P52*$U52/12),0)","v":{"v":0,"d":"0.00"}},{"$f":"IF(AND(AC$16*1>=$R52,AC$16*1<=$D$8,$R52<$D$8,$P52>SUM($V52:AB52)),IF(SUM($P52*$U52/12,$V52:AB52)>$P52,$P52-SUM($V52:AB52),$P52*$U52/12),0)","v":{"v":0,"d":"0.00"}},{"$f":"IF(AND(AD$16*1>=$R52,AD$16*1<=$D$8,$R52<$D$8,$P52>SUM($V52:AC52)),IF(SUM($P52*$U52/12,$V52:AC52)>$P52,$P52-SUM($V52:AC52),$P52*$U52/12),0)","v":{"v":0,"d":"0.00"}},{"$f":"IF(AND(AE$16*1>=$R52,AE$16*1<=$D$8,$R52<$D$8,$P52>SUM($V52:AD52)),IF(SUM($P52*$U52/12,$V52:AD52)>$P52,$P52-SUM($V52:AD52),$P52*$U52/12),0)","v":{"v":0,"d":"0.00"}},{"$f":"IF(AND(AF$16*1>=$R52,AF$16*1<=$D$8,$R52<$D$8,$P52>SUM($V52:AE52)),IF(SUM($P52*$U52/12,$V52:AE52)>$P52,$P52-SUM($V52:AE52),$P52*$U52/12),0)","v":{"v":0,"d":"0.00"}},{"$f":"IF(AND(AG$16*1>=$R52,AG$16*1<=$D$8,$R52<$D$8,$P52>SUM($V52:AF52)),IF(SUM($P52*$U52/12,$V52:AF52)>$P52,$P52-SUM($V52:AF52),$P52*$U52/12),0)","v":{"v":0,"d":"0.00"}},{"$f":"IF(AND(AH$16*1>=$R52,AH$16*1<=$D$8,$R52<$D$8,$P52>SUM($V52:AG52)),IF(SUM($P52*$U52/12,$V52:AG52)>$P52,$P52-SUM($V52:AG52),$P52*$U52/12),0)","v":{"v":0,"d":"0.00"}},{"v":11.379583333333334,"d":"11.38"},null,null,{"v":188.89775,"d":"188.90"},null,{"v":188.89775,"d":"188.90"}]
[null,null,37,"335111","ARMARIO METAL NEGRO 2 PTAS(contab)",{"$nulls":3},319.33,{"$nulls":4},319.33,null,319.33,"2013-08-06","2013-09-01",null,null,{"v":0.1,"d":"10%"},170.29,{"$f":"IF(AND(W$16*1>=$R53,W$16*1<=$D$8,$R53<$D$8,$P53>SUM($V53:V53)),IF(SUM($P53*$U53/12,$V53:V53)>$P53,$P53-SUM($V53:V53),$P53*$U53/12),0)","v":{"v":2.6610833333333335,"d":"2.66"}},{"$f":"IF(AND(X$16*1>=$R53,X$16*1<=$D$8,$R53<$D$8,$P53>SUM($V53:W53)),IF(SUM($P53*$U53/12,$V53:W53)>$P53,$P53-SUM($V53:W53),$P53*$U53/12),0)","v":{"v":2.6610833333333335,"d":"2.66"}},{"$f":"IF(AND(Y$16*1>=$R53,Y$16*1<=$D$8,$R53<$D$8,$P53>SUM($V53:X53)),IF(SUM($P53*$U53/12,$V53:X53)>$P53,$P53-SUM($V53:X53),$P53*$U53/12),0)","v":{"v":2.6610833333333335,"d":"2.66"}},{"$f":"IF(AND(Z$16*1>=$R53,Z$16*1<=$D$8,$R53<$D$8,$P53>SUM($V53:Y53)),IF(SUM($P53*$U53/12,$V53:Y53)>$P53,$P53-SUM($V53:Y53),$P53*$U53/12),0)","v":{"v":2.6610833333333335,"d":"2.66"}},{"$f":"IF(AND(AA$16*1>=$R53,AA$16*1<=$D$8,$R53<$D$8,$P53>SUM($V53:Z53)),IF(SUM($P53*$U53/12,$V53:Z53)>$P53,$P53-SUM($V53:Z53),$P53*$U53/12),0)","v":{"v":2.6610833333333335,"d":"2.66"}},{"$f":"IF(AND(AB$16*1>=$R53,AB$16*1<=$D$8,$R53<$D$8,$P53>SUM($V53:AA53)),IF(SUM($P53*$U53/12,$V53:AA53)>$P53,$P53-SUM($V53:AA53),$P53*$U53/12),0)","v":{"v":0,"d":"0.00"}},{"$f":"IF(AND(AC$16*1>=$R53,AC$16*1<=$D$8,$R53<$D$8,$P53>SUM($V53:AB53)),IF(SUM($P53*$U53/12,$V53:AB53)>$P53,$P53-SUM($V53:AB53),$P53*$U53/12),0)","v":{"v":0,"d":"0.00"}},{"$f":"IF(AND(AD$16*1>=$R53,AD$16*1<=$D$8,$R53<$D$8,$P53>SUM($V53:AC53)),IF(SUM($P53*$U53/12,$V53:AC53)>$P53,$P53-SUM($V53:AC53),$P53*$U53/12),0)","v":{"v":0,"d":"0.00"}},{"$f":"IF(AND(AE$16*1>=$R53,AE$16*1<=$D$8,$R53<$D$8,$P53>SUM($V53:AD53)),IF(SUM($P53*$U53/12,$V53:AD53)>$P53,$P53-SUM($V53:AD53),$P53*$U53/12),0)","v":{"v":0,"d":"0.00"}},{"$f":"IF(AND(AF$16*1>=$R53,AF$16*1<=$D$8,$R53<$D$8,$P53>SUM($V53:AE53)),IF(SUM($P53*$U53/12,$V53:AE53)>$P53,$P53-SUM($V53:AE53),$P53*$U53/12),0)","v":{"v":0,"d":"0.00"}},{"$f":"IF(AND(AG$16*1>=$R53,AG$16*1<=$D$8,$R53<$D$8,$P53>SUM($V53:AF53)),IF(SUM($P53*$U53/12,$V53:AF53)>$P53,$P53-SUM($V53:AF53),$P53*$U53/12),0)","v":{"v":0,"d":"0.00"}},{"$f":"IF(AND(AH$16*1>=$R53,AH$16*1<=$D$8,$R53<$D$8,$P53>SUM($V53:AG53)),IF(SUM($P53*$U53/12,$V53:AG53)>$P53,$P53-SUM($V53:AG53),$P53*$U53/12),0)","v":{"v":0,"d":"0.00"}},{"v":13.305416666666668,"d":"13.31"},null,null,{"v":178.27325,"d":"178.27"},null,{"v":178.27325,"d":"178.27"}]
[null,null,38,"335111","ARCHIVADOR MADERA MARRON 4 GAVETAS (DR)",{"$nulls":3},277.31,{"$nulls":4},277.31,null,277.31,"2015-10-20","2015-11-01",null,null,{"v":0.1,"d":"10%"},87.81,{"$f":"IF(AND(W$16*1>=$R54,W$16*1<=$D$8,$R54<$D$8,$P54>SUM($V54:V54)),IF(SUM($P54*$U54/12,$V54:V54)>$P54,$P54-SUM($V54:V54),$P54*$U54/12),0)","v":{"v":2.310916666666667,"d":"2.31"}},{"$f":"IF(AND(X$16*1>=$R54,X$16*1<=$D$8,$R54<$D$8,$P54>SUM($V54:W54)),IF(SUM($P54*$U54/12,$V54:W54)>$P54,$P54-SUM($V54:W54),$P54*$U54/12),0)","v":{"v":2.310916666666667,"d":"2.31"}},{"$f":"IF(AND(Y$16*1>=$R54,Y$16*1<=$D$8,$R54<$D$8,$P54>SUM($V54:X54)),IF(SUM($P54*$U54/12,$V54:X54)>$P54,$P54-SUM($V54:X54),$P54*$U54/12),0)","v":{"v":2.310916666666667,"d":"2.31"}},{"$f":"IF(AND(Z$16*1>=$R54,Z$16*1<=$D$8,$R54<$D$8,$P54>SUM($V54:Y54)),IF(SUM($P54*$U54/12,$V54:Y54)>$P54,$P54-SUM($V54:Y54),$P54*$U54/12),0)","v":{"v":2.310916666666667,"d":"2.31"}},{"$f":"IF(AND(AA$16*1>=$R54,AA$16*1<=$D$8,$R54<$D$8,$P54>SUM($V54:Z54)),IF(SUM($P54*$U54/12,$V54:Z54)>$P54,$P54-SUM($V54:Z54),$P54*$U54/12),0)","v":{"v":2.310916666666667,"d":"2.31"}},{"$f":"IF(AND(AB$16*1>=$R54,AB$16*1<=$D$8,$R54<$D$8,$P54>SUM($V54:AA54)),IF(SUM($P54*$U54/12,$V54:AA54)>$P54,$P54-SUM($V54:AA54),$P54*$U54/12),0)","v":{"v":0,"d":"0.00"}},{"$f":"IF(AND(AC$16*1>=$R54,AC$16*1<=$D$8,$R54<$D$8,$P54>SUM($V54:AB54)),IF(SUM($P54*$U54/12,$V54:AB54)>$P54,$P54-SUM($V54:AB54),$P54*$U54/12),0)","v":{"v":0,"d":"0.00"}},{"$f":"IF(AND(AD$16*1>=$R54,AD$16*1<=$D$8,$R54<$D$8,$P54>SUM($V54:AC54)),IF(SUM($P54*$U54/12,$V54:AC54)>$P54,$P54-SUM($V54:AC54),$P54*$U54/12),0)","v":{"v":0,"d":"0.00"}},{"$f":"IF(AND(AE$16*1>=$R54,AE$16*1<=$D$8,$R54<$D$8,$P54>SUM($V54:AD54)),IF(SUM($P54*$U54/12,$V54:AD54)>$P54,$P54-SUM($V54:AD54),$P54*$U54/12),0)","v":{"v":0,"d":"0.00"}},{"$f":"IF(AND(AF$16*1>=$R54,AF$16*1<=$D$8,$R54<$D$8,$P54>SUM($V54:AE54)),IF(SUM($P54*$U54/12,$V54:AE54)>$P54,$P54-SUM($V54:AE54),$P54*$U54/12),0)","v":{"v":0,"d":"0.00"}},{"$f":"IF(AND(AG$16*1>=$R54,AG$16*1<=$D$8,$R54<$D$8,$P54>SUM($V54:AF54)),IF(SUM($P54*$U54/12,$V54:AF54)>$P54,$P54-SUM($V54:AF54),$P54*$U54/12),0)","v":{"v":0,"d":"0.00"}},{"$f":"IF(AND(AH$16*1>=$R54,AH$16*1<=$D$8,$R54<$D$8,$P54>SUM($V54:AG54)),IF(SUM($P54*$U54/12,$V54:AG54)>$P54,$P54-SUM($V54:AG54),$P54*$U54/12),0)","v":{"v":0,"d":"0.00"}},{"v":11.554583333333335,"d":"11.55"},null,null,{"v":94.74275,"d":"94.74"},null,{"v":94.74275,"d":"94.74"}]
[null,null,39,"335111","ARCHIVADOR MADERA MARRON 4 GAVETAS (FC)",{"$nulls":3},277.31,{"$nulls":4},277.31,null,277.31,"2015-11-14","2015-12-01",null,null,{"v":0.1,"d":"10%"},{"v":85.5,"d":"85.50"},{"$f":"IF(AND(W$16*1>=$R55,W$16*1<=$D$8,$R55<$D$8,$P55>SUM($V55:V55)),IF(SUM($P55*$U55/12,$V55:V55)>$P55,$P55-SUM($V55:V55),$P55*$U55/12),0)","v":{"v":2.310916666666667,"d":"2.31"}},{"$f":"IF(AND(X$16*1>=$R55,X$16*1<=$D$8,$R55<$D$8,$P55>SUM($V55:W55)),IF(SUM($P55*$U55/12,$V55:W55)>$P55,$P55-SUM($V55:W55),$P55*$U55/12),0)","v":{"v":2.310916666666667,"d":"2.31"}},{"$f":"IF(AND(Y$16*1>=$R55,Y$16*1<=$D$8,$R55<$D$8,$P55>SUM($V55:X55)),IF(SUM($P55*$U55/12,$V55:X55)>$P55,$P55-SUM($V55:X55),$P55*$U55/12),0)","v":{"v":2.310916666666667,"d":"2.31"}},{"$f":"IF(AND(Z$16*1>=$R55,Z$16*1<=$D$8,$R55<$D$8,$P55>SUM($V55:Y55)),IF(SUM($P55*$U55/12,$V55:Y55)>$P55,$P55-SUM($V55:Y55),$P55*$U55/12),0)","v":{"v":2.310916666666667,"d":"2.31"}},{"$f":"IF(AND(AA$16*1>=$R55,AA$16*1<=$D$8,$R55<$D$8,$P55>SUM($V55:Z55)),IF(SUM($P55*$U55/12,$V55:Z55)>$P55,$P55-SUM($V55:Z55),$P55*$U55/12),0)","v":{"v":2.310916666666667,"d":"2.31"}},{"$f":"IF(AND(AB$16*1>=$R55,AB$16*1<=$D$8,$R55<$D$8,$P55>SUM($V55:AA55)),IF(SUM($P55*$U55/12,$V55:AA55)>$P55,$P55-SUM($V55:AA55),$P55*$U55/12),0)","v":{"v":0,"d":"0.00"}},{"$f":"IF(AND(AC$16*1>=$R55,AC$16*1<=$D$8,$R55<$D$8,$P55>SUM($V55:AB55)),IF(SUM($P55*$U55/12,$V55:AB55)>$P55,$P55-SUM($V55:AB55),$P55*$U55/12),0)","v":{"v":0,"d":"0.00"}},{"$f":"IF(AND(AD$16*1>=$R55,AD$16*1<=$D$8,$R55<$D$8,$P55>SUM($V55:AC55)),IF(SUM($P55*$U55/12,$V55:AC55)>$P55,$P55-SUM($V55:AC55),$P55*$U55/12),0)","v":{"v":0,"d":"0.00"}},{"$f":"IF(AND(AE$16*1>=$R55,AE$16*1<=$D$8,$R55<$D$8,$P55>SUM($V55:AD55)),IF(SUM($P55*$U55/12,$V55:AD55)>$P55,$P55-SUM($V55:AD55),$P55*$U55/12),0)","v":{"v":0,"d":"0.00"}},{"$f":"IF(AND(AF$16*1>=$R55,AF$16*1<=$D$8,$R55<$D$8,$P55>SUM($V55:AE55)),IF(SUM($P55*$U55/12,$V55:AE55)>$P55,$P55-SUM($V55:AE55),$P55*$U55/12),0)","v":{"v":0,"d":"0.00"}},{"$f":"IF(AND(AG$16*1>=$R55,AG$16*1<=$D$8,$R55<$D$8,$P55>SUM($V55:AF55)),IF(SUM($P55*$U55/12,$V55:AF55)>$P55,$P55-SUM($V55:AF55),$P55*$U55/12),0)","v":{"v":0,"d":"0.00"}},{"$f":"IF(AND(AH$16*1>=$R55,AH$16*1<=$D$8,$R55<$D$8,$P55>SUM($V55:AG55)),IF(SUM($P55*$U55/12,$V55:AG55)>$P55,$P55-SUM($V55:AG55),$P55*$U55/12),0)","v":{"v":0,"d":"0.00"}},{"v":11.554583333333335,"d":"11.55"},null,null,{"v":92.43275,"d":"92.43"},null,{"v":92.43275,"d":"92.43"}]
[null,null,40,"335111","COUNTER RECEPC.MOD.LINEAL240",{"$nulls":3},1313.56,{"$nulls":4},1313.56,null,{"v":1313.56,"d":"1,313.56"},"2016-11-22","2016-12-01",null,null,{"v":0.1,"d":"10%"},273.67,{"$f":"IF(AND(W$16*1>=$R56,W$16*1<=$D$8,$R56<$D$8,$P56>SUM($V56:V56)),IF(SUM($P56*$U56/12,$V56:V56)>$P56,$P56-SUM($V56:V56),$P56*$U56/12),0)","v":{"v":10.946333333333333,"d":"10.95"}},{"$f":"IF(AND(X$16*1>=$R56,X$16*1<=$D$8,$R56<$D$8,$P56>SUM($V56:W56)),IF(SUM($P56*$U56/12,$V56:W56)>$P56,$P56-SUM($V56:W56),$P56*$U56/12),0)","v":{"v":10.946333333333333,"d":"10.95"}},{"$f":"IF(AND(Y$16*1>=$R56,Y$16*1<=$D$8,$R56<$D$8,$P56>SUM($V56:X56)),IF(SUM($P56*$U56/12,$V56:X56)>$P56,$P56-SUM($V56:X56),$P56*$U56/12),0)","v":{"v":10.946333333333333,"d":"10.95"}},{"$f":"IF(AND(Z$16*1>=$R56,Z$16*1<=$D$8,$R56<$D$8,$P56>SUM($V56:Y56)),IF(SUM($P56*$U56/12,$V56:Y56)>$P56,$P56-SUM($V56:Y56),$P56*$U56/12),0)","v":{"v":10.946333333333333,"d":"10.95"}},{"$f":"IF(AND(AA$16*1>=$R56,AA$16*1<=$D$8,$R56<$D$8,$P56>SUM($V56:Z56)),IF(SUM($P56*$U56/12,$V56:Z56)>$P56,$P56-SUM($V56:Z56),$P56*$U56/12),0)","v":{"v":10.946333333333333,"d":"10.95"}},{"$f":"IF(AND(AB$16*1>=$R56,AB$16*1<=$D$8,$R56<$D$8,$P56>SUM($V56:AA56)),IF(SUM($P56*$U56/12,$V56:AA56)>$P56,$P56-SUM($V56:AA56),$P56*$U56/12),0)","v":{"v":0,"d":"0.00"}},{"$f":"IF(AND(AC$16*1>=$R56,AC$16*1<=$D$8,$R56<$D$8,$P56>SUM($V56:AB56)),IF(SUM($P56*$U56/12,$V56:AB56)>$P56,$P56-SUM($V56:AB56),$P56*$U56/12),0)","v":{"v":0,"d":"0.00"}},{"$f":"IF(AND(AD$16*1>=$R56,AD$16*1<=$D$8,$R56<$D$8,$P56>SUM($V56:AC56)),IF(SUM($P56*$U56/12,$V56:AC56)>$P56,$P56-SUM($V56:AC56),$P56*$U56/12),0)","v":{"v":0,"d":"0.00"}},{"$f":"IF(AND(AE$16*1>=$R56,AE$16*1<=$D$8,$R56<$D$8,$P56>SUM($V56:AD56)),IF(SUM($P56*$U56/12,$V56:AD56)>$P56,$P56-SUM($V56:AD56),$P56*$U56/12),0)","v":{"v":0,"d":"0.00"}},{"$f":"IF(AND(AF$16*1>=$R56,AF$16*1<=$D$8,$R56<$D$8,$P56>SUM($V56:AE56)),IF(SUM($P56*$U56/12,$V56:AE56)>$P56,$P56-SUM($V56:AE56),$P56*$U56/12),0)","v":{"v":0,"d":"0.00"}},{"$f":"IF(AND(AG$16*1>=$R56,AG$16*1<=$D$8,$R56<$D$8,$P56>SUM($V56:AF56)),IF(SUM($P56*$U56/12,$V56:AF56)>$P56,$P56-SUM($V56:AF56),$P56*$U56/12),0)","v":{"v":0,"d":"0.00"}},{"$f":"IF(AND(AH$16*1>=$R56,AH$16*1<=$D$8,$R56<$D$8,$P56>SUM($V56:AG56)),IF(SUM($P56*$U56/12,$V56:AG56)>$P56,$P56-SUM($V56:AG56),$P56*$U56/12),0)","v":{"v":0,"d":"0.00"}},{"v":54.73166666666667,"d":"54.73"},null,null,{"v":306.509,"d":"306.51"},null,{"v":306.509,"d":"306.51"}]
[null,null,41,"335111","ARMARIO METAL NEGR.2pta.(contab.)",{"$nulls":3},317.8,{"$nulls":4},317.8,null,{"v":317.8,"d":"317.80"},"2016-12-19","2017-01-01",null,null,{"v":0.1,"d":"10%"},63.56,{"$f":"IF(AND(W$16*1>=$R57,W$16*1<=$D$8,$R57<$D$8,$P57>SUM($V57:V57)),IF(SUM($P57*$U57/12,$V57:V57)>$P57,$P57-SUM($V57:V57),$P57*$U57/12),0)","v":{"v":2.6483333333333334,"d":"2.65"}},{"$f":"IF(AND(X$16*1>=$R57,X$16*1<=$D$8,$R57<$D$8,$P57>SUM($V57:W57)),IF(SUM($P57*$U57/12,$V57:W57)>$P57,$P57-SUM($V57:W57),$P57*$U57/12),0)","v":{"v":2.6483333333333334,"d":"2.65"}},{"$f":"IF(AND(Y$16*1>=$R57,Y$16*1<=$D$8,$R57<$D$8,$P57>SUM($V57:X57)),IF(SUM($P57*$U57/12,$V57:X57)>$P57,$P57-SUM($V57:X57),$P57*$U57/12),0)","v":{"v":2.6483333333333334,"d":"2.65"}},{"$f":"IF(AND(Z$16*1>=$R57,Z$16*1<=$D$8,$R57<$D$8,$P57>SUM($V57:Y57)),IF(SUM($P57*$U57/12,$V57:Y57)>$P57,$P57-SUM($V57:Y57),$P57*$U57/12),0)","v":{"v":2.6483333333333334,"d":"2.65"}},{"$f":"IF(AND(AA$16*1>=$R57,AA$16*1<=$D$8,$R57<$D$8,$P57>SUM($V57:Z57)),IF(SUM($P57*$U57/12,$V57:Z57)>$P57,$P57-SUM($V57:Z57),$P57*$U57/12),0)","v":{"v":2.6483333333333334,"d":"2.65"}},{"$f":"IF(AND(AB$16*1>=$R57,AB$16*1<=$D$8,$R57<$D$8,$P57>SUM($V57:AA57)),IF(SUM($P57*$U57/12,$V57:AA57)>$P57,$P57-SUM($V57:AA57),$P57*$U57/12),0)","v":{"v":0,"d":"0.00"}},{"$f":"IF(AND(AC$16*1>=$R57,AC$16*1<=$D$8,$R57<$D$8,$P57>SUM($V57:AB57)),IF(SUM($P57*$U57/12,$V57:AB57)>$P57,$P57-SUM($V57:AB57),$P57*$U57/12),0)","v":{"v":0,"d":"0.00"}},{"$f":"IF(AND(AD$16*1>=$R57,AD$16*1<=$D$8,$R57<$D$8,$P57>SUM($V57:AC57)),IF(SUM($P57*$U57/12,$V57:AC57)>$P57,$P57-SUM($V57:AC57),$P57*$U57/12),0)","v":{"v":0,"d":"0.00"}},{"$f":"IF(AND(AE$16*1>=$R57,AE$16*1<=$D$8,$R57<$D$8,$P57>SUM($V57:AD57)),IF(SUM($P57*$U57/12,$V57:AD57)>$P57,$P57-SUM($V57:AD57),$P57*$U57/12),0)","v":{"v":0,"d":"0.00"}},{"$f":"IF(AND(AF$16*1>=$R57,AF$16*1<=$D$8,$R57<$D$8,$P57>SUM($V57:AE57)),IF(SUM($P57*$U57/12,$V57:AE57)>$P57,$P57-SUM($V57:AE57),$P57*$U57/12),0)","v":{"v":0,"d":"0.00"}},{"$f":"IF(AND(AG$16*1>=$R57,AG$16*1<=$D$8,$R57<$D$8,$P57>SUM($V57:AF57)),IF(SUM($P57*$U57/12,$V57:AF57)>$P57,$P57-SUM($V57:AF57),$P57*$U57/12),0)","v":{"v":0,"d":"0.00"}},{"$f":"IF(AND(AH$16*1>=$R57,AH$16*1<=$D$8,$R57<$D$8,$P57>SUM($V57:AG57)),IF(SUM($P57*$U57/12,$V57:AG57)>$P57,$P57-SUM($V57:AG57),$P57*$U57/12),0)","v":{"v":0,"d":"0.00"}},{"v":13.241666666666667,"d":"13.24"},null,null,{"v":71.505,"d":"71.51"},null,{"v":71.505,"d":"71.51"}]
[null,null,42,"335111","ARMARIO METAL NEGR.2pta.(contab.)",{"$nulls":3},317.79,{"$nulls":4},317.79,null,317.79,"2016-12-19","2017-01-01",null,null,{"v":0.1,"d":"10%"},63.56,{"$f":"IF(AND(W$16*1>=$R58,W$16*1<=$D$8,$R58<$D$8,$P58>SUM($V58:V58)),IF(SUM($P58*$U58/12,$V58:V58)>$P58,$P58-SUM($V58:V58),$P58*$U58/12),0)","v":{"v":2.6482500000000004,"d":"2.65"}},{"$f":"IF(AND(X$16*1>=$R58,X$16*1<=$D$8,$R58<$D$8,$P58>SUM($V58:W58)),IF(SUM($P58*$U58/12,$V58:W58)>$P58,$P58-SUM($V58:W58),$P58*$U58/12),0)","v":{"v":2.6482500000000004,"d":"2.65"}},{"$f":"IF(AND(Y$16*1>=$R58,Y$16*1<=$D$8,$R58<$D$8,$P58>SUM($V58:X58)),IF(SUM($P58*$U58/12,$V58:X58)>$P58,$P58-SUM($V58:X58),$P58*$U58/12),0)","v":{"v":2.6482500000000004,"d":"2.65"}},{"$f":"IF(AND(Z$16*1>=$R58,Z$16*1<=$D$8,$R58<$D$8,$P58>SUM($V58:Y58)),IF(SUM($P58*$U58/12,$V58:Y58)>$P58,$P58-SUM($V58:Y58),$P58*$U58/12),0)","v":{"v":2.6482500000000004,"d":"2.65"}},{"$f":"IF(AND(AA$16*1>=$R58,AA$16*1<=$D$8,$R58<$D$8,$P58>SUM($V58:Z58)),IF(SUM($P58*$U58/12,$V58:Z58)>$P58,$P58-SUM($V58:Z58),$P58*$U58/12),0)","v":{"v":2.6482500000000004,"d":"2.65"}},{"$f":"IF(AND(AB$16*1>=$R58,AB$16*1<=$D$8,$R58<$D$8,$P58>SUM($V58:AA58)),IF(SUM($P58*$U58/12,$V58:AA58)>$P58,$P58-SUM($V58:AA58),$P58*$U58/12),0)","v":{"v":0,"d":"0.00"}},{"$f":"IF(AND(AC$16*1>=$R58,AC$16*1<=$D$8,$R58<$D$8,$P58>SUM($V58:AB58)),IF(SUM($P58*$U58/12,$V58:AB58)>$P58,$P58-SUM($V58:AB58),$P58*$U58/12),0)","v":{"v":0,"d":"0.00"}},{"$f":"IF(AND(AD$16*1>=$R58,AD$16*1<=$D$8,$R58<$D$8,$P58>SUM($V58:AC58)),IF(SUM($P58*$U58/12,$V58:AC58)>$P58,$P58-SUM($V58:AC58),$P58*$U58/12),0)","v":{"v":0,"d":"0.00"}},{"$f":"IF(AND(AE$16*1>=$R58,AE$16*1<=$D$8,$R58<$D$8,$P58>SUM($V58:AD58)),IF(SUM($P58*$U58/12,$V58:AD58)>$P58,$P58-SUM($V58:AD58),$P58*$U58/12),0)","v":{"v":0,"d":"0.00"}},{"$f":"IF(AND(AF$16*1>=$R58,AF$16*1<=$D$8,$R58<$D$8,$P58>SUM($V58:AE58)),IF(SUM($P58*$U58/12,$V58:AE58)>$P58,$P58-SUM($V58:AE58),$P58*$U58/12),0)","v":{"v":0,"d":"0.00"}},{"$f":"IF(AND(AG$16*1>=$R58,AG$16*1<=$D$8,$R58<$D$8,$P58>SUM($V58:AF58)),IF(SUM($P58*$U58/12,$V58:AF58)>$P58,$P58-SUM($V58:AF58),$P58*$U58/12),0)","v":{"v":0,"d":"0.00"}},{"$f":"IF(AND(AH$16*1>=$R58,AH$16*1<=$D$8,$R58<$D$8,$P58>SUM($V58:AG58)),IF(SUM($P58*$U58/12,$V58:AG58)>$P58,$P58-SUM($V58:AG58),$P58*$U58/12),0)","v":{"v":0,"d":"0.00"}},{"v":13.241250000000003,"d":"13.24"},null,null,{"v":71.50475,"d":"71.50"},null,{"v":71.50475,"d":"71.50"}]
[null,null,43,"335111","ARCHIVADOR METAL NEG.4GAVET(DR)",{"$nulls":3},279.66,{"$nulls":4},279.66,null,279.66,"2016-12-20","2017-01-01",null,null,{"v":0.1,"d":"10%"},55.94,{"$f":"IF(AND(W$16*1>=$R59,W$16*1<=$D$8,$R59<$D$8,$P59>SUM($V59:V59)),IF(SUM($P59*$U59/12,$V59:V59)>$P59,$P59-SUM($V59:V59),$P59*$U59/12),0)","v":{"v":2.3305000000000002,"d":"2.33"}},{"$f":"IF(AND(X$16*1>=$R59,X$16*1<=$D$8,$R59<$D$8,$P59>SUM($V59:W59)),IF(SUM($P59*$U59/12,$V59:W59)>$P59,$P59-SUM($V59:W59),$P59*$U59/12),0)","v":{"v":2.3305000000000002,"d":"2.33"}},{"$f":"IF(AND(Y$16*1>=$R59,Y$16*1<=$D$8,$R59<$D$8,$P59>SUM($V59:X59)),IF(SUM($P59*$U59/12,$V59:X59)>$P59,$P59-SUM($V59:X59),$P59*$U59/12),0)","v":{"v":2.3305000000000002,"d":"2.33"}},{"$f":"IF(AND(Z$16*1>=$R59,Z$16*1<=$D$8,$R59<$D$8,$P59>SUM($V59:Y59)),IF(SUM($P59*$U59/12,$V59:Y59)>$P59,$P59-SUM($V59:Y59),$P59*$U59/12),0)","v":{"v":2.3305000000000002,"d":"2.33"}},{"$f":"IF(AND(AA$16*1>=$R59,AA$16*1<=$D$8,$R59<$D$8,$P59>SUM($V59:Z59)),IF(SUM($P59*$U59/12,$V59:Z59)>$P59,$P59-SUM($V59:Z59),$P59*$U59/12),0)","v":{"v":2.3305000000000002,"d":"2.33"}},{"$f":"IF(AND(AB$16*1>=$R59,AB$16*1<=$D$8,$R59<$D$8,$P59>SUM($V59:AA59)),IF(SUM($P59*$U59/12,$V59:AA59)>$P59,$P59-SUM($V59:AA59),$P59*$U59/12),0)","v":{"v":0,"d":"0.00"}},{"$f":"IF(AND(AC$16*1>=$R59,AC$16*1<=$D$8,$R59<$D$8,$P59>SUM($V59:AB59)),IF(SUM($P59*$U59/12,$V59:AB59)>$P59,$P59-SUM($V59:AB59),$P59*$U59/12),0)","v":{"v":0,"d":"0.00"}},{"$f":"IF(AND(AD$16*1>=$R59,AD$16*1<=$D$8,$R59<$D$8,$P59>SUM($V59:AC59)),IF(SUM($P59*$U59/12,$V59:AC59)>$P59,$P59-SUM($V59:AC59),$P59*$U59/12),0)","v":{"v":0,"d":"0.00"}},{"$f":"IF(AND(AE$16*1>=$R59,AE$16*1<=$D$8,$R59<$D$8,$P59>SUM($V59:AD59)),IF(SUM($P59*$U59/12,$V59:AD59)>$P59,$P59-SUM($V59:AD59),$P59*$U59/12),0)","v":{"v":0,"d":"0.00"}},{"$f":"IF(AND(AF$16*1>=$R59,AF$16*1<=$D$8,$R59<$D$8,$P59>SUM($V59:AE59)),IF(SUM($P59*$U59/12,$V59:AE59)>$P59,$P59-SUM($V59:AE59),$P59*$U59/12),0)","v":{"v":0,"d":"0.00"}},{"$f":"IF(AND(AG$16*1>=$R59,AG$16*1<=$D$8,$R59<$D$8,$P59>SUM($V59:AF59)),IF(SUM($P59*$U59/12,$V59:AF59)>$P59,$P59-SUM($V59:AF59),$P59*$U59/12),0)","v":{"v":0,"d":"0.00"}},{"$f":"IF(AND(AH$16*1>=$R59,AH$16*1<=$D$8,$R59<$D$8,$P59>SUM($V59:AG59)),IF(SUM($P59*$U59/12,$V59:AG59)>$P59,$P59-SUM($V59:AG59),$P59*$U59/12),0)","v":{"v":0,"d":"0.00"}},{"v":11.652500000000002,"d":"11.65"},null,null,{"v":62.9315,"d":"62.93"},null,{"v":62.9315,"d":"62.93"}]
[null,null,44,"335111","ARCHIVADOR METAL NEG.4GAVET(SG)",{"$nulls":3},279.66,{"$nulls":4},279.66,null,279.66,"2016-12-20","2017-01-01",null,null,{"v":0.1,"d":"10%"},55.94,{"$f":"IF(AND(W$16*1>=$R60,W$16*1<=$D$8,$R60<$D$8,$P60>SUM($V60:V60)),IF(SUM($P60*$U60/12,$V60:V60)>$P60,$P60-SUM($V60:V60),$P60*$U60/12),0)","v":{"v":2.3305000000000002,"d":"2.33"}},{"$f":"IF(AND(X$16*1>=$R60,X$16*1<=$D$8,$R60<$D$8,$P60>SUM($V60:W60)),IF(SUM($P60*$U60/12,$V60:W60)>$P60,$P60-SUM($V60:W60),$P60*$U60/12),0)","v":{"v":2.3305000000000002,"d":"2.33"}},{"$f":"IF(AND(Y$16*1>=$R60,Y$16*1<=$D$8,$R60<$D$8,$P60>SUM($V60:X60)),IF(SUM($P60*$U60/12,$V60:X60)>$P60,$P60-SUM($V60:X60),$P60*$U60/12),0)","v":{"v":2.3305000000000002,"d":"2.33"}},{"$f":"IF(AND(Z$16*1>=$R60,Z$16*1<=$D$8,$R60<$D$8,$P60>SUM($V60:Y60)),IF(SUM($P60*$U60/12,$V60:Y60)>$P60,$P60-SUM($V60:Y60),$P60*$U60/12),0)","v":{"v":2.3305000000000002,"d":"2.33"}},{"$f":"IF(AND(AA$16*1>=$R60,AA$16*1<=$D$8,$R60<$D$8,$P60>SUM($V60:Z60)),IF(SUM($P60*$U60/12,$V60:Z60)>$P60,$P60-SUM($V60:Z60),$P60*$U60/12),0)","v":{"v":2.3305000000000002,"d":"2.33"}},{"$f":"IF(AND(AB$16*1>=$R60,AB$16*1<=$D$8,$R60<$D$8,$P60>SUM($V60:AA60)),IF(SUM($P60*$U60/12,$V60:AA60)>$P60,$P60-SUM($V60:AA60),$P60*$U60/12),0)","v":{"v":0,"d":"0.00"}},{"$f":"IF(AND(AC$16*1>=$R60,AC$16*1<=$D$8,$R60<$D$8,$P60>SUM($V60:AB60)),IF(SUM($P60*$U60/12,$V60:AB60)>$P60,$P60-SUM($V60:AB60),$P60*$U60/12),0)","v":{"v":0,"d":"0.00"}},{"$f":"IF(AND(AD$16*1>=$R60,AD$16*1<=$D$8,$R60<$D$8,$P60>SUM($V60:AC60)),IF(SUM($P60*$U60/12,$V60:AC60)>$P60,$P60-SUM($V60:AC60),$P60*$U60/12),0)","v":{"v":0,"d":"0.00"}},{"$f":"IF(AND(AE$16*1>=$R60,AE$16*1<=$D$8,$R60<$D$8,$P60>SUM($V60:AD60)),IF(SUM($P60*$U60/12,$V60:AD60)>$P60,$P60-SUM($V60:AD60),$P60*$U60/12),0)","v":{"v":0,"d":"0.00"}},{"$f":"IF(AND(AF$16*1>=$R60,AF$16*1<=$D$8,$R60<$D$8,$P60>SUM($V60:AE60)),IF(SUM($P60*$U60/12,$V60:AE60)>$P60,$P60-SUM($V60:AE60),$P60*$U60/12),0)","v":{"v":0,"d":"0.00"}},{"$f":"IF(AND(AG$16*1>=$R60,AG$16*1<=$D$8,$R60<$D$8,$P60>SUM($V60:AF60)),IF(SUM($P60*$U60/12,$V60:AF60)>$P60,$P60-SUM($V60:AF60),$P60*$U60/12),0)","v":{"v":0,"d":"0.00"}},{"$f":"IF(AND(AH$16*1>=$R60,AH$16*1<=$D$8,$R60<$D$8,$P60>SUM($V60:AG60)),IF(SUM($P60*$U60/12,$V60:AG60)>$P60,$P60-SUM($V60:AG60),$P60*$U60/12),0)","v":{"v":0,"d":"0.00"}},{"v":11.652500000000002,"d":"11.65"},null,null,{"v":62.9315,"d":"62.93"},null,{"v":62.9315,"d":"62.93"}]
[null,null,45,"335111","ARCHIVAD.METAL NEG.4GAV.(Recepc)",{"$nulls":3},279.66,{"$nulls":4},279.66,null,279.66,"2016-12-20","2017-01-01",null,null,{"v":0.1,"d":"10%"},55.94,{"$f":"IF(AND(W$16*1>=$R61,W$16*1<=$D$8,$R61<$D$8,$P61>SUM($V61:V61)),IF(SUM($P61*$U61/12,$V61:V61)>$P61,$P61-SUM($V61:V61),$P61*$U61/12),0)","v":{"v":2.3305000000000002,"d":"2.33"}},{"$f":"IF(AND(X$16*1>=$R61,X$16*1<=$D$8,$R61<$D$8,$P61>SUM($V61:W61)),IF(SUM($P61*$U61/12,$V61:W61)>$P61,$P61-SUM($V61:W61),$P61*$U61/12),0)","v":{"v":2.3305000000000002,"d":"2.33"}},{"$f":"IF(AND(Y$16*1>=$R61,Y$16*1<=$D$8,$R61<$D$8,$P61>SUM($V61:X61)),IF(SUM($P61*$U61/12,$V61:X61)>$P61,$P61-SUM($V61:X61),$P61*$U61/12),0)","v":{"v":2.3305000000000002,"d":"2.33"}},{"$f":"IF(AND(Z$16*1>=$R61,Z$16*1<=$D$8,$R61<$D$8,$P61>SUM($V61:Y61)),IF(SUM($P61*$U61/12,$V61:Y61)>$P61,$P61-SUM($V61:Y61),$P61*$U61/12),0)","v":{"v":2.3305000000000002,"d":"2.33"}},{"$f":"IF(AND(AA$16*1>=$R61,AA$16*1<=$D$8,$R61<$D$8,$P61>SUM($V61:Z61)),IF(SUM($P61*$U61/12,$V61:Z61)>$P61,$P61-SUM($V61:Z61),$P61*$U61/12),0)","v":{"v":2.3305000000000002,"d":"2.33"}},{"$f":"IF(AND(AB$16*1>=$R61,AB$16*1<=$D$8,$R61<$D$8,$P61>SUM($V61:AA61)),IF(SUM($P61*$U61/12,$V61:AA61)>$P61,$P61-SUM($V61:AA61),$P61*$U61/12),0)","v":{"v":0,"d":"0.00"}},{"$f":"IF(AND(AC$16*1>=$R61,AC$16*1<=$D$8,$R61<$D$8,$P61>SUM($V61:AB61)),IF(SUM($P61*$U61/12,$V61:AB61)>$P61,$P61-SUM($V61:AB61),$P61*$U61/12),0)","v":{"v":0,"d":"0.00"}},{"$f":"IF(AND(AD$16*1>=$R61,AD$16*1<=$D$8,$R61<$D$8,$P61>SUM($V61:AC61)),IF(SUM($P61*$U61/12,$V61:AC61)>$P61,$P61-SUM($V61:AC61),$P61*$U61/12),0)","v":{"v":0,"d":"0.00"}},{"$f":"IF(AND(AE$16*1>=$R61,AE$16*1<=$D$8,$R61<$D$8,$P61>SUM($V61:AD61)),IF(SUM($P61*$U61/12,$V61:AD61)>$P61,$P61-SUM($V61:AD61),$P61*$U61/12),0)","v":{"v":0,"d":"0.00"}},{"$f":"IF(AND(AF$16*1>=$R61,AF$16*1<=$D$8,$R61<$D$8,$P61>SUM($V61:AE61)),IF(SUM($P61*$U61/12,$V61:AE61)>$P61,$P61-SUM($V61:AE61),$P61*$U61/12),0)","v":{"v":0,"d":"0.00"}},{"$f":"IF(AND(AG$16*1>=$R61,AG$16*1<=$D$8,$R61<$D$8,$P61>SUM($V61:AF61)),IF(SUM($P61*$U61/12,$V61:AF61)>$P61,$P61-SUM($V61:AF61),$P61*$U61/12),0)","v":{"v":0,"d":"0.00"}},{"$f":"IF(AND(AH$16*1>=$R61,AH$16*1<=$D$8,$R61<$D$8,$P61>SUM($V61:AG61)),IF(SUM($P61*$U61/12,$V61:AG61)>$P61,$P61-SUM($V61:AG61),$P61*$U61/12),0)","v":{"v":0,"d":"0.00"}},{"v":11.652500000000002,"d":"11.65"},null,null,{"v":62.9315,"d":"62.93"},null,{"v":62.9315,"d":"62.93"}]
[null,null,46,"335111","ARCHIVAD.METAL NEG.4GAV(Marcas)",{"$nulls":3},279.66,{"$nulls":4},279.66,null,279.66,"2016-12-20","2017-01-01",null,null,{"v":0.1,"d":"10%"},55.94,{"$f":"IF(AND(W$16*1>=$R62,W$16*1<=$D$8,$R62<$D$8,$P62>SUM($V62:V62)),IF(SUM($P62*$U62/12,$V62:V62)>$P62,$P62-SUM($V62:V62),$P62*$U62/12),0)","v":{"v":2.3305000000000002,"d":"2.33"}},{"$f":"IF(AND(X$16*1>=$R62,X$16*1<=$D$8,$R62<$D$8,$P62>SUM($V62:W62)),IF(SUM($P62*$U62/12,$V62:W62)>$P62,$P62-SUM($V62:W62),$P62*$U62/12),0)","v":{"v":2.3305000000000002,"d":"2.33"}},{"$f":"IF(AND(Y$16*1>=$R62,Y$16*1<=$D$8,$R62<$D$8,$P62>SUM($V62:X62)),IF(SUM($P62*$U62/12,$V62:X62)>$P62,$P62-SUM($V62:X62),$P62*$U62/12),0)","v":{"v":2.3305000000000002,"d":"2.33"}},{"$f":"IF(AND(Z$16*1>=$R62,Z$16*1<=$D$8,$R62<$D$8,$P62>SUM($V62:Y62)),IF(SUM($P62*$U62/12,$V62:Y62)>$P62,$P62-SUM($V62:Y62),$P62*$U62/12),0)","v":{"v":2.3305000000000002,"d":"2.33"}},{"$f":"IF(AND(AA$16*1>=$R62,AA$16*1<=$D$8,$R62<$D$8,$P62>SUM($V62:Z62)),IF(SUM($P62*$U62/12,$V62:Z62)>$P62,$P62-SUM($V62:Z62),$P62*$U62/12),0)","v":{"v":2.3305000000000002,"d":"2.33"}},{"$f":"IF(AND(AB$16*1>=$R62,AB$16*1<=$D$8,$R62<$D$8,$P62>SUM($V62:AA62)),IF(SUM($P62*$U62/12,$V62:AA62)>$P62,$P62-SUM($V62:AA62),$P62*$U62/12),0)","v":{"v":0,"d":"0.00"}},{"$f":"IF(AND(AC$16*1>=$R62,AC$16*1<=$D$8,$R62<$D$8,$P62>SUM($V62:AB62)),IF(SUM($P62*$U62/12,$V62:AB62)>$P62,$P62-SUM($V62:AB62),$P62*$U62/12),0)","v":{"v":0,"d":"0.00"}},{"$f":"IF(AND(AD$16*1>=$R62,AD$16*1<=$D$8,$R62<$D$8,$P62>SUM($V62:AC62)),IF(SUM($P62*$U62/12,$V62:AC62)>$P62,$P62-SUM($V62:AC62),$P62*$U62/12),0)","v":{"v":0,"d":"0.00"}},{"$f":"IF(AND(AE$16*1>=$R62,AE$16*1<=$D$8,$R62<$D$8,$P62>SUM($V62:AD62)),IF(SUM($P62*$U62/12,$V62:AD62)>$P62,$P62-SUM($V62:AD62),$P62*$U62/12),0)","v":{"v":0,"d":"0.00"}},{"$f":"IF(AND(AF$16*1>=$R62,AF$16*1<=$D$8,$R62<$D$8,$P62>SUM($V62:AE62)),IF(SUM($P62*$U62/12,$V62:AE62)>$P62,$P62-SUM($V62:AE62),$P62*$U62/12),0)","v":{"v":0,"d":"0.00"}},{"$f":"IF(AND(AG$16*1>=$R62,AG$16*1<=$D$8,$R62<$D$8,$P62>SUM($V62:AF62)),IF(SUM($P62*$U62/12,$V62:AF62)>$P62,$P62-SUM($V62:AF62),$P62*$U62/12),0)","v":{"v":0,"d":"0.00"}},{"$f":"IF(AND(AH$16*1>=$R62,AH$16*1<=$D$8,$R62<$D$8,$P62>SUM($V62:AG62)),IF(SUM($P62*$U62/12,$V62:AG62)>$P62,$P62-SUM($V62:AG62),$P62*$U62/12),0)","v":{"v":0,"d":"0.00"}},{"v":11.652500000000002,"d":"11.65"},null,null,{"v":62.9315,"d":"62.93"},null,{"v":62.9315,"d":"62.93"}]
[null,null,47,"335111","ARCHIV.METAL NEG.4GAV(ARCH.GRL)",{"$nulls":3},279.66,{"$nulls":4},279.66,null,279.66,"2016-12-20","2017-01-01",null,null,{"v":0.1,"d":"10%"},55.94,{"$f":"IF(AND(W$16*1>=$R63,W$16*1<=$D$8,$R63<$D$8,$P63>SUM($V63:V63)),IF(SUM($P63*$U63/12,$V63:V63)>$P63,$P63-SUM($V63:V63),$P63*$U63/12),0)","v":{"v":2.3305000000000002,"d":"2.33"}},{"$f":"IF(AND(X$16*1>=$R63,X$16*1<=$D$8,$R63<$D$8,$P63>SUM($V63:W63)),IF(SUM($P63*$U63/12,$V63:W63)>$P63,$P63-SUM($V63:W63),$P63*$U63/12),0)","v":{"v":2.3305000000000002,"d":"2.33"}},{"$f":"IF(AND(Y$16*1>=$R63,Y$16*1<=$D$8,$R63<$D$8,$P63>SUM($V63:X63)),IF(SUM($P63*$U63/12,$V63:X63)>$P63,$P63-SUM($V63:X63),$P63*$U63/12),0)","v":{"v":2.3305000000000002,"d":"2.33"}},{"$f":"IF(AND(Z$16*1>=$R63,Z$16*1<=$D$8,$R63<$D$8,$P63>SUM($V63:Y63)),IF(SUM($P63*$U63/12,$V63:Y63)>$P63,$P63-SUM($V63:Y63),$P63*$U63/12),0)","v":{"v":2.3305000000000002,"d":"2.33"}},{"$f":"IF(AND(AA$16*1>=$R63,AA$16*1<=$D$8,$R63<$D$8,$P63>SUM($V63:Z63)),IF(SUM($P63*$U63/12,$V63:Z63)>$P63,$P63-SUM($V63:Z63),$P63*$U63/12),0)","v":{"v":2.3305000000000002,"d":"2.33"}},{"$f":"IF(AND(AB$16*1>=$R63,AB$16*1<=$D$8,$R63<$D$8,$P63>SUM($V63:AA63)),IF(SUM($P63*$U63/12,$V63:AA63)>$P63,$P63-SUM($V63:AA63),$P63*$U63/12),0)","v":{"v":0,"d":"0.00"}},{"$f":"IF(AND(AC$16*1>=$R63,AC$16*1<=$D$8,$R63<$D$8,$P63>SUM($V63:AB63)),IF(SUM($P63*$U63/12,$V63:AB63)>$P63,$P63-SUM($V63:AB63),$P63*$U63/12),0)","v":{"v":0,"d":"0.00"}},{"$f":"IF(AND(AD$16*1>=$R63,AD$16*1<=$D$8,$R63<$D$8,$P63>SUM($V63:AC63)),IF(SUM($P63*$U63/12,$V63:AC63)>$P63,$P63-SUM($V63:AC63),$P63*$U63/12),0)","v":{"v":0,"d":"0.00"}},{"$f":"IF(AND(AE$16*1>=$R63,AE$16*1<=$D$8,$R63<$D$8,$P63>SUM($V63:AD63)),IF(SUM($P63*$U63/12,$V63:AD63)>$P63,$P63-SUM($V63:AD63),$P63*$U63/12),0)","v":{"v":0,"d":"0.00"}},{"$f":"IF(AND(AF$16*1>=$R63,AF$16*1<=$D$8,$R63<$D$8,$P63>SUM($V63:AE63)),IF(SUM($P63*$U63/12,$V63:AE63)>$P63,$P63-SUM($V63:AE63),$P63*$U63/12),0)","v":{"v":0,"d":"0.00"}},{"$f":"IF(AND(AG$16*1>=$R63,AG$16*1<=$D$8,$R63<$D$8,$P63>SUM($V63:AF63)),IF(SUM($P63*$U63/12,$V63:AF63)>$P63,$P63-SUM($V63:AF63),$P63*$U63/12),0)","v":{"v":0,"d":"0.00"}},{"$f":"IF(AND(AH$16*1>=$R63,AH$16*1<=$D$8,$R63<$D$8,$P63>SUM($V63:AG63)),IF(SUM($P63*$U63/12,$V63:AG63)>$P63,$P63-SUM($V63:AG63),$P63*$U63/12),0)","v":{"v":0,"d":"0.00"}},{"v":11.652500000000002,"d":"11.65"},null,null,{"v":62.9315,"d":"62.93"},null,{"v":62.9315,"d":"62.93"}]
[null,null,48,"335111","ARCHIV.METAL NEG.4GAV(ARCH.GRL)",{"$nulls":3},279.67,{"$nulls":4},279.67,null,279.67,"2016-12-20","2017-01-01",null,null,{"v":0.1,"d":"10%"},55.94,{"$f":"IF(AND(W$16*1>=$R64,W$16*1<=$D$8,$R64<$D$8,$P64>SUM($V64:V64)),IF(SUM($P64*$U64/12,$V64:V64)>$P64,$P64-SUM($V64:V64),$P64*$U64/12),0)","v":{"v":2.3305833333333337,"d":"2.33"}},{"$f":"IF(AND(X$16*1>=$R64,X$16*1<=$D$8,$R64<$D$8,$P64>SUM($V64:W64)),IF(SUM($P64*$U64/12,$V64:W64)>$P64,$P64-SUM($V64:W64),$P64*$U64/12),0)","v":{"v":2.3305833333333337,"d":"2.33"}},{"$f":"IF(AND(Y$16*1>=$R64,Y$16*1<=$D$8,$R64<$D$8,$P64>SUM($V64:X64)),IF(SUM($P64*$U64/12,$V64:X64)>$P64,$P64-SUM($V64:X64),$P64*$U64/12),0)","v":{"v":2.3305833333333337,"d":"2.33"}},{"$f":"IF(AND(Z$16*1>=$R64,Z$16*1<=$D$8,$R64<$D$8,$P64>SUM($V64:Y64)),IF(SUM($P64*$U64/12,$V64:Y64)>$P64,$P64-SUM($V64:Y64),$P64*$U64/12),0)","v":{"v":2.3305833333333337,"d":"2.33"}},{"$f":"IF(AND(AA$16*1>=$R64,AA$16*1<=$D$8,$R64<$D$8,$P64>SUM($V64:Z64)),IF(SUM($P64*$U64/12,$V64:Z64)>$P64,$P64-SUM($V64:Z64),$P64*$U64/12),0)","v":{"v":2.3305833333333337,"d":"2.33"}},{"$f":"IF(AND(AB$16*1>=$R64,AB$16*1<=$D$8,$R64<$D$8,$P64>SUM($V64:AA64)),IF(SUM($P64*$U64/12,$V64:AA64)>$P64,$P64-SUM($V64:AA64),$P64*$U64/12),0)","v":{"v":0,"d":"0.00"}},{"$f":"IF(AND(AC$16*1>=$R64,AC$16*1<=$D$8,$R64<$D$8,$P64>SUM($V64:AB64)),IF(SUM($P64*$U64/12,$V64:AB64)>$P64,$P64-SUM($V64:AB64),$P64*$U64/12),0)","v":{"v":0,"d":"0.00"}},{"$f":"IF(AND(AD$16*1>=$R64,AD$16*1<=$D$8,$R64<$D$8,$P64>SUM($V64:AC64)),IF(SUM($P64*$U64/12,$V64:AC64)>$P64,$P64-SUM($V64:AC64),$P64*$U64/12),0)","v":{"v":0,"d":"0.00"}},{"$f":"IF(AND(AE$16*1>=$R64,AE$16*1<=$D$8,$R64<$D$8,$P64>SUM($V64:AD64)),IF(SUM($P64*$U64/12,$V64:AD64)>$P64,$P64-SUM($V64:AD64),$P64*$U64/12),0)","v":{"v":0,"d":"0.00"}},{"$f":"IF(AND(AF$16*1>=$R64,AF$16*1<=$D$8,$R64<$D$8,$P64>SUM($V64:AE64)),IF(SUM($P64*$U64/12,$V64:AE64)>$P64,$P64-SUM($V64:AE64),$P64*$U64/12),0)","v":{"v":0,"d":"0.00"}},{"$f":"IF(AND(AG$16*1>=$R64,AG$16*1<=$D$8,$R64<$D$8,$P64>SUM($V64:AF64)),IF(SUM($P64*$U64/12,$V64:AF64)>$P64,$P64-SUM($V64:AF64),$P64*$U64/12),0)","v":{"v":0,"d":"0.00"}},{"$f":"IF(AND(AH$16*1>=$R64,AH$16*1<=$D$8,$R64<$D$8,$P64>SUM($V64:AG64)),IF(SUM($P64*$U64/12,$V64:AG64)>$P64,$P64-SUM($V64:AG64),$P64*$U64/12),0)","v":{"v":0,"d":"0.00"}},{"v":11.652916666666668,"d":"11.65"},null,null,{"v":62.93175,"d":"62.93"},null,{"v":62.93175,"d":"62.93"}]
[null,null,49,"335111","ESCRITORIO\"U\" NEGRO MELAM.(MCH)",{"$nulls":3},775.42,{"$nulls":4},775.42,null,775.42,"2016-12-28","2017-01-01",null,null,{"v":0.1,"d":"10%"},155.08,{"$f":"IF(AND(W$16*1>=$R65,W$16*1<=$D$8,$R65<$D$8,$P65>SUM($V65:V65)),IF(SUM($P65*$U65/12,$V65:V65)>$P65,$P65-SUM($V65:V65),$P65*$U65/12),0)","v":{"v":6.461833333333334,"d":"6.46"}},{"$f":"IF(AND(X$16*1>=$R65,X$16*1<=$D$8,$R65<$D$8,$P65>SUM($V65:W65)),IF(SUM($P65*$U65/12,$V65:W65)>$P65,$P65-SUM($V65:W65),$P65*$U65/12),0)","v":{"v":6.461833333333334,"d":"6.46"}},{"$f":"IF(AND(Y$16*1>=$R65,Y$16*1<=$D$8,$R65<$D$8,$P65>SUM($V65:X65)),IF(SUM($P65*$U65/12,$V65:X65)>$P65,$P65-SUM($V65:X65),$P65*$U65/12),0)","v":{"v":6.461833333333334,"d":"6.46"}},{"$f":"IF(AND(Z$16*1>=$R65,Z$16*1<=$D$8,$R65<$D$8,$P65>SUM($V65:Y65)),IF(SUM($P65*$U65/12,$V65:Y65)>$P65,$P65-SUM($V65:Y65),$P65*$U65/12),0)","v":{"v":6.461833333333334,"d":"6.46"}},{"$f":"IF(AND(AA$16*1>=$R65,AA$16*1<=$D$8,$R65<$D$8,$P65>SUM($V65:Z65)),IF(SUM($P65*$U65/12,$V65:Z65)>$P65,$P65-SUM($V65:Z65),$P65*$U65/12),0)","v":{"v":6.461833333333334,"d":"6.46"}},{"$f":"IF(AND(AB$16*1>=$R65,AB$16*1<=$D$8,$R65<$D$8,$P65>SUM($V65:AA65)),IF(SUM($P65*$U65/12,$V65:AA65)>$P65,$P65-SUM($V65:AA65),$P65*$U65/12),0)","v":{"v":0,"d":"0.00"}},{"$f":"IF(AND(AC$16*1>=$R65,AC$16*1<=$D$8,$R65<$D$8,$P65>SUM($V65:AB65)),IF(SUM($P65*$U65/12,$V65:AB65)>$P65,$P65-SUM($V65:AB65),$P65*$U65/12),0)","v":{"v":0,"d":"0.00"}},{"$f":"IF(AND(AD$16*1>=$R65,AD$16*1<=$D$8,$R65<$D$8,$P65>SUM($V65:AC65)),IF(SUM($P65*$U65/12,$V65:AC65)>$P65,$P65-SUM($V65:AC65),$P65*$U65/12),0)","v":{"v":0,"d":"0.00"}},{"$f":"IF(AND(AE$16*1>=$R65,AE$16*1<=$D$8,$R65<$D$8,$P65>SUM($V65:AD65)),IF(SUM($P65*$U65/12,$V65:AD65)>$P65,$P65-SUM($V65:AD65),$P65*$U65/12),0)","v":{"v":0,"d":"0.00"}},{"$f":"IF(AND(AF$16*1>=$R65,AF$16*1<=$D$8,$R65<$D$8,$P65>SUM($V65:AE65)),IF(SUM($P65*$U65/12,$V65:AE65)>$P65,$P65-SUM($V65:AE65),$P65*$U65/12),0)","v":{"v":0,"d":"0.00"}},{"$f":"IF(AND(AG$16*1>=$R65,AG$16*1<=$D$8,$R65<$D$8,$P65>SUM($V65:AF65)),IF(SUM($P65*$U65/12,$V65:AF65)>$P65,$P65-SUM($V65:AF65),$P65*$U65/12),0)","v":{"v":0,"d":"0.00"}},{"$f":"IF(AND(AH$16*1>=$R65,AH$16*1<=$D$8,$R65<$D$8,$P65>SUM($V65:AG65)),IF(SUM($P65*$U65/12,$V65:AG65)>$P65,$P65-SUM($V65:AG65),$P65*$U65/12),0)","v":{"v":0,"d":"0.00"}},{"v":32.30916666666667,"d":"32.31"},null,null,{"v":174.46550000000002,"d":"174.47"},null,{"v":174.46550000000002,"d":"174.47"}]
[null,null,50,"335111","ESCRITORIO\"U\" NEGRO MELAM(Marcas)",{"$nulls":3},775.43,{"$nulls":4},775.43,null,775.43,"2016-12-28","2017-01-01",null,null,{"v":0.1,"d":"10%"},155.08,{"$f":"IF(AND(W$16*1>=$R66,W$16*1<=$D$8,$R66<$D$8,$P66>SUM($V66:V66)),IF(SUM($P66*$U66/12,$V66:V66)>$P66,$P66-SUM($V66:V66),$P66*$U66/12),0)","v":{"v":6.461916666666667,"d":"6.46"}},{"$f":"IF(AND(X$16*1>=$R66,X$16*1<=$D$8,$R66<$D$8,$P66>SUM($V66:W66)),IF(SUM($P66*$U66/12,$V66:W66)>$P66,$P66-SUM($V66:W66),$P66*$U66/12),0)","v":{"v":6.461916666666667,"d":"6.46"}},{"$f":"IF(AND(Y$16*1>=$R66,Y$16*1<=$D$8,$R66<$D$8,$P66>SUM($V66:X66)),IF(SUM($P66*$U66/12,$V66:X66)>$P66,$P66-SUM($V66:X66),$P66*$U66/12),0)","v":{"v":6.461916666666667,"d":"6.46"}},{"$f":"IF(AND(Z$16*1>=$R66,Z$16*1<=$D$8,$R66<$D$8,$P66>SUM($V66:Y66)),IF(SUM($P66*$U66/12,$V66:Y66)>$P66,$P66-SUM($V66:Y66),$P66*$U66/12),0)","v":{"v":6.461916666666667,"d":"6.46"}},{"$f":"IF(AND(AA$16*1>=$R66,AA$16*1<=$D$8,$R66<$D$8,$P66>SUM($V66:Z66)),IF(SUM($P66*$U66/12,$V66:Z66)>$P66,$P66-SUM($V66:Z66),$P66*$U66/12),0)","v":{"v":6.461916666666667,"d":"6.46"}},{"$f":"IF(AND(AB$16*1>=$R66,AB$16*1<=$D$8,$R66<$D$8,$P66>SUM($V66:AA66)),IF(SUM($P66*$U66/12,$V66:AA66)>$P66,$P66-SUM($V66:AA66),$P66*$U66/12),0)","v":{"v":0,"d":"0.00"}},{"$f":"IF(AND(AC$16*1>=$R66,AC$16*1<=$D$8,$R66<$D$8,$P66>SUM($V66:AB66)),IF(SUM($P66*$U66/12,$V66:AB66)>$P66,$P66-SUM($V66:AB66),$P66*$U66/12),0)","v":{"v":0,"d":"0.00"}},{"$f":"IF(AND(AD$16*1>=$R66,AD$16*1<=$D$8,$R66<$D$8,$P66>SUM($V66:AC66)),IF(SUM($P66*$U66/12,$V66:AC66)>$P66,$P66-SUM($V66:AC66),$P66*$U66/12),0)","v":{"v":0,"d":"0.00"}},{"$f":"IF(AND(AE$16*1>=$R66,AE$16*1<=$D$8,$R66<$D$8,$P66>SUM($V66:AD66)),IF(SUM($P66*$U66/12,$V66:AD66)>$P66,$P66-SUM($V66:AD66),$P66*$U66/12),0)","v":{"v":0,"d":"0.00"}},{"$f":"IF(AND(AF$16*1>=$R66,AF$16*1<=$D$8,$R66<$D$8,$P66>SUM($V66:AE66)),IF(SUM($P66*$U66/12,$V66:AE66)>$P66,$P66-SUM($V66:AE66),$P66*$U66/12),0)","v":{"v":0,"d":"0.00"}},{"$f":"IF(AND(AG$16*1>=$R66,AG$16*1<=$D$8,$R66<$D$8,$P66>SUM($V66:AF66)),IF(SUM($P66*$U66/12,$V66:AF66)>$P66,$P66-SUM($V66:AF66),$P66*$U66/12),0)","v":{"v":0,"d":"0.00"}},{"$f":"IF(AND(AH$16*1>=$R66,AH$16*1<=$D$8,$R66<$D$8,$P66>SUM($V66:AG66)),IF(SUM($P66*$U66/12,$V66:AG66)>$P66,$P66-SUM($V66:AG66),$P66*$U66/12),0)","v":{"v":0,"d":"0.00"}},{"v":32.309583333333336,"d":"32.31"},null,null,{"v":174.46575,"d":"174.47"},null,{"v":174.46575,"d":"174.47"}]
[null,null,51,"335111","9 SILLONES NEGROS GIRAT.c/BRAZOS",{"$nulls":3},1694.24,{"$nulls":4},1694.24,null,{"v":1694.24,"d":"1,694.24"},"2017-03-07","2017-04-01",null,null,{"v":0.1,"d":"10%"},296.49,{"$f":"IF(AND(W$16*1>=$R67,W$16*1<=$D$8,$R67<$D$8,$P67>SUM($V67:V67)),IF(SUM($P67*$U67/12,$V67:V67)>$P67,$P67-SUM($V67:V67),$P67*$U67/12),0)","v":{"v":14.118666666666668,"d":"14.12"}},{"$f":"IF(AND(X$16*1>=$R67,X$16*1<=$D$8,$R67<$D$8,$P67>SUM($V67:W67)),IF(SUM($P67*$U67/12,$V67:W67)>$P67,$P67-SUM($V67:W67),$P67*$U67/12),0)","v":{"v":14.118666666666668,"d":"14.12"}},{"$f":"IF(AND(Y$16*1>=$R67,Y$16*1<=$D$8,$R67<$D$8,$P67>SUM($V67:X67)),IF(SUM($P67*$U67/12,$V67:X67)>$P67,$P67-SUM($V67:X67),$P67*$U67/12),0)","v":{"v":14.118666666666668,"d":"14.12"}},{"$f":"IF(AND(Z$16*1>=$R67,Z$16*1<=$D$8,$R67<$D$8,$P67>SUM($V67:Y67)),IF(SUM($P67*$U67/12,$V67:Y67)>$P67,$P67-SUM($V67:Y67),$P67*$U67/12),0)","v":{"v":14.118666666666668,"d":"14.12"}},{"$f":"IF(AND(AA$16*1>=$R67,AA$16*1<=$D$8,$R67<$D$8,$P67>SUM($V67:Z67)),IF(SUM($P67*$U67/12,$V67:Z67)>$P67,$P67-SUM($V67:Z67),$P67*$U67/12),0)","v":{"v":14.118666666666668,"d":"14.12"}},{"$f":"IF(AND(AB$16*1>=$R67,AB$16*1<=$D$8,$R67<$D$8,$P67>SUM($V67:AA67)),IF(SUM($P67*$U67/12,$V67:AA67)>$P67,$P67-SUM($V67:AA67),$P67*$U67/12),0)","v":{"v":0,"d":"0.00"}},{"$f":"IF(AND(AC$16*1>=$R67,AC$16*1<=$D$8,$R67<$D$8,$P67>SUM($V67:AB67)),IF(SUM($P67*$U67/12,$V67:AB67)>$P67,$P67-SUM($V67:AB67),$P67*$U67/12),0)","v":{"v":0,"d":"0.00"}},{"$f":"IF(AND(AD$16*1>=$R67,AD$16*1<=$D$8,$R67<$D$8,$P67>SUM($V67:AC67)),IF(SUM($P67*$U67/12,$V67:AC67)>$P67,$P67-SUM($V67:AC67),$P67*$U67/12),0)","v":{"v":0,"d":"0.00"}},{"$f":"IF(AND(AE$16*1>=$R67,AE$16*1<=$D$8,$R67<$D$8,$P67>SUM($V67:AD67)),IF(SUM($P67*$U67/12,$V67:AD67)>$P67,$P67-SUM($V67:AD67),$P67*$U67/12),0)","v":{"v":0,"d":"0.00"}},{"$f":"IF(AND(AF$16*1>=$R67,AF$16*1<=$D$8,$R67<$D$8,$P67>SUM($V67:AE67)),IF(SUM($P67*$U67/12,$V67:AE67)>$P67,$P67-SUM($V67:AE67),$P67*$U67/12),0)","v":{"v":0,"d":"0.00"}},{"$f":"IF(AND(AG$16*1>=$R67,AG$16*1<=$D$8,$R67<$D$8,$P67>SUM($V67:AF67)),IF(SUM($P67*$U67/12,$V67:AF67)>$P67,$P67-SUM($V67:AF67),$P67*$U67/12),0)","v":{"v":0,"d":"0.00"}},{"$f":"IF(AND(AH$16*1>=$R67,AH$16*1<=$D$8,$R67<$D$8,$P67>SUM($V67:AG67)),IF(SUM($P67*$U67/12,$V67:AG67)>$P67,$P67-SUM($V67:AG67),$P67*$U67/12),0)","v":{"v":0,"d":"0.00"}},{"v":70.59333333333333,"d":"70.59"},null,null,{"v":338.846,"d":"338.85"},null,{"v":338.846,"d":"338.85"}]
[null,null,52,"335111","6 SILLAS FIJAS NEGRAS (OFICINAS)",{"$nulls":3},736.78,{"$nulls":4},736.78,null,736.78,"2017-03-07","2017-04-01",null,null,{"v":0.1,"d":"10%"},128.94,{"$f":"IF(AND(W$16*1>=$R68,W$16*1<=$D$8,$R68<$D$8,$P68>SUM($V68:V68)),IF(SUM($P68*$U68/12,$V68:V68)>$P68,$P68-SUM($V68:V68),$P68*$U68/12),0)","v":{"v":6.139833333333333,"d":"6.14"}},{"$f":"IF(AND(X$16*1>=$R68,X$16*1<=$D$8,$R68<$D$8,$P68>SUM($V68:W68)),IF(SUM($P68*$U68/12,$V68:W68)>$P68,$P68-SUM($V68:W68),$P68*$U68/12),0)","v":{"v":6.139833333333333,"d":"6.14"}},{"$f":"IF(AND(Y$16*1>=$R68,Y$16*1<=$D$8,$R68<$D$8,$P68>SUM($V68:X68)),IF(SUM($P68*$U68/12,$V68:X68)>$P68,$P68-SUM($V68:X68),$P68*$U68/12),0)","v":{"v":6.139833333333333,"d":"6.14"}},{"$f":"IF(AND(Z$16*1>=$R68,Z$16*1<=$D$8,$R68<$D$8,$P68>SUM($V68:Y68)),IF(SUM($P68*$U68/12,$V68:Y68)>$P68,$P68-SUM($V68:Y68),$P68*$U68/12),0)","v":{"v":6.139833333333333,"d":"6.14"}},{"$f":"IF(AND(AA$16*1>=$R68,AA$16*1<=$D$8,$R68<$D$8,$P68>SUM($V68:Z68)),IF(SUM($P68*$U68/12,$V68:Z68)>$P68,$P68-SUM($V68:Z68),$P68*$U68/12),0)","v":{"v":6.139833333333333,"d":"6.14"}},{"$f":"IF(AND(AB$16*1>=$R68,AB$16*1<=$D$8,$R68<$D$8,$P68>SUM($V68:AA68)),IF(SUM($P68*$U68/12,$V68:AA68)>$P68,$P68-SUM($V68:AA68),$P68*$U68/12),0)","v":{"v":0,"d":"0.00"}},{"$f":"IF(AND(AC$16*1>=$R68,AC$16*1<=$D$8,$R68<$D$8,$P68>SUM($V68:AB68)),IF(SUM($P68*$U68/12,$V68:AB68)>$P68,$P68-SUM($V68:AB68),$P68*$U68/12),0)","v":{"v":0,"d":"0.00"}},{"$f":"IF(AND(AD$16*1>=$R68,AD$16*1<=$D$8,$R68<$D$8,$P68>SUM($V68:AC68)),IF(SUM($P68*$U68/12,$V68:AC68)>$P68,$P68-SUM($V68:AC68),$P68*$U68/12),0)","v":{"v":0,"d":"0.00"}},{"$f":"IF(AND(AE$16*1>=$R68,AE$16*1<=$D$8,$R68<$D$8,$P68>SUM($V68:AD68)),IF(SUM($P68*$U68/12,$V68:AD68)>$P68,$P68-SUM($V68:AD68),$P68*$U68/12),0)","v":{"v":0,"d":"0.00"}},{"$f":"IF(AND(AF$16*1>=$R68,AF$16*1<=$D$8,$R68<$D$8,$P68>SUM($V68:AE68)),IF(SUM($P68*$U68/12,$V68:AE68)>$P68,$P68-SUM($V68:AE68),$P68*$U68/12),0)","v":{"v":0,"d":"0.00"}},{"$f":"IF(AND(AG$16*1>=$R68,AG$16*1<=$D$8,$R68<$D$8,$P68>SUM($V68:AF68)),IF(SUM($P68*$U68/12,$V68:AF68)>$P68,$P68-SUM($V68:AF68),$P68*$U68/12),0)","v":{"v":0,"d":"0.00"}},{"$f":"IF(AND(AH$16*1>=$R68,AH$16*1<=$D$8,$R68<$D$8,$P68>SUM($V68:AG68)),IF(SUM($P68*$U68/12,$V68:AG68)>$P68,$P68-SUM($V68:AG68),$P68*$U68/12),0)","v":{"v":0,"d":"0.00"}},{"v":30.699166666666663,"d":"30.70"},null,null,{"v":147.3595,"d":"147.36"},null,{"v":147.3595,"d":"147.36"}]
[null,null,53,"335111","2 ARCHIVAD.4 GAV.METAL NEGRO(SG-LLT)",{"$nulls":3},635.59,{"$nulls":4},635.59,null,635.59,"2017-09-04","2017-10-01",null,null,{"v":0.1,"d":"10%"},79.45,{"$f":"IF(AND(W$16*1>=$R69,W$16*1<=$D$8,$R69<$D$8,$P69>SUM($V69:V69)),IF(SUM($P69*$U69/12,$V69:V69)>$P69,$P69-SUM($V69:V69),$P69*$U69/12),0)","v":{"v":5.296583333333333,"d":"5.30"}},{"$f":"IF(AND(X$16*1>=$R69,X$16*1<=$D$8,$R69<$D$8,$P69>SUM($V69:W69)),IF(SUM($P69*$U69/12,$V69:W69)>$P69,$P69-SUM($V69:W69),$P69*$U69/12),0)","v":{"v":5.296583333333333,"d":"5.30"}},{"$f":"IF(AND(Y$16*1>=$R69,Y$16*1<=$D$8,$R69<$D$8,$P69>SUM($V69:X69)),IF(SUM($P69*$U69/12,$V69:X69)>$P69,$P69-SUM($V69:X69),$P69*$U69/12),0)","v":{"v":5.296583333333333,"d":"5.30"}},{"$f":"IF(AND(Z$16*1>=$R69,Z$16*1<=$D$8,$R69<$D$8,$P69>SUM($V69:Y69)),IF(SUM($P69*$U69/12,$V69:Y69)>$P69,$P69-SUM($V69:Y69),$P69*$U69/12),0)","v":{"v":5.296583333333333,"d":"5.30"}},{"$f":"IF(AND(AA$16*1>=$R69,AA$16*1<=$D$8,$R69<$D$8,$P69>SUM($V69:Z69)),IF(SUM($P69*$U69/12,$V69:Z69)>$P69,$P69-SUM($V69:Z69),$P69*$U69/12),0)","v":{"v":5.296583333333333,"d":"5.30"}},{"$f":"IF(AND(AB$16*1>=$R69,AB$16*1<=$D$8,$R69<$D$8,$P69>SUM($V69:AA69)),IF(SUM($P69*$U69/12,$V69:AA69)>$P69,$P69-SUM($V69:AA69),$P69*$U69/12),0)","v":{"v":0,"d":"0.00"}},{"$f":"IF(AND(AC$16*1>=$R69,AC$16*1<=$D$8,$R69<$D$8,$P69>SUM($V69:AB69)),IF(SUM($P69*$U69/12,$V69:AB69)>$P69,$P69-SUM($V69:AB69),$P69*$U69/12),0)","v":{"v":0,"d":"0.00"}},{"$f":"IF(AND(AD$16*1>=$R69,AD$16*1<=$D$8,$R69<$D$8,$P69>SUM($V69:AC69)),IF(SUM($P69*$U69/12,$V69:AC69)>$P69,$P69-SUM($V69:AC69),$P69*$U69/12),0)","v":{"v":0,"d":"0.00"}},{"$f":"IF(AND(AE$16*1>=$R69,AE$16*1<=$D$8,$R69<$D$8,$P69>SUM($V69:AD69)),IF(SUM($P69*$U69/12,$V69:AD69)>$P69,$P69-SUM($V69:AD69),$P69*$U69/12),0)","v":{"v":0,"d":"0.00"}},{"$f":"IF(AND(AF$16*1>=$R69,AF$16*1<=$D$8,$R69<$D$8,$P69>SUM($V69:AE69)),IF(SUM($P69*$U69/12,$V69:AE69)>$P69,$P69-SUM($V69:AE69),$P69*$U69/12),0)","v":{"v":0,"d":"0.00"}},{"$f":"IF(AND(AG$16*1>=$R69,AG$16*1<=$D$8,$R69<$D$8,$P69>SUM($V69:AF69)),IF(SUM($P69*$U69/12,$V69:AF69)>$P69,$P69-SUM($V69:AF69),$P69*$U69/12),0)","v":{"v":0,"d":"0.00"}},{"$f":"IF(AND(AH$16*1>=$R69,AH$16*1<=$D$8,$R69<$D$8,$P69>SUM($V69:AG69)),IF(SUM($P69*$U69/12,$V69:AG69)>$P69,$P69-SUM($V69:AG69),$P69*$U69/12),0)","v":{"v":0,"d":"0.00"}},{"v":26.482916666666668,"d":"26.48"},null,null,{"v":95.33975000000001,"d":"95.34"},null,{"v":95.33975000000001,"d":"95.34"}]
[null,null,54,"335111","ESTANTE 4 NIVELES NEGRO DE MADERA(LLT)",{"$nulls":3},300.85,{"$nulls":4},300.85,null,300.85,"2017-09-04","2017-10-01",null,null,{"v":0.1,"d":"10%"},37.61,{"$f":"IF(AND(W$16*1>=$R70,W$16*1<=$D$8,$R70<$D$8,$P70>SUM($V70:V70)),IF(SUM($P70*$U70/12,$V70:V70)>$P70,$P70-SUM($V70:V70),$P70*$U70/12),0)","v":{"v":2.5070833333333336,"d":"2.51"}},{"$f":"IF(AND(X$16*1>=$R70,X$16*1<=$D$8,$R70<$D$8,$P70>SUM($V70:W70)),IF(SUM($P70*$U70/12,$V70:W70)>$P70,$P70-SUM($V70:W70),$P70*$U70/12),0)","v":{"v":2.5070833333333336,"d":"2.51"}},{"$f":"IF(AND(Y$16*1>=$R70,Y$16*1<=$D$8,$R70<$D$8,$P70>SUM($V70:X70)),IF(SUM($P70*$U70/12,$V70:X70)>$P70,$P70-SUM($V70:X70),$P70*$U70/12),0)","v":{"v":2.5070833333333336,"d":"2.51"}},{"$f":"IF(AND(Z$16*1>=$R70,Z$16*1<=$D$8,$R70<$D$8,$P70>SUM($V70:Y70)),IF(SUM($P70*$U70/12,$V70:Y70)>$P70,$P70-SUM($V70:Y70),$P70*$U70/12),0)","v":{"v":2.5070833333333336,"d":"2.51"}},{"$f":"IF(AND(AA$16*1>=$R70,AA$16*1<=$D$8,$R70<$D$8,$P70>SUM($V70:Z70)),IF(SUM($P70*$U70/12,$V70:Z70)>$P70,$P70-SUM($V70:Z70),$P70*$U70/12),0)","v":{"v":2.5070833333333336,"d":"2.51"}},{"$f":"IF(AND(AB$16*1>=$R70,AB$16*1<=$D$8,$R70<$D$8,$P70>SUM($V70:AA70)),IF(SUM($P70*$U70/12,$V70:AA70)>$P70,$P70-SUM($V70:AA70),$P70*$U70/12),0)","v":{"v":0,"d":"0.00"}},{"$f":"IF(AND(AC$16*1>=$R70,AC$16*1<=$D$8,$R70<$D$8,$P70>SUM($V70:AB70)),IF(SUM($P70*$U70/12,$V70:AB70)>$P70,$P70-SUM($V70:AB70),$P70*$U70/12),0)","v":{"v":0,"d":"0.00"}},{"$f":"IF(AND(AD$16*1>=$R70,AD$16*1<=$D$8,$R70<$D$8,$P70>SUM($V70:AC70)),IF(SUM($P70*$U70/12,$V70:AC70)>$P70,$P70-SUM($V70:AC70),$P70*$U70/12),0)","v":{"v":0,"d":"0.00"}},{"$f":"IF(AND(AE$16*1>=$R70,AE$16*1<=$D$8,$R70<$D$8,$P70>SUM($V70:AD70)),IF(SUM($P70*$U70/12,$V70:AD70)>$P70,$P70-SUM($V70:AD70),$P70*$U70/12),0)","v":{"v":0,"d":"0.00"}},{"$f":"IF(AND(AF$16*1>=$R70,AF$16*1<=$D$8,$R70<$D$8,$P70>SUM($V70:AE70)),IF(SUM($P70*$U70/12,$V70:AE70)>$P70,$P70-SUM($V70:AE70),$P70*$U70/12),0)","v":{"v":0,"d":"0.00"}},{"$f":"IF(AND(AG$16*1>=$R70,AG$16*1<=$D$8,$R70<$D$8,$P70>SUM($V70:AF70)),IF(SUM($P70*$U70/12,$V70:AF70)>$P70,$P70-SUM($V70:AF70),$P70*$U70/12),0)","v":{"v":0,"d":"0.00"}},{"$f":"IF(AND(AH$16*1>=$R70,AH$16*1<=$D$8,$R70<$D$8,$P70>SUM($V70:AG70)),IF(SUM($P70*$U70/12,$V70:AG70)>$P70,$P70-SUM($V70:AG70),$P70*$U70/12),0)","v":{"v":0,"d":"0.00"}},{"v":12.535416666666668,"d":"12.54"},null,null,{"v":45.13125,"d":"45.13"},null,{"v":45.13125,"d":"45.13"}]
[null,null,55,"335111","ESCRITORIO DE VIDRIO NEGRO (PAT.)",{"$nulls":3},637.72,{"$nulls":4},637.72,null,637.72,"2018-03-15","2018-04-01",null,null,{"v":0.1,"d":"10%"},47.83,{"$f":"IF(AND(W$16*1>=$R71,W$16*1<=$D$8,$R71<$D$8,$P71>SUM($V71:V71)),IF(SUM($P71*$U71/12,$V71:V71)>$P71,$P71-SUM($V71:V71),$P71*$U71/12),0)","v":{"v":5.314333333333334,"d":"5.31"}},{"$f":"IF(AND(X$16*1>=$R71,X$16*1<=$D$8,$R71<$D$8,$P71>SUM($V71:W71)),IF(SUM($P71*$U71/12,$V71:W71)>$P71,$P71-SUM($V71:W71),$P71*$U71/12),0)","v":{"v":5.314333333333334,"d":"5.31"}},{"$f":"IF(AND(Y$16*1>=$R71,Y$16*1<=$D$8,$R71<$D$8,$P71>SUM($V71:X71)),IF(SUM($P71*$U71/12,$V71:X71)>$P71,$P71-SUM($V71:X71),$P71*$U71/12),0)","v":{"v":5.314333333333334,"d":"5.31"}},{"$f":"IF(AND(Z$16*1>=$R71,Z$16*1<=$D$8,$R71<$D$8,$P71>SUM($V71:Y71)),IF(SUM($P71*$U71/12,$V71:Y71)>$P71,$P71-SUM($V71:Y71),$P71*$U71/12),0)","v":{"v":5.314333333333334,"d":"5.31"}},{"$f":"IF(AND(AA$16*1>=$R71,AA$16*1<=$D$8,$R71<$D$8,$P71>SUM($V71:Z71)),IF(SUM($P71*$U71/12,$V71:Z71)>$P71,$P71-SUM($V71:Z71),$P71*$U71/12),0)","v":{"v":5.314333333333334,"d":"5.31"}},{"$f":"IF(AND(AB$16*1>=$R71,AB$16*1<=$D$8,$R71<$D$8,$P71>SUM($V71:AA71)),IF(SUM($P71*$U71/12,$V71:AA71)>$P71,$P71-SUM($V71:AA71),$P71*$U71/12),0)","v":{"v":0,"d":"0.00"}},{"$f":"IF(AND(AC$16*1>=$R71,AC$16*1<=$D$8,$R71<$D$8,$P71>SUM($V71:AB71)),IF(SUM($P71*$U71/12,$V71:AB71)>$P71,$P71-SUM($V71:AB71),$P71*$U71/12),0)","v":{"v":0,"d":"0.00"}},{"$f":"IF(AND(AD$16*1>=$R71,AD$16*1<=$D$8,$R71<$D$8,$P71>SUM($V71:AC71)),IF(SUM($P71*$U71/12,$V71:AC71)>$P71,$P71-SUM($V71:AC71),$P71*$U71/12),0)","v":{"v":0,"d":"0.00"}},{"$f":"IF(AND(AE$16*1>=$R71,AE$16*1<=$D$8,$R71<$D$8,$P71>SUM($V71:AD71)),IF(SUM($P71*$U71/12,$V71:AD71)>$P71,$P71-SUM($V71:AD71),$P71*$U71/12),0)","v":{"v":0,"d":"0.00"}},{"$f":"IF(AND(AF$16*1>=$R71,AF$16*1<=$D$8,$R71<$D$8,$P71>SUM($V71:AE71)),IF(SUM($P71*$U71/12,$V71:AE71)>$P71,$P71-SUM($V71:AE71),$P71*$U71/12),0)","v":{"v":0,"d":"0.00"}},{"$f":"IF(AND(AG$16*1>=$R71,AG$16*1<=$D$8,$R71<$D$8,$P71>SUM($V71:AF71)),IF(SUM($P71*$U71/12,$V71:AF71)>$P71,$P71-SUM($V71:AF71),$P71*$U71/12),0)","v":{"v":0,"d":"0.00"}},{"$f":"IF(AND(AH$16*1>=$R71,AH$16*1<=$D$8,$R71<$D$8,$P71>SUM($V71:AG71)),IF(SUM($P71*$U71/12,$V71:AG71)>$P71,$P71-SUM($V71:AG71),$P71*$U71/12),0)","v":{"v":0,"d":"0.00"}},{"v":26.57166666666667,"d":"26.57"},null,null,{"v":63.772999999999996,"d":"63.77"},null,{"v":63.772999999999996,"d":"63.77"}]
[null,null,56,"335111","ESCRITORIO DE VIDRIO NEGRO (PAT.)",{"$nulls":3},637.72,{"$nulls":4},637.72,null,637.72,"2018-03-15","2018-04-01",null,null,{"v":0.1,"d":"10%"},47.83,{"$f":"IF(AND(W$16*1>=$R72,W$16*1<=$D$8,$R72<$D$8,$P72>SUM($V72:V72)),IF(SUM($P72*$U72/12,$V72:V72)>$P72,$P72-SUM($V72:V72),$P72*$U72/12),0)","v":{"v":5.314333333333334,"d":"5.31"}},{"$f":"IF(AND(X$16*1>=$R72,X$16*1<=$D$8,$R72<$D$8,$P72>SUM($V72:W72)),IF(SUM($P72*$U72/12,$V72:W72)>$P72,$P72-SUM($V72:W72),$P72*$U72/12),0)","v":{"v":5.314333333333334,"d":"5.31"}},{"$f":"IF(AND(Y$16*1>=$R72,Y$16*1<=$D$8,$R72<$D$8,$P72>SUM($V72:X72)),IF(SUM($P72*$U72/12,$V72:X72)>$P72,$P72-SUM($V72:X72),$P72*$U72/12),0)","v":{"v":5.314333333333334,"d":"5.31"}},{"$f":"IF(AND(Z$16*1>=$R72,Z$16*1<=$D$8,$R72<$D$8,$P72>SUM($V72:Y72)),IF(SUM($P72*$U72/12,$V72:Y72)>$P72,$P72-SUM($V72:Y72),$P72*$U72/12),0)","v":{"v":5.314333333333334,"d":"5.31"}},{"$f":"IF(AND(AA$16*1>=$R72,AA$16*1<=$D$8,$R72<$D$8,$P72>SUM($V72:Z72)),IF(SUM($P72*$U72/12,$V72:Z72)>$P72,$P72-SUM($V72:Z72),$P72*$U72/12),0)","v":{"v":5.314333333333334,"d":"5.31"}},{"$f":"IF(AND(AB$16*1>=$R72,AB$16*1<=$D$8,$R72<$D$8,$P72>SUM($V72:AA72)),IF(SUM($P72*$U72/12,$V72:AA72)>$P72,$P72-SUM($V72:AA72),$P72*$U72/12),0)","v":{"v":0,"d":"0.00"}},{"$f":"IF(AND(AC$16*1>=$R72,AC$16*1<=$D$8,$R72<$D$8,$P72>SUM($V72:AB72)),IF(SUM($P72*$U72/12,$V72:AB72)>$P72,$P72-SUM($V72:AB72),$P72*$U72/12),0)","v":{"v":0,"d":"0.00"}},{"$f":"IF(AND(AD$16*1>=$R72,AD$16*1<=$D$8,$R72<$D$8,$P72>SUM($V72:AC72)),IF(SUM($P72*$U72/12,$V72:AC72)>$P72,$P72-SUM($V72:AC72),$P72*$U72/12),0)","v":{"v":0,"d":"0.00"}},{"$f":"IF(AND(AE$16*1>=$R72,AE$16*1<=$D$8,$R72<$D$8,$P72>SUM($V72:AD72)),IF(SUM($P72*$U72/12,$V72:AD72)>$P72,$P72-SUM($V72:AD72),$P72*$U72/12),0)","v":{"v":0,"d":"0.00"}},{"$f":"IF(AND(AF$16*1>=$R72,AF$16*1<=$D$8,$R72<$D$8,$P72>SUM($V72:AE72)),IF(SUM($P72*$U72/12,$V72:AE72)>$P72,$P72-SUM($V72:AE72),$P72*$U72/12),0)","v":{"v":0,"d":"0.00"}},{"$f":"IF(AND(AG$16*1>=$R72,AG$16*1<=$D$8,$R72<$D$8,$P72>SUM($V72:AF72)),IF(SUM($P72*$U72/12,$V72:AF72)>$P72,$P72-SUM($V72:AF72),$P72*$U72/12),0)","v":{"v":0,"d":"0.00"}},{"$f":"IF(AND(AH$16*1>=$R72,AH$16*1<=$D$8,$R72<$D$8,$P72>SUM($V72:AG72)),IF(SUM($P72*$U72/12,$V72:AG72)>$P72,$P72-SUM($V72:AG72),$P72*$U72/12),0)","v":{"v":0,"d":"0.00"}},{"v":26.57166666666667,"d":"26.57"},null,null,{"v":63.772999999999996,"d":"63.77"},null,{"v":63.772999999999996,"d":"63.77"}]
[null,null,57,"335111","ESCRITORIO DE VIDRIO NEGRO (MARCA)",{"$nulls":3},637.71,{"$nulls":4},637.71,null,637.71,"2018-03-15","2018-04-01",null,null,{"v":0.1,"d":"10%"},47.83,{"$f":"IF(AND(W$16*1>=$R73,W$16*1<=$D$8,$R73<$D$8,$P73>SUM($V73:V73)),IF(SUM($P73*$U73/12,$V73:V73)>$P73,$P73-SUM($V73:V73),$P73*$U73/12),0)","v":{"v":5.31425,"d":"5.31"}},{"$f":"IF(AND(X$16*1>=$R73,X$16*1<=$D$8,$R73<$D$8,$P73>SUM($V73:W73)),IF(SUM($P73*$U73/12,$V73:W73)>$P73,$P73-SUM($V73:W73),$P73*$U73/12),0)","v":{"v":5.31425,"d":"5.31"}},{"$f":"IF(AND(Y$16*1>=$R73,Y$16*1<=$D$8,$R73<$D$8,$P73>SUM($V73:X73)),IF(SUM($P73*$U73/12,$V73:X73)>$P73,$P73-SUM($V73:X73),$P73*$U73/12),0)","v":{"v":5.31425,"d":"5.31"}},{"$f":"IF(AND(Z$16*1>=$R73,Z$16*1<=$D$8,$R73<$D$8,$P73>SUM($V73:Y73)),IF(SUM($P73*$U73/12,$V73:Y73)>$P73,$P73-SUM($V73:Y73),$P73*$U73/12),0)","v":{"v":5.31425,"d":"5.31"}},{"$f":"IF(AND(AA$16*1>=$R73,AA$16*1<=$D$8,$R73<$D$8,$P73>SUM($V73:Z73)),IF(SUM($P73*$U73/12,$V73:Z73)>$P73,$P73-SUM($V73:Z73),$P73*$U73/12),0)","v":{"v":5.31425,"d":"5.31"}},{"$f":"IF(AND(AB$16*1>=$R73,AB$16*1<=$D$8,$R73<$D$8,$P73>SUM($V73:AA73)),IF(SUM($P73*$U73/12,$V73:AA73)>$P73,$P73-SUM($V73:AA73),$P73*$U73/12),0)","v":{"v":0,"d":"0.00"}},{"$f":"IF(AND(AC$16*1>=$R73,AC$16*1<=$D$8,$R73<$D$8,$P73>SUM($V73:AB73)),IF(SUM($P73*$U73/12,$V73:AB73)>$P73,$P73-SUM($V73:AB73),$P73*$U73/12),0)","v":{"v":0,"d":"0.00"}},{"$f":"IF(AND(AD$16*1>=$R73,AD$16*1<=$D$8,$R73<$D$8,$P73>SUM($V73:AC73)),IF(SUM($P73*$U73/12,$V73:AC73)>$P73,$P73-SUM($V73:AC73),$P73*$U73/12),0)","v":{"v":0,"d":"0.00"}},{"$f":"IF(AND(AE$16*1>=$R73,AE$16*1<=$D$8,$R73<$D$8,$P73>SUM($V73:AD73)),IF(SUM($P73*$U73/12,$V73:AD73)>$P73,$P73-SUM($V73:AD73),$P73*$U73/12),0)","v":{"v":0,"d":"0.00"}},{"$f":"IF(AND(AF$16*1>=$R73,AF$16*1<=$D$8,$R73<$D$8,$P73>SUM($V73:AE73)),IF(SUM($P73*$U73/12,$V73:AE73)>$P73,$P73-SUM($V73:AE73),$P73*$U73/12),0)","v":{"v":0,"d":"0.00"}},{"$f":"IF(AND(AG$16*1>=$R73,AG$16*1<=$D$8,$R73<$D$8,$P73>SUM($V73:AF73)),IF(SUM($P73*$U73/12,$V73:AF73)>$P73,$P73-SUM($V73:AF73),$P73*$U73/12),0)","v":{"v":0,"d":"0.00"}},{"$f":"IF(AND(AH$16*1>=$R73,AH$16*1<=$D$8,$R73<$D$8,$P73>SUM($V73:AG73)),IF(SUM($P73*$U73/12,$V73:AG73)>$P73,$P73-SUM($V73:AG73),$P73*$U73/12),0)","v":{"v":0,"d":"0.00"}},{"v":26.571250000000003,"d":"26.57"},null,null,{"v":63.77275,"d":"63.77"},null,{"v":63.77275,"d":"63.77"}]
[null,null,58,"335111","ESTANTE ALUMINIO DE 4 TABL.(MARC.)",{"$nulls":3},187.65,{"$nulls":4},187.65,null,187.65,"2018-03-15","2018-04-01",null,null,{"v":0.1,"d":"10%"},14.07,{"$f":"IF(AND(W$16*1>=$R74,W$16*1<=$D$8,$R74<$D$8,$P74>SUM($V74:V74)),IF(SUM($P74*$U74/12,$V74:V74)>$P74,$P74-SUM($V74:V74),$P74*$U74/12),0)","v":{"v":1.56375,"d":"1.56"}},{"$f":"IF(AND(X$16*1>=$R74,X$16*1<=$D$8,$R74<$D$8,$P74>SUM($V74:W74)),IF(SUM($P74*$U74/12,$V74:W74)>$P74,$P74-SUM($V74:W74),$P74*$U74/12),0)","v":{"v":1.56375,"d":"1.56"}},{"$f":"IF(AND(Y$16*1>=$R74,Y$16*1<=$D$8,$R74<$D$8,$P74>SUM($V74:X74)),IF(SUM($P74*$U74/12,$V74:X74)>$P74,$P74-SUM($V74:X74),$P74*$U74/12),0)","v":{"v":1.56375,"d":"1.56"}},{"$f":"IF(AND(Z$16*1>=$R74,Z$16*1<=$D$8,$R74<$D$8,$P74>SUM($V74:Y74)),IF(SUM($P74*$U74/12,$V74:Y74)>$P74,$P74-SUM($V74:Y74),$P74*$U74/12),0)","v":{"v":1.56375,"d":"1.56"}},{"$f":"IF(AND(AA$16*1>=$R74,AA$16*1<=$D$8,$R74<$D$8,$P74>SUM($V74:Z74)),IF(SUM($P74*$U74/12,$V74:Z74)>$P74,$P74-SUM($V74:Z74),$P74*$U74/12),0)","v":{"v":1.56375,"d":"1.56"}},{"$f":"IF(AND(AB$16*1>=$R74,AB$16*1<=$D$8,$R74<$D$8,$P74>SUM($V74:AA74)),IF(SUM($P74*$U74/12,$V74:AA74)>$P74,$P74-SUM($V74:AA74),$P74*$U74/12),0)","v":{"v":0,"d":"0.00"}},{"$f":"IF(AND(AC$16*1>=$R74,AC$16*1<=$D$8,$R74<$D$8,$P74>SUM($V74:AB74)),IF(SUM($P74*$U74/12,$V74:AB74)>$P74,$P74-SUM($V74:AB74),$P74*$U74/12),0)","v":{"v":0,"d":"0.00"}},{"$f":"IF(AND(AD$16*1>=$R74,AD$16*1<=$D$8,$R74<$D$8,$P74>SUM($V74:AC74)),IF(SUM($P74*$U74/12,$V74:AC74)>$P74,$P74-SUM($V74:AC74),$P74*$U74/12),0)","v":{"v":0,"d":"0.00"}},{"$f":"IF(AND(AE$16*1>=$R74,AE$16*1<=$D$8,$R74<$D$8,$P74>SUM($V74:AD74)),IF(SUM($P74*$U74/12,$V74:AD74)>$P74,$P74-SUM($V74:AD74),$P74*$U74/12),0)","v":{"v":0,"d":"0.00"}},{"$f":"IF(AND(AF$16*1>=$R74,AF$16*1<=$D$8,$R74<$D$8,$P74>SUM($V74:AE74)),IF(SUM($P74*$U74/12,$V74:AE74)>$P74,$P74-SUM($V74:AE74),$P74*$U74/12),0)","v":{"v":0,"d":"0.00"}},{"$f":"IF(AND(AG$16*1>=$R74,AG$16*1<=$D$8,$R74<$D$8,$P74>SUM($V74:AF74)),IF(SUM($P74*$U74/12,$V74:AF74)>$P74,$P74-SUM($V74:AF74),$P74*$U74/12),0)","v":{"v":0,"d":"0.00"}},{"$f":"IF(AND(AH$16*1>=$R74,AH$16*1<=$D$8,$R74<$D$8,$P74>SUM($V74:AG74)),IF(SUM($P74*$U74/12,$V74:AG74)>$P74,$P74-SUM($V74:AG74),$P74*$U74/12),0)","v":{"v":0,"d":"0.00"}},{"v":7.81875,"d":"7.82"},null,null,{"v":18.76125,"d":"18.76"},null,{"v":18.76125,"d":"18.76"}]
[null,null,59,"335111","ESTANTE ALUMINIO DE 4 TABL.(CONTAB)",{"$nulls":3},187.65,{"$nulls":4},187.65,null,187.65,"2018-03-15","2018-04-01",null,null,{"v":0.1,"d":"10%"},14.07,{"$f":"IF(AND(W$16*1>=$R75,W$16*1<=$D$8,$R75<$D$8,$P75>SUM($V75:V75)),IF(SUM($P75*$U75/12,$V75:V75)>$P75,$P75-SUM($V75:V75),$P75*$U75/12),0)","v":{"v":1.56375,"d":"1.56"}},{"$f":"IF(AND(X$16*1>=$R75,X$16*1<=$D$8,$R75<$D$8,$P75>SUM($V75:W75)),IF(SUM($P75*$U75/12,$V75:W75)>$P75,$P75-SUM($V75:W75),$P75*$U75/12),0)","v":{"v":1.56375,"d":"1.56"}},{"$f":"IF(AND(Y$16*1>=$R75,Y$16*1<=$D$8,$R75<$D$8,$P75>SUM($V75:X75)),IF(SUM($P75*$U75/12,$V75:X75)>$P75,$P75-SUM($V75:X75),$P75*$U75/12),0)","v":{"v":1.56375,"d":"1.56"}},{"$f":"IF(AND(Z$16*1>=$R75,Z$16*1<=$D$8,$R75<$D$8,$P75>SUM($V75:Y75)),IF(SUM($P75*$U75/12,$V75:Y75)>$P75,$P75-SUM($V75:Y75),$P75*$U75/12),0)","v":{"v":1.56375,"d":"1.56"}},{"$f":"IF(AND(AA$16*1>=$R75,AA$16*1<=$D$8,$R75<$D$8,$P75>SUM($V75:Z75)),IF(SUM($P75*$U75/12,$V75:Z75)>$P75,$P75-SUM($V75:Z75),$P75*$U75/12),0)","v":{"v":1.56375,"d":"1.56"}},{"$f":"IF(AND(AB$16*1>=$R75,AB$16*1<=$D$8,$R75<$D$8,$P75>SUM($V75:AA75)),IF(SUM($P75*$U75/12,$V75:AA75)>$P75,$P75-SUM($V75:AA75),$P75*$U75/12),0)","v":{"v":0,"d":"0.00"}},{"$f":"IF(AND(AC$16*1>=$R75,AC$16*1<=$D$8,$R75<$D$8,$P75>SUM($V75:AB75)),IF(SUM($P75*$U75/12,$V75:AB75)>$P75,$P75-SUM($V75:AB75),$P75*$U75/12),0)","v":{"v":0,"d":"0.00"}},{"$f":"IF(AND(AD$16*1>=$R75,AD$16*1<=$D$8,$R75<$D$8,$P75>SUM($V75:AC75)),IF(SUM($P75*$U75/12,$V75:AC75)>$P75,$P75-SUM($V75:AC75),$P75*$U75/12),0)","v":{"v":0,"d":"0.00"}},{"$f":"IF(AND(AE$16*1>=$R75,AE$16*1<=$D$8,$R75<$D$8,$P75>SUM($V75:AD75)),IF(SUM($P75*$U75/12,$V75:AD75)>$P75,$P75-SUM($V75:AD75),$P75*$U75/12),0)","v":{"v":0,"d":"0.00"}},{"$f":"IF(AND(AF$16*1>=$R75,AF$16*1<=$D$8,$R75<$D$8,$P75>SUM($V75:AE75)),IF(SUM($P75*$U75/12,$V75:AE75)>$P75,$P75-SUM($V75:AE75),$P75*$U75/12),0)","v":{"v":0,"d":"0.00"}},{"$f":"IF(AND(AG$16*1>=$R75,AG$16*1<=$D$8,$R75<$D$8,$P75>SUM($V75:AF75)),IF(SUM($P75*$U75/12,$V75:AF75)>$P75,$P75-SUM($V75:AF75),$P75*$U75/12),0)","v":{"v":0,"d":"0.00"}},{"$f":"IF(AND(AH$16*1>=$R75,AH$16*1<=$D$8,$R75<$D$8,$P75>SUM($V75:AG75)),IF(SUM($P75*$U75/12,$V75:AG75)>$P75,$P75-SUM($V75:AG75),$P75*$U75/12),0)","v":{"v":0,"d":"0.00"}},{"v":7.81875,"d":"7.82"},null,null,{"v":18.76125,"d":"18.76"},null,{"v":18.76125,"d":"18.76"}]
[null,null,60,"335111","SILLON NEGRO CUERINA ",{"$nulls":3},190.2,{"$nulls":4},190.2,null,{"v":190.2,"d":"190.20"},"2018-03-15","2018-04-01",null,null,{"v":0.1,"d":"10%"},14.27,{"$f":"IF(AND(W$16*1>=$R76,W$16*1<=$D$8,$R76<$D$8,$P76>SUM($V76:V76)),IF(SUM($P76*$U76/12,$V76:V76)>$P76,$P76-SUM($V76:V76),$P76*$U76/12),0)","v":{"v":1.585,"d":"1.59"}},{"$f":"IF(AND(X$16*1>=$R76,X$16*1<=$D$8,$R76<$D$8,$P76>SUM($V76:W76)),IF(SUM($P76*$U76/12,$V76:W76)>$P76,$P76-SUM($V76:W76),$P76*$U76/12),0)","v":{"v":1.585,"d":"1.59"}},{"$f":"IF(AND(Y$16*1>=$R76,Y$16*1<=$D$8,$R76<$D$8,$P76>SUM($V76:X76)),IF(SUM($P76*$U76/12,$V76:X76)>$P76,$P76-SUM($V76:X76),$P76*$U76/12),0)","v":{"v":1.585,"d":"1.59"}},{"$f":"IF(AND(Z$16*1>=$R76,Z$16*1<=$D$8,$R76<$D$8,$P76>SUM($V76:Y76)),IF(SUM($P76*$U76/12,$V76:Y76)>$P76,$P76-SUM($V76:Y76),$P76*$U76/12),0)","v":{"v":1.585,"d":"1.59"}},{"$f":"IF(AND(AA$16*1>=$R76,AA$16*1<=$D$8,$R76<$D$8,$P76>SUM($V76:Z76)),IF(SUM($P76*$U76/12,$V76:Z76)>$P76,$P76-SUM($V76:Z76),$P76*$U76/12),0)","v":{"v":1.585,"d":"1.59"}},{"$f":"IF(AND(AB$16*1>=$R76,AB$16*1<=$D$8,$R76<$D$8,$P76>SUM($V76:AA76)),IF(SUM($P76*$U76/12,$V76:AA76)>$P76,$P76-SUM($V76:AA76),$P76*$U76/12),0)","v":{"v":0,"d":"0.00"}},{"$f":"IF(AND(AC$16*1>=$R76,AC$16*1<=$D$8,$R76<$D$8,$P76>SUM($V76:AB76)),IF(SUM($P76*$U76/12,$V76:AB76)>$P76,$P76-SUM($V76:AB76),$P76*$U76/12),0)","v":{"v":0,"d":"0.00"}},{"$f":"IF(AND(AD$16*1>=$R76,AD$16*1<=$D$8,$R76<$D$8,$P76>SUM($V76:AC76)),IF(SUM($P76*$U76/12,$V76:AC76)>$P76,$P76-SUM($V76:AC76),$P76*$U76/12),0)","v":{"v":0,"d":"0.00"}},{"$f":"IF(AND(AE$16*1>=$R76,AE$16*1<=$D$8,$R76<$D$8,$P76>SUM($V76:AD76)),IF(SUM($P76*$U76/12,$V76:AD76)>$P76,$P76-SUM($V76:AD76),$P76*$U76/12),0)","v":{"v":0,"d":"0.00"}},{"$f":"IF(AND(AF$16*1>=$R76,AF$16*1<=$D$8,$R76<$D$8,$P76>SUM($V76:AE76)),IF(SUM($P76*$U76/12,$V76:AE76)>$P76,$P76-SUM($V76:AE76),$P76*$U76/12),0)","v":{"v":0,"d":"0.00"}},{"$f":"IF(AND(AG$16*1>=$R76,AG$16*1<=$D$8,$R76<$D$8,$P76>SUM($V76:AF76)),IF(SUM($P76*$U76/12,$V76:AF76)>$P76,$P76-SUM($V76:AF76),$P76*$U76/12),0)","v":{"v":0,"d":"0.00"}},{"$f":"IF(AND(AH$16*1>=$R76,AH$16*1<=$D$8,$R76<$D$8,$P76>SUM($V76:AG76)),IF(SUM($P76*$U76/12,$V76:AG76)>$P76,$P76-SUM($V76:AG76),$P76*$U76/12),0)","v":{"v":0,"d":"0.00"}},{"v":7.925,"d":"7.93"},null,null,{"v":19.025,"d":"19.03"},null,{"v":19.025,"d":"19.03"}]
[null,null,61,"335111","SILLON NEGRO CUERINA ",{"$nulls":3},190.19,{"$nulls":4},190.19,null,190.19,"2018-03-15","2018-04-01",null,null,{"v":0.1,"d":"10%"},14.26,{"$f":"IF(AND(W$16*1>=$R77,W$16*1<=$D$8,$R77<$D$8,$P77>SUM($V77:V77)),IF(SUM($P77*$U77/12,$V77:V77)>$P77,$P77-SUM($V77:V77),$P77*$U77/12),0)","v":{"v":1.5849166666666668,"d":"1.58"}},{"$f":"IF(AND(X$16*1>=$R77,X$16*1<=$D$8,$R77<$D$8,$P77>SUM($V77:W77)),IF(SUM($P77*$U77/12,$V77:W77)>$P77,$P77-SUM($V77:W77),$P77*$U77/12),0)","v":{"v":1.5849166666666668,"d":"1.58"}},{"$f":"IF(AND(Y$16*1>=$R77,Y$16*1<=$D$8,$R77<$D$8,$P77>SUM($V77:X77)),IF(SUM($P77*$U77/12,$V77:X77)>$P77,$P77-SUM($V77:X77),$P77*$U77/12),0)","v":{"v":1.5849166666666668,"d":"1.58"}},{"$f":"IF(AND(Z$16*1>=$R77,Z$16*1<=$D$8,$R77<$D$8,$P77>SUM($V77:Y77)),IF(SUM($P77*$U77/12,$V77:Y77)>$P77,$P77-SUM($V77:Y77),$P77*$U77/12),0)","v":{"v":1.5849166666666668,"d":"1.58"}},{"$f":"IF(AND(AA$16*1>=$R77,AA$16*1<=$D$8,$R77<$D$8,$P77>SUM($V77:Z77)),IF(SUM($P77*$U77/12,$V77:Z77)>$P77,$P77-SUM($V77:Z77),$P77*$U77/12),0)","v":{"v":1.5849166666666668,"d":"1.58"}},{"$f":"IF(AND(AB$16*1>=$R77,AB$16*1<=$D$8,$R77<$D$8,$P77>SUM($V77:AA77)),IF(SUM($P77*$U77/12,$V77:AA77)>$P77,$P77-SUM($V77:AA77),$P77*$U77/12),0)","v":{"v":0,"d":"0.00"}},{"$f":"IF(AND(AC$16*1>=$R77,AC$16*1<=$D$8,$R77<$D$8,$P77>SUM($V77:AB77)),IF(SUM($P77*$U77/12,$V77:AB77)>$P77,$P77-SUM($V77:AB77),$P77*$U77/12),0)","v":{"v":0,"d":"0.00"}},{"$f":"IF(AND(AD$16*1>=$R77,AD$16*1<=$D$8,$R77<$D$8,$P77>SUM($V77:AC77)),IF(SUM($P77*$U77/12,$V77:AC77)>$P77,$P77-SUM($V77:AC77),$P77*$U77/12),0)","v":{"v":0,"d":"0.00"}},{"$f":"IF(AND(AE$16*1>=$R77,AE$16*1<=$D$8,$R77<$D$8,$P77>SUM($V77:AD77)),IF(SUM($P77*$U77/12,$V77:AD77)>$P77,$P77-SUM($V77:AD77),$P77*$U77/12),0)","v":{"v":0,"d":"0.00"}},{"$f":"IF(AND(AF$16*1>=$R77,AF$16*1<=$D$8,$R77<$D$8,$P77>SUM($V77:AE77)),IF(SUM($P77*$U77/12,$V77:AE77)>$P77,$P77-SUM($V77:AE77),$P77*$U77/12),0)","v":{"v":0,"d":"0.00"}},{"$f":"IF(AND(AG$16*1>=$R77,AG$16*1<=$D$8,$R77<$D$8,$P77>SUM($V77:AF77)),IF(SUM($P77*$U77/12,$V77:AF77)>$P77,$P77-SUM($V77:AF77),$P77*$U77/12),0)","v":{"v":0,"d":"0.00"}},{"$f":"IF(AND(AH$16*1>=$R77,AH$16*1<=$D$8,$R77<$D$8,$P77>SUM($V77:AG77)),IF(SUM($P77*$U77/12,$V77:AG77)>$P77,$P77-SUM($V77:AG77),$P77*$U77/12),0)","v":{"v":0,"d":"0.00"}},{"v":7.9245833333333335,"d":"7.92"},null,null,{"v":19.01475,"d":"19.01"},null,{"v":19.01475,"d":"19.01"}]
[null,null,62,"335111","ARCHIVAD. DE 4 GAV. METAL NEGR.(SG)",{"$nulls":3},326.27,{"$nulls":4},326.27,null,326.27,"2018-03-20","2018-04-01",null,null,{"v":0.1,"d":"10%"},24.47,{"$f":"IF(AND(W$16*1>=$R78,W$16*1<=$D$8,$R78<$D$8,$P78>SUM($V78:V78)),IF(SUM($P78*$U78/12,$V78:V78)>$P78,$P78-SUM($V78:V78),$P78*$U78/12),0)","v":{"v":2.718916666666667,"d":"2.72"}},{"$f":"IF(AND(X$16*1>=$R78,X$16*1<=$D$8,$R78<$D$8,$P78>SUM($V78:W78)),IF(SUM($P78*$U78/12,$V78:W78)>$P78,$P78-SUM($V78:W78),$P78*$U78/12),0)","v":{"v":2.718916666666667,"d":"2.72"}},{"$f":"IF(AND(Y$16*1>=$R78,Y$16*1<=$D$8,$R78<$D$8,$P78>SUM($V78:X78)),IF(SUM($P78*$U78/12,$V78:X78)>$P78,$P78-SUM($V78:X78),$P78*$U78/12),0)","v":{"v":2.718916666666667,"d":"2.72"}},{"$f":"IF(AND(Z$16*1>=$R78,Z$16*1<=$D$8,$R78<$D$8,$P78>SUM($V78:Y78)),IF(SUM($P78*$U78/12,$V78:Y78)>$P78,$P78-SUM($V78:Y78),$P78*$U78/12),0)","v":{"v":2.718916666666667,"d":"2.72"}},{"$f":"IF(AND(AA$16*1>=$R78,AA$16*1<=$D$8,$R78<$D$8,$P78>SUM($V78:Z78)),IF(SUM($P78*$U78/12,$V78:Z78)>$P78,$P78-SUM($V78:Z78),$P78*$U78/12),0)","v":{"v":2.718916666666667,"d":"2.72"}},{"$f":"IF(AND(AB$16*1>=$R78,AB$16*1<=$D$8,$R78<$D$8,$P78>SUM($V78:AA78)),IF(SUM($P78*$U78/12,$V78:AA78)>$P78,$P78-SUM($V78:AA78),$P78*$U78/12),0)","v":{"v":0,"d":"0.00"}},{"$f":"IF(AND(AC$16*1>=$R78,AC$16*1<=$D$8,$R78<$D$8,$P78>SUM($V78:AB78)),IF(SUM($P78*$U78/12,$V78:AB78)>$P78,$P78-SUM($V78:AB78),$P78*$U78/12),0)","v":{"v":0,"d":"0.00"}},{"$f":"IF(AND(AD$16*1>=$R78,AD$16*1<=$D$8,$R78<$D$8,$P78>SUM($V78:AC78)),IF(SUM($P78*$U78/12,$V78:AC78)>$P78,$P78-SUM($V78:AC78),$P78*$U78/12),0)","v":{"v":0,"d":"0.00"}},{"$f":"IF(AND(AE$16*1>=$R78,AE$16*1<=$D$8,$R78<$D$8,$P78>SUM($V78:AD78)),IF(SUM($P78*$U78/12,$V78:AD78)>$P78,$P78-SUM($V78:AD78),$P78*$U78/12),0)","v":{"v":0,"d":"0.00"}},{"$f":"IF(AND(AF$16*1>=$R78,AF$16*1<=$D$8,$R78<$D$8,$P78>SUM($V78:AE78)),IF(SUM($P78*$U78/12,$V78:AE78)>$P78,$P78-SUM($V78:AE78),$P78*$U78/12),0)","v":{"v":0,"d":"0.00"}},{"$f":"IF(AND(AG$16*1>=$R78,AG$16*1<=$D$8,$R78<$D$8,$P78>SUM($V78:AF78)),IF(SUM($P78*$U78/12,$V78:AF78)>$P78,$P78-SUM($V78:AF78),$P78*$U78/12),0)","v":{"v":0,"d":"0.00"}},{"$f":"IF(AND(AH$16*1>=$R78,AH$16*1<=$D$8,$R78<$D$8,$P78>SUM($V78:AG78)),IF(SUM($P78*$U78/12,$V78:AG78)>$P78,$P78-SUM($V78:AG78),$P78*$U78/12),0)","v":{"v":0,"d":"0.00"}},{"v":13.594583333333334,"d":"13.59"},null,null,{"v":32.62675,"d":"32.63"},null,{"v":32.62675,"d":"32.63"}]
[null,null,63,"335111","ARCHIVAD. DE 4 GAV. METAL NEGR.(LLT)",{"$nulls":3},326.27,{"$nulls":4},326.27,null,326.27,"2018-03-20","2018-04-01",null,null,{"v":0.1,"d":"10%"},24.47,{"$f":"IF(AND(W$16*1>=$R79,W$16*1<=$D$8,$R79<$D$8,$P79>SUM($V79:V79)),IF(SUM($P79*$U79/12,$V79:V79)>$P79,$P79-SUM($V79:V79),$P79*$U79/12),0)","v":{"v":2.718916666666667,"d":"2.72"}},{"$f":"IF(AND(X$16*1>=$R79,X$16*1<=$D$8,$R79<$D$8,$P79>SUM($V79:W79)),IF(SUM($P79*$U79/12,$V79:W79)>$P79,$P79-SUM($V79:W79),$P79*$U79/12),0)","v":{"v":2.718916666666667,"d":"2.72"}},{"$f":"IF(AND(Y$16*1>=$R79,Y$16*1<=$D$8,$R79<$D$8,$P79>SUM($V79:X79)),IF(SUM($P79*$U79/12,$V79:X79)>$P79,$P79-SUM($V79:X79),$P79*$U79/12),0)","v":{"v":2.718916666666667,"d":"2.72"}},{"$f":"IF(AND(Z$16*1>=$R79,Z$16*1<=$D$8,$R79<$D$8,$P79>SUM($V79:Y79)),IF(SUM($P79*$U79/12,$V79:Y79)>$P79,$P79-SUM($V79:Y79),$P79*$U79/12),0)","v":{"v":2.718916666666667,"d":"2.72"}},{"$f":"IF(AND(AA$16*1>=$R79,AA$16*1<=$D$8,$R79<$D$8,$P79>SUM($V79:Z79)),IF(SUM($P79*$U79/12,$V79:Z79)>$P79,$P79-SUM($V79:Z79),$P79*$U79/12),0)","v":{"v":2.718916666666667,"d":"2.72"}},{"$f":"IF(AND(AB$16*1>=$R79,AB$16*1<=$D$8,$R79<$D$8,$P79>SUM($V79:AA79)),IF(SUM($P79*$U79/12,$V79:AA79)>$P79,$P79-SUM($V79:AA79),$P79*$U79/12),0)","v":{"v":0,"d":"0.00"}},{"$f":"IF(AND(AC$16*1>=$R79,AC$16*1<=$D$8,$R79<$D$8,$P79>SUM($V79:AB79)),IF(SUM($P79*$U79/12,$V79:AB79)>$P79,$P79-SUM($V79:AB79),$P79*$U79/12),0)","v":{"v":0,"d":"0.00"}},{"$f":"IF(AND(AD$16*1>=$R79,AD$16*1<=$D$8,$R79<$D$8,$P79>SUM($V79:AC79)),IF(SUM($P79*$U79/12,$V79:AC79)>$P79,$P79-SUM($V79:AC79),$P79*$U79/12),0)","v":{"v":0,"d":"0.00"}},{"$f":"IF(AND(AE$16*1>=$R79,AE$16*1<=$D$8,$R79<$D$8,$P79>SUM($V79:AD79)),IF(SUM($P79*$U79/12,$V79:AD79)>$P79,$P79-SUM($V79:AD79),$P79*$U79/12),0)","v":{"v":0,"d":"0.00"}},{"$f":"IF(AND(AF$16*1>=$R79,AF$16*1<=$D$8,$R79<$D$8,$P79>SUM($V79:AE79)),IF(SUM($P79*$U79/12,$V79:AE79)>$P79,$P79-SUM($V79:AE79),$P79*$U79/12),0)","v":{"v":0,"d":"0.00"}},{"$f":"IF(AND(AG$16*1>=$R79,AG$16*1<=$D$8,$R79<$D$8,$P79>SUM($V79:AF79)),IF(SUM($P79*$U79/12,$V79:AF79)>$P79,$P79-SUM($V79:AF79),$P79*$U79/12),0)","v":{"v":0,"d":"0.00"}},{"$f":"IF(AND(AH$16*1>=$R79,AH$16*1<=$D$8,$R79<$D$8,$P79>SUM($V79:AG79)),IF(SUM($P79*$U79/12,$V79:AG79)>$P79,$P79-SUM($V79:AG79),$P79*$U79/12),0)","v":{"v":0,"d":"0.00"}},{"v":13.594583333333334,"d":"13.59"},null,null,{"v":32.62675,"d":"32.63"},null,{"v":32.62675,"d":"32.63"}]
[null,null,64,"335111","ARCHIVAD. DE 4 GAV. METAL NEGR.(PAT)",{"$nulls":3},326.27,{"$nulls":4},326.27,null,326.27,"2018-03-20","2018-04-01",null,null,{"v":0.1,"d":"10%"},24.47,{"$f":"IF(AND(W$16*1>=$R80,W$16*1<=$D$8,$R80<$D$8,$P80>SUM($V80:V80)),IF(SUM($P80*$U80/12,$V80:V80)>$P80,$P80-SUM($V80:V80),$P80*$U80/12),0)","v":{"v":2.718916666666667,"d":"2.72"}},{"$f":"IF(AND(X$16*1>=$R80,X$16*1<=$D$8,$R80<$D$8,$P80>SUM($V80:W80)),IF(SUM($P80*$U80/12,$V80:W80)>$P80,$P80-SUM($V80:W80),$P80*$U80/12),0)","v":{"v":2.718916666666667,"d":"2.72"}},{"$f":"IF(AND(Y$16*1>=$R80,Y$16*1<=$D$8,$R80<$D$8,$P80>SUM($V80:X80)),IF(SUM($P80*$U80/12,$V80:X80)>$P80,$P80-SUM($V80:X80),$P80*$U80/12),0)","v":{"v":2.718916666666667,"d":"2.72"}},{"$f":"IF(AND(Z$16*1>=$R80,Z$16*1<=$D$8,$R80<$D$8,$P80>SUM($V80:Y80)),IF(SUM($P80*$U80/12,$V80:Y80)>$P80,$P80-SUM($V80:Y80),$P80*$U80/12),0)","v":{"v":2.718916666666667,"d":"2.72"}},{"$f":"IF(AND(AA$16*1>=$R80,AA$16*1<=$D$8,$R80<$D$8,$P80>SUM($V80:Z80)),IF(SUM($P80*$U80/12,$V80:Z80)>$P80,$P80-SUM($V80:Z80),$P80*$U80/12),0)","v":{"v":2.718916666666667,"d":"2.72"}},{"$f":"IF(AND(AB$16*1>=$R80,AB$16*1<=$D$8,$R80<$D$8,$P80>SUM($V80:AA80)),IF(SUM($P80*$U80/12,$V80:AA80)>$P80,$P80-SUM($V80:AA80),$P80*$U80/12),0)","v":{"v":0,"d":"0.00"}},{"$f":"IF(AND(AC$16*1>=$R80,AC$16*1<=$D$8,$R80<$D$8,$P80>SUM($V80:AB80)),IF(SUM($P80*$U80/12,$V80:AB80)>$P80,$P80-SUM($V80:AB80),$P80*$U80/12),0)","v":{"v":0,"d":"0.00"}},{"$f":"IF(AND(AD$16*1>=$R80,AD$16*1<=$D$8,$R80<$D$8,$P80>SUM($V80:AC80)),IF(SUM($P80*$U80/12,$V80:AC80)>$P80,$P80-SUM($V80:AC80),$P80*$U80/12),0)","v":{"v":0,"d":"0.00"}},{"$f":"IF(AND(AE$16*1>=$R80,AE$16*1<=$D$8,$R80<$D$8,$P80>SUM($V80:AD80)),IF(SUM($P80*$U80/12,$V80:AD80)>$P80,$P80-SUM($V80:AD80),$P80*$U80/12),0)","v":{"v":0,"d":"0.00"}},{"$f":"IF(AND(AF$16*1>=$R80,AF$16*1<=$D$8,$R80<$D$8,$P80>SUM($V80:AE80)),IF(SUM($P80*$U80/12,$V80:AE80)>$P80,$P80-SUM($V80:AE80),$P80*$U80/12),0)","v":{"v":0,"d":"0.00"}},{"$f":"IF(AND(AG$16*1>=$R80,AG$16*1<=$D$8,$R80<$D$8,$P80>SUM($V80:AF80)),IF(SUM($P80*$U80/12,$V80:AF80)>$P80,$P80-SUM($V80:AF80),$P80*$U80/12),0)","v":{"v":0,"d":"0.00"}},{"$f":"IF(AND(AH$16*1>=$R80,AH$16*1<=$D$8,$R80<$D$8,$P80>SUM($V80:AG80)),IF(SUM($P80*$U80/12,$V80:AG80)>$P80,$P80-SUM($V80:AG80),$P80*$U80/12),0)","v":{"v":0,"d":"0.00"}},{"v":13.594583333333334,"d":"13.59"},null,null,{"v":32.62675,"d":"32.63"},null,{"v":32.62675,"d":"32.63"}]
[null,null,65,"335111","ARCHIVAD. DE 4 GAV. METAL NEGR.(ARCH)",{"$nulls":3},326.27,{"$nulls":4},326.27,null,326.27,"2018-03-20","2018-04-01",null,null,{"v":0.1,"d":"10%"},24.47,{"$f":"IF(AND(W$16*1>=$R81,W$16*1<=$D$8,$R81<$D$8,$P81>SUM($V81:V81)),IF(SUM($P81*$U81/12,$V81:V81)>$P81,$P81-SUM($V81:V81),$P81*$U81/12),0)","v":{"v":2.718916666666667,"d":"2.72"}},{"$f":"IF(AND(X$16*1>=$R81,X$16*1<=$D$8,$R81<$D$8,$P81>SUM($V81:W81)),IF(SUM($P81*$U81/12,$V81:W81)>$P81,$P81-SUM($V81:W81),$P81*$U81/12),0)","v":{"v":2.718916666666667,"d":"2.72"}},{"$f":"IF(AND(Y$16*1>=$R81,Y$16*1<=$D$8,$R81<$D$8,$P81>SUM($V81:X81)),IF(SUM($P81*$U81/12,$V81:X81)>$P81,$P81-SUM($V81:X81),$P81*$U81/12),0)","v":{"v":2.718916666666667,"d":"2.72"}},{"$f":"IF(AND(Z$16*1>=$R81,Z$16*1<=$D$8,$R81<$D$8,$P81>SUM($V81:Y81)),IF(SUM($P81*$U81/12,$V81:Y81)>$P81,$P81-SUM($V81:Y81),$P81*$U81/12),0)","v":{"v":2.718916666666667,"d":"2.72"}},{"$f":"IF(AND(AA$16*1>=$R81,AA$16*1<=$D$8,$R81<$D$8,$P81>SUM($V81:Z81)),IF(SUM($P81*$U81/12,$V81:Z81)>$P81,$P81-SUM($V81:Z81),$P81*$U81/12),0)","v":{"v":2.718916666666667,"d":"2.72"}},{"$f":"IF(AND(AB$16*1>=$R81,AB$16*1<=$D$8,$R81<$D$8,$P81>SUM($V81:AA81)),IF(SUM($P81*$U81/12,$V81:AA81)>$P81,$P81-SUM($V81:AA81),$P81*$U81/12),0)","v":{"v":0,"d":"0.00"}},{"$f":"IF(AND(AC$16*1>=$R81,AC$16*1<=$D$8,$R81<$D$8,$P81>SUM($V81:AB81)),IF(SUM($P81*$U81/12,$V81:AB81)>$P81,$P81-SUM($V81:AB81),$P81*$U81/12),0)","v":{"v":0,"d":"0.00"}},{"$f":"IF(AND(AD$16*1>=$R81,AD$16*1<=$D$8,$R81<$D$8,$P81>SUM($V81:AC81)),IF(SUM($P81*$U81/12,$V81:AC81)>$P81,$P81-SUM($V81:AC81),$P81*$U81/12),0)","v":{"v":0,"d":"0.00"}},{"$f":"IF(AND(AE$16*1>=$R81,AE$16*1<=$D$8,$R81<$D$8,$P81>SUM($V81:AD81)),IF(SUM($P81*$U81/12,$V81:AD81)>$P81,$P81-SUM($V81:AD81),$P81*$U81/12),0)","v":{"v":0,"d":"0.00"}},{"$f":"IF(AND(AF$16*1>=$R81,AF$16*1<=$D$8,$R81<$D$8,$P81>SUM($V81:AE81)),IF(SUM($P81*$U81/12,$V81:AE81)>$P81,$P81-SUM($V81:AE81),$P81*$U81/12),0)","v":{"v":0,"d":"0.00"}},{"$f":"IF(AND(AG$16*1>=$R81,AG$16*1<=$D$8,$R81<$D$8,$P81>SUM($V81:AF81)),IF(SUM($P81*$U81/12,$V81:AF81)>$P81,$P81-SUM($V81:AF81),$P81*$U81/12),0)","v":{"v":0,"d":"0.00"}},{"$f":"IF(AND(AH$16*1>=$R81,AH$16*1<=$D$8,$R81<$D$8,$P81>SUM($V81:AG81)),IF(SUM($P81*$U81/12,$V81:AG81)>$P81,$P81-SUM($V81:AG81),$P81*$U81/12),0)","v":{"v":0,"d":"0.00"}},{"$f":"SUM(W81:AH81)","v":{"v":13.594583333333334,"d":"13.59"}},null,null,{"v":32.62675,"d":"32.63"},null,{"v":32.62675,"d":"32.63"}]
[null,null,66,"335111","ARCHIVAD. DE 4 GAV. METAL NEGR.(ARCH)",{"$nulls":3},326.27,{"$nulls":4},326.27,null,326.27,"2018-03-20","2018-04-01",null,null,{"v":0.1,"d":"10%"},24.47,{"$f":"IF(AND(W$16*1>=$R82,W$16*1<=$D$8,$R82<$D$8,$P82>SUM($V82:V82)),IF(SUM($P82*$U82/12,$V82:V82)>$P82,$P82-SUM($V82:V82),$P82*$U82/12),0)","v":{"v":2.718916666666667,"d":"2.72"}},{"$f":"IF(AND(X$16*1>=$R82,X$16*1<=$D$8,$R82<$D$8,$P82>SUM($V82:W82)),IF(SUM($P82*$U82/12,$V82:W82)>$P82,$P82-SUM($V82:W82),$P82*$U82/12),0)","v":{"v":2.718916666666667,"d":"2.72"}},{"$f":"IF(AND(Y$16*1>=$R82,Y$16*1<=$D$8,$R82<$D$8,$P82>SUM($V82:X82)),IF(SUM($P82*$U82/12,$V82:X82)>$P82,$P82-SUM($V82:X82),$P82*$U82/12),0)","v":{"v":2.718916666666667,"d":"2.72"}},{"$f":"IF(AND(Z$16*1>=$R82,Z$16*1<=$D$8,$R82<$D$8,$P82>SUM($V82:Y82)),IF(SUM($P82*$U82/12,$V82:Y82)>$P82,$P82-SUM($V82:Y82),$P82*$U82/12),0)","v":{"v":2.718916666666667,"d":"2.72"}},{"$f":"IF(AND(AA$16*1>=$R82,AA$16*1<=$D$8,$R82<$D$8,$P82>SUM($V82:Z82)),IF(SUM($P82*$U82/12,$V82:Z82)>$P82,$P82-SUM($V82:Z82),$P82*$U82/12),0)","v":{"v":2.718916666666667,"d":"2.72"}},{"$f":"IF(AND(AB$16*1>=$R82,AB$16*1<=$D$8,$R82<$D$8,$P82>SUM($V82:AA82)),IF(SUM($P82*$U82/12,$V82:AA82)>$P82,$P82-SUM($V82:AA82),$P82*$U82/12),0)","v":{"v":0,"d":"0.00"}},{"$f":"IF(AND(AC$16*1>=$R82,AC$16*1<=$D$8,$R82<$D$8,$P82>SUM($V82:AB82)),IF(SUM($P82*$U82/12,$V82:AB82)>$P82,$P82-SUM($V82:AB82),$P82*$U82/12),0)","v":{"v":0,"d":"0.00"}},{"$f":"IF(AND(AD$16*1>=$R82,AD$16*1<=$D$8,$R82<$D$8,$P82>SUM($V82:AC82)),IF(SUM($P82*$U82/12,$V82:AC82)>$P82,$P82-SUM($V82:AC82),$P82*$U82/12),0)","v":{"v":0,"d":"0.00"}},{"$f":"IF(AND(AE$16*1>=$R82,AE$16*1<=$D$8,$R82<$D$8,$P82>SUM($V82:AD82)),IF(SUM($P82*$U82/12,$V82:AD82)>$P82,$P82-SUM($V82:AD82),$P82*$U82/12),0)","v":{"v":0,"d":"0.00"}},{"$f":"IF(AND(AF$16*1>=$R82,AF$16*1<=$D$8,$R82<$D$8,$P82>SUM($V82:AE82)),IF(SUM($P82*$U82/12,$V82:AE82)>$P82,$P82-SUM($V82:AE82),$P82*$U82/12),0)","v":{"v":0,"d":"0.00"}},{"$f":"IF(AND(AG$16*1>=$R82,AG$16*1<=$D$8,$R82<$D$8,$P82>SUM($V82:AF82)),IF(SUM($P82*$U82/12,$V82:AF82)>$P82,$P82-SUM($V82:AF82),$P82*$U82/12),0)","v":{"v":0,"d":"0.00"}},{"$f":"IF(AND(AH$16*1>=$R82,AH$16*1<=$D$8,$R82<$D$8,$P82>SUM($V82:AG82)),IF(SUM($P82*$U82/12,$V82:AG82)>$P82,$P82-SUM($V82:AG82),$P82*$U82/12),0)","v":{"v":0,"d":"0.00"}},{"v":13.594583333333334,"d":"13.59"},null,null,{"v":32.62675,"d":"32.63"},null,{"v":32.62675,"d":"32.63"}]
[null,null,67,"335111","ESCRITORIO DE VIDRIO OF. PARALEGAL",{"$nulls":3},586.63,{"$nulls":4},586.63,null,586.63,"2018-08-22","2018-09-01",null,null,{"v":0.1,"d":"10%"},19.55,{"$f":"IF(AND(W$16*1>=$R83,W$16*1<=$D$8,$R83<$D$8,$P83>SUM($V83:V83)),IF(SUM($P83*$U83/12,$V83:V83)>$P83,$P83-SUM($V83:V83),$P83*$U83/12),0)","v":{"v":4.888583333333334,"d":"4.89"}},{"$f":"IF(AND(X$16*1>=$R83,X$16*1<=$D$8,$R83<$D$8,$P83>SUM($V83:W83)),IF(SUM($P83*$U83/12,$V83:W83)>$P83,$P83-SUM($V83:W83),$P83*$U83/12),0)","v":{"v":4.888583333333334,"d":"4.89"}},{"$f":"IF(AND(Y$16*1>=$R83,Y$16*1<=$D$8,$R83<$D$8,$P83>SUM($V83:X83)),IF(SUM($P83*$U83/12,$V83:X83)>$P83,$P83-SUM($V83:X83),$P83*$U83/12),0)","v":{"v":4.888583333333334,"d":"4.89"}},{"$f":"IF(AND(Z$16*1>=$R83,Z$16*1<=$D$8,$R83<$D$8,$P83>SUM($V83:Y83)),IF(SUM($P83*$U83/12,$V83:Y83)>$P83,$P83-SUM($V83:Y83),$P83*$U83/12),0)","v":{"v":4.888583333333334,"d":"4.89"}},{"$f":"IF(AND(AA$16*1>=$R83,AA$16*1<=$D$8,$R83<$D$8,$P83>SUM($V83:Z83)),IF(SUM($P83*$U83/12,$V83:Z83)>$P83,$P83-SUM($V83:Z83),$P83*$U83/12),0)","v":{"v":4.888583333333334,"d":"4.89"}},{"$f":"IF(AND(AB$16*1>=$R83,AB$16*1<=$D$8,$R83<$D$8,$P83>SUM($V83:AA83)),IF(SUM($P83*$U83/12,$V83:AA83)>$P83,$P83-SUM($V83:AA83),$P83*$U83/12),0)","v":{"v":0,"d":"0.00"}},{"$f":"IF(AND(AC$16*1>=$R83,AC$16*1<=$D$8,$R83<$D$8,$P83>SUM($V83:AB83)),IF(SUM($P83*$U83/12,$V83:AB83)>$P83,$P83-SUM($V83:AB83),$P83*$U83/12),0)","v":{"v":0,"d":"0.00"}},{"$f":"IF(AND(AD$16*1>=$R83,AD$16*1<=$D$8,$R83<$D$8,$P83>SUM($V83:AC83)),IF(SUM($P83*$U83/12,$V83:AC83)>$P83,$P83-SUM($V83:AC83),$P83*$U83/12),0)","v":{"v":0,"d":"0.00"}},{"$f":"IF(AND(AE$16*1>=$R83,AE$16*1<=$D$8,$R83<$D$8,$P83>SUM($V83:AD83)),IF(SUM($P83*$U83/12,$V83:AD83)>$P83,$P83-SUM($V83:AD83),$P83*$U83/12),0)","v":{"v":0,"d":"0.00"}},{"$f":"IF(AND(AF$16*1>=$R83,AF$16*1<=$D$8,$R83<$D$8,$P83>SUM($V83:AE83)),IF(SUM($P83*$U83/12,$V83:AE83)>$P83,$P83-SUM($V83:AE83),$P83*$U83/12),0)","v":{"v":0,"d":"0.00"}},{"$f":"IF(AND(AG$16*1>=$R83,AG$16*1<=$D$8,$R83<$D$8,$P83>SUM($V83:AF83)),IF(SUM($P83*$U83/12,$V83:AF83)>$P83,$P83-SUM($V83:AF83),$P83*$U83/12),0)","v":{"v":0,"d":"0.00"}},{"$f":"IF(AND(AH$16*1>=$R83,AH$16*1<=$D$8,$R83<$D$8,$P83>SUM($V83:AG83)),IF(SUM($P83*$U83/12,$V83:AG83)>$P83,$P83-SUM($V83:AG83),$P83*$U83/12),0)","v":{"v":0,"d":"0.00"}},{"v":24.44291666666667,"d":"24.44"},null,null,{"v":34.21575,"d":"34.22"},null,{"v":34.21575,"d":"34.22"}]
[null,null,68,"335111","ESCRITORIO VIDRIO OF. CONTABILIDAD ",{"$nulls":3},586.63,{"$nulls":4},586.63,null,586.63,"2018-08-22","2018-09-01",null,null,{"v":0.1,"d":"10%"},19.55,{"$f":"IF(AND(W$16*1>=$R84,W$16*1<=$D$8,$R84<$D$8,$P84>SUM($V84:V84)),IF(SUM($P84*$U84/12,$V84:V84)>$P84,$P84-SUM($V84:V84),$P84*$U84/12),0)","v":{"v":4.888583333333334,"d":"4.89"}},{"$f":"IF(AND(X$16*1>=$R84,X$16*1<=$D$8,$R84<$D$8,$P84>SUM($V84:W84)),IF(SUM($P84*$U84/12,$V84:W84)>$P84,$P84-SUM($V84:W84),$P84*$U84/12),0)","v":{"v":4.888583333333334,"d":"4.89"}},{"$f":"IF(AND(Y$16*1>=$R84,Y$16*1<=$D$8,$R84<$D$8,$P84>SUM($V84:X84)),IF(SUM($P84*$U84/12,$V84:X84)>$P84,$P84-SUM($V84:X84),$P84*$U84/12),0)","v":{"v":4.888583333333334,"d":"4.89"}},{"$f":"IF(AND(Z$16*1>=$R84,Z$16*1<=$D$8,$R84<$D$8,$P84>SUM($V84:Y84)),IF(SUM($P84*$U84/12,$V84:Y84)>$P84,$P84-SUM($V84:Y84),$P84*$U84/12),0)","v":{"v":4.888583333333334,"d":"4.89"}},{"$f":"IF(AND(AA$16*1>=$R84,AA$16*1<=$D$8,$R84<$D$8,$P84>SUM($V84:Z84)),IF(SUM($P84*$U84/12,$V84:Z84)>$P84,$P84-SUM($V84:Z84),$P84*$U84/12),0)","v":{"v":4.888583333333334,"d":"4.89"}},{"$f":"IF(AND(AB$16*1>=$R84,AB$16*1<=$D$8,$R84<$D$8,$P84>SUM($V84:AA84)),IF(SUM($P84*$U84/12,$V84:AA84)>$P84,$P84-SUM($V84:AA84),$P84*$U84/12),0)","v":{"v":0,"d":"0.00"}},{"$f":"IF(AND(AC$16*1>=$R84,AC$16*1<=$D$8,$R84<$D$8,$P84>SUM($V84:AB84)),IF(SUM($P84*$U84/12,$V84:AB84)>$P84,$P84-SUM($V84:AB84),$P84*$U84/12),0)","v":{"v":0,"d":"0.00"}},{"$f":"IF(AND(AD$16*1>=$R84,AD$16*1<=$D$8,$R84<$D$8,$P84>SUM($V84:AC84)),IF(SUM($P84*$U84/12,$V84:AC84)>$P84,$P84-SUM($V84:AC84),$P84*$U84/12),0)","v":{"v":0,"d":"0.00"}},{"$f":"IF(AND(AE$16*1>=$R84,AE$16*1<=$D$8,$R84<$D$8,$P84>SUM($V84:AD84)),IF(SUM($P84*$U84/12,$V84:AD84)>$P84,$P84-SUM($V84:AD84),$P84*$U84/12),0)","v":{"v":0,"d":"0.00"}},{"$f":"IF(AND(AF$16*1>=$R84,AF$16*1<=$D$8,$R84<$D$8,$P84>SUM($V84:AE84)),IF(SUM($P84*$U84/12,$V84:AE84)>$P84,$P84-SUM($V84:AE84),$P84*$U84/12),0)","v":{"v":0,"d":"0.00"}},{"$f":"IF(AND(AG$16*1>=$R84,AG$16*1<=$D$8,$R84<$D$8,$P84>SUM($V84:AF84)),IF(SUM($P84*$U84/12,$V84:AF84)>$P84,$P84-SUM($V84:AF84),$P84*$U84/12),0)","v":{"v":0,"d":"0.00"}},{"$f":"IF(AND(AH$16*1>=$R84,AH$16*1<=$D$8,$R84<$D$8,$P84>SUM($V84:AG84)),IF(SUM($P84*$U84/12,$V84:AG84)>$P84,$P84-SUM($V84:AG84),$P84*$U84/12),0)","v":{"v":0,"d":"0.00"}},{"v":24.44291666666667,"d":"24.44"},null,null,{"v":34.21575,"d":"34.22"},null,{"v":34.21575,"d":"34.22"}]
[null,null,69,"335111","ARCHIVADOR METALICO: CK",{"$nulls":3},326.27,{"$nulls":4},326.27,null,326.27,"2018-10-06","2018-11-01",null,null,{"v":0.1,"d":"10%"},5.44,{"$f":"IF(AND(W$16*1>=$R85,W$16*1<=$D$8,$R85<$D$8,$P85>SUM($V85:V85)),IF(SUM($P85*$U85/12,$V85:V85)>$P85,$P85-SUM($V85:V85),$P85*$U85/12),0)","v":{"v":2.718916666666667,"d":"2.72"}},{"$f":"IF(AND(X$16*1>=$R85,X$16*1<=$D$8,$R85<$D$8,$P85>SUM($V85:W85)),IF(SUM($P85*$U85/12,$V85:W85)>$P85,$P85-SUM($V85:W85),$P85*$U85/12),0)","v":{"v":2.718916666666667,"d":"2.72"}},{"$f":"IF(AND(Y$16*1>=$R85,Y$16*1<=$D$8,$R85<$D$8,$P85>SUM($V85:X85)),IF(SUM($P85*$U85/12,$V85:X85)>$P85,$P85-SUM($V85:X85),$P85*$U85/12),0)","v":{"v":2.718916666666667,"d":"2.72"}},{"$f":"IF(AND(Z$16*1>=$R85,Z$16*1<=$D$8,$R85<$D$8,$P85>SUM($V85:Y85)),IF(SUM($P85*$U85/12,$V85:Y85)>$P85,$P85-SUM($V85:Y85),$P85*$U85/12),0)","v":{"v":2.718916666666667,"d":"2.72"}},{"$f":"IF(AND(AA$16*1>=$R85,AA$16*1<=$D$8,$R85<$D$8,$P85>SUM($V85:Z85)),IF(SUM($P85*$U85/12,$V85:Z85)>$P85,$P85-SUM($V85:Z85),$P85*$U85/12),0)","v":{"v":2.718916666666667,"d":"2.72"}},{"$f":"IF(AND(AB$16*1>=$R85,AB$16*1<=$D$8,$R85<$D$8,$P85>SUM($V85:AA85)),IF(SUM($P85*$U85/12,$V85:AA85)>$P85,$P85-SUM($V85:AA85),$P85*$U85/12),0)","v":{"v":0,"d":"0.00"}},{"$f":"IF(AND(AC$16*1>=$R85,AC$16*1<=$D$8,$R85<$D$8,$P85>SUM($V85:AB85)),IF(SUM($P85*$U85/12,$V85:AB85)>$P85,$P85-SUM($V85:AB85),$P85*$U85/12),0)","v":{"v":0,"d":"0.00"}},{"$f":"IF(AND(AD$16*1>=$R85,AD$16*1<=$D$8,$R85<$D$8,$P85>SUM($V85:AC85)),IF(SUM($P85*$U85/12,$V85:AC85)>$P85,$P85-SUM($V85:AC85),$P85*$U85/12),0)","v":{"v":0,"d":"0.00"}},{"$f":"IF(AND(AE$16*1>=$R85,AE$16*1<=$D$8,$R85<$D$8,$P85>SUM($V85:AD85)),IF(SUM($P85*$U85/12,$V85:AD85)>$P85,$P85-SUM($V85:AD85),$P85*$U85/12),0)","v":{"v":0,"d":"0.00"}},{"$f":"IF(AND(AF$16*1>=$R85,AF$16*1<=$D$8,$R85<$D$8,$P85>SUM($V85:AE85)),IF(SUM($P85*$U85/12,$V85:AE85)>$P85,$P85-SUM($V85:AE85),$P85*$U85/12),0)","v":{"v":0,"d":"0.00"}},{"$f":"IF(AND(AG$16*1>=$R85,AG$16*1<=$D$8,$R85<$D$8,$P85>SUM($V85:AF85)),IF(SUM($P85*$U85/12,$V85:AF85)>$P85,$P85-SUM($V85:AF85),$P85*$U85/12),0)","v":{"v":0,"d":"0.00"}},{"$f":"IF(AND(AH$16*1>=$R85,AH$16*1<=$D$8,$R85<$D$8,$P85>SUM($V85:AG85)),IF(SUM($P85*$U85/12,$V85:AG85)>$P85,$P85-SUM($V85:AG85),$P85*$U85/12),0)","v":{"v":0,"d":"0.00"}},{"v":13.594583333333334,"d":"13.59"},null,null,{"v":13.59675,"d":"13.60"},null,{"v":13.59675,"d":"13.60"}]
[null,null,70,"335111","ARCHIVADOR METALICO: SG",{"$nulls":3},326.27,{"$nulls":4},326.27,null,326.27,"2018-10-06","2018-11-01",null,null,{"v":0.1,"d":"10%"},5.44,{"$f":"IF(AND(W$16*1>=$R86,W$16*1<=$D$8,$R86<$D$8,$P86>SUM($V86:V86)),IF(SUM($P86*$U86/12,$V86:V86)>$P86,$P86-SUM($V86:V86),$P86*$U86/12),0)","v":{"v":2.718916666666667,"d":"2.72"}},{"$f":"IF(AND(X$16*1>=$R86,X$16*1<=$D$8,$R86<$D$8,$P86>SUM($V86:W86)),IF(SUM($P86*$U86/12,$V86:W86)>$P86,$P86-SUM($V86:W86),$P86*$U86/12),0)","v":{"v":2.718916666666667,"d":"2.72"}},{"$f":"IF(AND(Y$16*1>=$R86,Y$16*1<=$D$8,$R86<$D$8,$P86>SUM($V86:X86)),IF(SUM($P86*$U86/12,$V86:X86)>$P86,$P86-SUM($V86:X86),$P86*$U86/12),0)","v":{"v":2.718916666666667,"d":"2.72"}},{"$f":"IF(AND(Z$16*1>=$R86,Z$16*1<=$D$8,$R86<$D$8,$P86>SUM($V86:Y86)),IF(SUM($P86*$U86/12,$V86:Y86)>$P86,$P86-SUM($V86:Y86),$P86*$U86/12),0)","v":{"v":2.718916666666667,"d":"2.72"}},{"$f":"IF(AND(AA$16*1>=$R86,AA$16*1<=$D$8,$R86<$D$8,$P86>SUM($V86:Z86)),IF(SUM($P86*$U86/12,$V86:Z86)>$P86,$P86-SUM($V86:Z86),$P86*$U86/12),0)","v":{"v":2.718916666666667,"d":"2.72"}},{"$f":"IF(AND(AB$16*1>=$R86,AB$16*1<=$D$8,$R86<$D$8,$P86>SUM($V86:AA86)),IF(SUM($P86*$U86/12,$V86:AA86)>$P86,$P86-SUM($V86:AA86),$P86*$U86/12),0)","v":{"v":0,"d":"0.00"}},{"$f":"IF(AND(AC$16*1>=$R86,AC$16*1<=$D$8,$R86<$D$8,$P86>SUM($V86:AB86)),IF(SUM($P86*$U86/12,$V86:AB86)>$P86,$P86-SUM($V86:AB86),$P86*$U86/12),0)","v":{"v":0,"d":"0.00"}},{"$f":"IF(AND(AD$16*1>=$R86,AD$16*1<=$D$8,$R86<$D$8,$P86>SUM($V86:AC86)),IF(SUM($P86*$U86/12,$V86:AC86)>$P86,$P86-SUM($V86:AC86),$P86*$U86/12),0)","v":{"v":0,"d":"0.00"}},{"$f":"IF(AND(AE$16*1>=$R86,AE$16*1<=$D$8,$R86<$D$8,$P86>SUM($V86:AD86)),IF(SUM($P86*$U86/12,$V86:AD86)>$P86,$P86-SUM($V86:AD86),$P86*$U86/12),0)","v":{"v":0,"d":"0.00"}},{"$f":"IF(AND(AF$16*1>=$R86,AF$16*1<=$D$8,$R86<$D$8,$P86>SUM($V86:AE86)),IF(SUM($P86*$U86/12,$V86:AE86)>$P86,$P86-SUM($V86:AE86),$P86*$U86/12),0)","v":{"v":0,"d":"0.00"}},{"$f":"IF(AND(AG$16*1>=$R86,AG$16*1<=$D$8,$R86<$D$8,$P86>SUM($V86:AF86)),IF(SUM($P86*$U86/12,$V86:AF86)>$P86,$P86-SUM($V86:AF86),$P86*$U86/12),0)","v":{"v":0,"d":"0.00"}},{"$f":"IF(AND(AH$16*1>=$R86,AH$16*1<=$D$8,$R86<$D$8,$P86>SUM($V86:AG86)),IF(SUM($P86*$U86/12,$V86:AG86)>$P86,$P86-SUM($V86:AG86),$P86*$U86/12),0)","v":{"v":0,"d":"0.00"}},{"v":13.594583333333334,"d":"13.59"},null,null,{"v":13.59675,"d":"13.60"},null,{"v":13.59675,"d":"13.60"}]
[null,null,71,"335111","MESA SIMPLEX DA60 1LY/90",{"$nulls":3},304.32,{"$nulls":4},304.32,null,304.32,"2018-10-10","2018-11-01",null,null,{"v":0.1,"d":"10%"},5.07,{"$f":"IF(AND(W$16*1>=$R87,W$16*1<=$D$8,$R87<$D$8,$P87>SUM($V87:V87)),IF(SUM($P87*$U87/12,$V87:V87)>$P87,$P87-SUM($V87:V87),$P87*$U87/12),0)","v":{"v":2.536,"d":"2.54"}},{"$f":"IF(AND(X$16*1>=$R87,X$16*1<=$D$8,$R87<$D$8,$P87>SUM($V87:W87)),IF(SUM($P87*$U87/12,$V87:W87)>$P87,$P87-SUM($V87:W87),$P87*$U87/12),0)","v":{"v":2.536,"d":"2.54"}},{"$f":"IF(AND(Y$16*1>=$R87,Y$16*1<=$D$8,$R87<$D$8,$P87>SUM($V87:X87)),IF(SUM($P87*$U87/12,$V87:X87)>$P87,$P87-SUM($V87:X87),$P87*$U87/12),0)","v":{"v":2.536,"d":"2.54"}},{"$f":"IF(AND(Z$16*1>=$R87,Z$16*1<=$D$8,$R87<$D$8,$P87>SUM($V87:Y87)),IF(SUM($P87*$U87/12,$V87:Y87)>$P87,$P87-SUM($V87:Y87),$P87*$U87/12),0)","v":{"v":2.536,"d":"2.54"}},{"$f":"IF(AND(AA$16*1>=$R87,AA$16*1<=$D$8,$R87<$D$8,$P87>SUM($V87:Z87)),IF(SUM($P87*$U87/12,$V87:Z87)>$P87,$P87-SUM($V87:Z87),$P87*$U87/12),0)","v":{"v":2.536,"d":"2.54"}},{"$f":"IF(AND(AB$16*1>=$R87,AB$16*1<=$D$8,$R87<$D$8,$P87>SUM($V87:AA87)),IF(SUM($P87*$U87/12,$V87:AA87)>$P87,$P87-SUM($V87:AA87),$P87*$U87/12),0)","v":{"v":0,"d":"0.00"}},{"$f":"IF(AND(AC$16*1>=$R87,AC$16*1<=$D$8,$R87<$D$8,$P87>SUM($V87:AB87)),IF(SUM($P87*$U87/12,$V87:AB87)>$P87,$P87-SUM($V87:AB87),$P87*$U87/12),0)","v":{"v":0,"d":"0.00"}},{"$f":"IF(AND(AD$16*1>=$R87,AD$16*1<=$D$8,$R87<$D$8,$P87>SUM($V87:AC87)),IF(SUM($P87*$U87/12,$V87:AC87)>$P87,$P87-SUM($V87:AC87),$P87*$U87/12),0)","v":{"v":0,"d":"0.00"}},{"$f":"IF(AND(AE$16*1>=$R87,AE$16*1<=$D$8,$R87<$D$8,$P87>SUM($V87:AD87)),IF(SUM($P87*$U87/12,$V87:AD87)>$P87,$P87-SUM($V87:AD87),$P87*$U87/12),0)","v":{"v":0,"d":"0.00"}},{"$f":"IF(AND(AF$16*1>=$R87,AF$16*1<=$D$8,$R87<$D$8,$P87>SUM($V87:AE87)),IF(SUM($P87*$U87/12,$V87:AE87)>$P87,$P87-SUM($V87:AE87),$P87*$U87/12),0)","v":{"v":0,"d":"0.00"}},{"$f":"IF(AND(AG$16*1>=$R87,AG$16*1<=$D$8,$R87<$D$8,$P87>SUM($V87:AF87)),IF(SUM($P87*$U87/12,$V87:AF87)>$P87,$P87-SUM($V87:AF87),$P87*$U87/12),0)","v":{"v":0,"d":"0.00"}},{"$f":"IF(AND(AH$16*1>=$R87,AH$16*1<=$D$8,$R87<$D$8,$P87>SUM($V87:AG87)),IF(SUM($P87*$U87/12,$V87:AG87)>$P87,$P87-SUM($V87:AG87),$P87*$U87/12),0)","v":{"v":0,"d":"0.00"}},12.68,null,null,{"v":12.678,"d":"12.68"},null,{"v":12.678,"d":"12.68"}]
[null,null,72,"335111","MESA TRIPOD DA60 1LY",{"$nulls":3},177.54,{"$nulls":4},177.54,null,177.54,"2018-10-10","2018-11-01",null,null,{"v":0.1,"d":"10%"},2.96,{"$f":"IF(AND(W$16*1>=$R88,W$16*1<=$D$8,$R88<$D$8,$P88>SUM($V88:V88)),IF(SUM($P88*$U88/12,$V88:V88)>$P88,$P88-SUM($V88:V88),$P88*$U88/12),0)","v":{"v":1.4795,"d":"1.48"}},{"$f":"IF(AND(X$16*1>=$R88,X$16*1<=$D$8,$R88<$D$8,$P88>SUM($V88:W88)),IF(SUM($P88*$U88/12,$V88:W88)>$P88,$P88-SUM($V88:W88),$P88*$U88/12),0)","v":{"v":1.4795,"d":"1.48"}},{"$f":"IF(AND(Y$16*1>=$R88,Y$16*1<=$D$8,$R88<$D$8,$P88>SUM($V88:X88)),IF(SUM($P88*$U88/12,$V88:X88)>$P88,$P88-SUM($V88:X88),$P88*$U88/12),0)","v":{"v":1.4795,"d":"1.48"}},{"$f":"IF(AND(Z$16*1>=$R88,Z$16*1<=$D$8,$R88<$D$8,$P88>SUM($V88:Y88)),IF(SUM($P88*$U88/12,$V88:Y88)>$P88,$P88-SUM($V88:Y88),$P88*$U88/12),0)","v":{"v":1.4795,"d":"1.48"}},{"$f":"IF(AND(AA$16*1>=$R88,AA$16*1<=$D$8,$R88<$D$8,$P88>SUM($V88:Z88)),IF(SUM($P88*$U88/12,$V88:Z88)>$P88,$P88-SUM($V88:Z88),$P88*$U88/12),0)","v":{"v":1.4795,"d":"1.48"}},{"$f":"IF(AND(AB$16*1>=$R88,AB$16*1<=$D$8,$R88<$D$8,$P88>SUM($V88:AA88)),IF(SUM($P88*$U88/12,$V88:AA88)>$P88,$P88-SUM($V88:AA88),$P88*$U88/12),0)","v":{"v":0,"d":"0.00"}},{"$f":"IF(AND(AC$16*1>=$R88,AC$16*1<=$D$8,$R88<$D$8,$P88>SUM($V88:AB88)),IF(SUM($P88*$U88/12,$V88:AB88)>$P88,$P88-SUM($V88:AB88),$P88*$U88/12),0)","v":{"v":0,"d":"0.00"}},{"$f":"IF(AND(AD$16*1>=$R88,AD$16*1<=$D$8,$R88<$D$8,$P88>SUM($V88:AC88)),IF(SUM($P88*$U88/12,$V88:AC88)>$P88,$P88-SUM($V88:AC88),$P88*$U88/12),0)","v":{"v":0,"d":"0.00"}},{"$f":"IF(AND(AE$16*1>=$R88,AE$16*1<=$D$8,$R88<$D$8,$P88>SUM($V88:AD88)),IF(SUM($P88*$U88/12,$V88:AD88)>$P88,$P88-SUM($V88:AD88),$P88*$U88/12),0)","v":{"v":0,"d":"0.00"}},{"$f":"IF(AND(AF$16*1>=$R88,AF$16*1<=$D$8,$R88<$D$8,$P88>SUM($V88:AE88)),IF(SUM($P88*$U88/12,$V88:AE88)>$P88,$P88-SUM($V88:AE88),$P88*$U88/12),0)","v":{"v":0,"d":"0.00"}},{"$f":"IF(AND(AG$16*1>=$R88,AG$16*1<=$D$8,$R88<$D$8,$P88>SUM($V88:AF88)),IF(SUM($P88*$U88/12,$V88:AF88)>$P88,$P88-SUM($V88:AF88),$P88*$U88/12),0)","v":{"v":0,"d":"0.00"}},{"$f":"IF(AND(AH$16*1>=$R88,AH$16*1<=$D$8,$R88<$D$8,$P88>SUM($V88:AG88)),IF(SUM($P88*$U88/12,$V88:AG88)>$P88,$P88-SUM($V88:AG88),$P88*$U88/12),0)","v":{"v":0,"d":"0.00"}},{"v":7.3975,"d":"7.40"},null,null,{"v":7.3985,"d":"7.40"},null,{"v":7.3985,"d":"7.40"}]
[null,null,73,"335111","BANCO PLATON GRIS",{"$nulls":3},281.44,{"$nulls":4},281.44,null,281.44,"2018-10-10","2018-11-01",null,null,{"v":0.1,"d":"10%"},4.69,{"$f":"IF(AND(W$16*1>=$R89,W$16*1<=$D$8,$R89<$D$8,$P89>SUM($V89:V89)),IF(SUM($P89*$U89/12,$V89:V89)>$P89,$P89-SUM($V89:V89),$P89*$U89/12),0)","v":{"v":2.3453333333333335,"d":"2.35"}},{"$f":"IF(AND(X$16*1>=$R89,X$16*1<=$D$8,$R89<$D$8,$P89>SUM($V89:W89)),IF(SUM($P89*$U89/12,$V89:W89)>$P89,$P89-SUM($V89:W89),$P89*$U89/12),0)","v":{"v":2.3453333333333335,"d":"2.35"}},{"$f":"IF(AND(Y$16*1>=$R89,Y$16*1<=$D$8,$R89<$D$8,$P89>SUM($V89:X89)),IF(SUM($P89*$U89/12,$V89:X89)>$P89,$P89-SUM($V89:X89),$P89*$U89/12),0)","v":{"v":2.3453333333333335,"d":"2.35"}},{"$f":"IF(AND(Z$16*1>=$R89,Z$16*1<=$D$8,$R89<$D$8,$P89>SUM($V89:Y89)),IF(SUM($P89*$U89/12,$V89:Y89)>$P89,$P89-SUM($V89:Y89),$P89*$U89/12),0)","v":{"v":2.3453333333333335,"d":"2.35"}},{"$f":"IF(AND(AA$16*1>=$R89,AA$16*1<=$D$8,$R89<$D$8,$P89>SUM($V89:Z89)),IF(SUM($P89*$U89/12,$V89:Z89)>$P89,$P89-SUM($V89:Z89),$P89*$U89/12),0)","v":{"v":2.3453333333333335,"d":"2.35"}},{"$f":"IF(AND(AB$16*1>=$R89,AB$16*1<=$D$8,$R89<$D$8,$P89>SUM($V89:AA89)),IF(SUM($P89*$U89/12,$V89:AA89)>$P89,$P89-SUM($V89:AA89),$P89*$U89/12),0)","v":{"v":0,"d":"0.00"}},{"$f":"IF(AND(AC$16*1>=$R89,AC$16*1<=$D$8,$R89<$D$8,$P89>SUM($V89:AB89)),IF(SUM($P89*$U89/12,$V89:AB89)>$P89,$P89-SUM($V89:AB89),$P89*$U89/12),0)","v":{"v":0,"d":"0.00"}},{"$f":"IF(AND(AD$16*1>=$R89,AD$16*1<=$D$8,$R89<$D$8,$P89>SUM($V89:AC89)),IF(SUM($P89*$U89/12,$V89:AC89)>$P89,$P89-SUM($V89:AC89),$P89*$U89/12),0)","v":{"v":0,"d":"0.00"}},{"$f":"IF(AND(AE$16*1>=$R89,AE$16*1<=$D$8,$R89<$D$8,$P89>SUM($V89:AD89)),IF(SUM($P89*$U89/12,$V89:AD89)>$P89,$P89-SUM($V89:AD89),$P89*$U89/12),0)","v":{"v":0,"d":"0.00"}},{"$f":"IF(AND(AF$16*1>=$R89,AF$16*1<=$D$8,$R89<$D$8,$P89>SUM($V89:AE89)),IF(SUM($P89*$U89/12,$V89:AE89)>$P89,$P89-SUM($V89:AE89),$P89*$U89/12),0)","v":{"v":0,"d":"0.00"}},{"$f":"IF(AND(AG$16*1>=$R89,AG$16*1<=$D$8,$R89<$D$8,$P89>SUM($V89:AF89)),IF(SUM($P89*$U89/12,$V89:AF89)>$P89,$P89-SUM($V89:AF89),$P89*$U89/12),0)","v":{"v":0,"d":"0.00"}},{"$f":"IF(AND(AH$16*1>=$R89,AH$16*1<=$D$8,$R89<$D$8,$P89>SUM($V89:AG89)),IF(SUM($P89*$U89/12,$V89:AG89)>$P89,$P89-SUM($V89:AG89),$P89*$U89/12),0)","v":{"v":0,"d":"0.00"}},{"v":11.726666666666667,"d":"11.73"},null,null,{"v":11.726,"d":"11.73"},null,{"v":11.726,"d":"11.73"}]
[null,null,74,"335111","BANCO PLATON GRIS",{"$nulls":3},281.44,{"$nulls":4},281.44,null,281.44,"2018-10-10","2018-11-01",null,null,{"v":0.1,"d":"10%"},4.69,{"$f":"IF(AND(W$16*1>=$R90,W$16*1<=$D$8,$R90<$D$8,$P90>SUM($V90:V90)),IF(SUM($P90*$U90/12,$V90:V90)>$P90,$P90-SUM($V90:V90),$P90*$U90/12),0)","v":{"v":2.3453333333333335,"d":"2.35"}},{"$f":"IF(AND(X$16*1>=$R90,X$16*1<=$D$8,$R90<$D$8,$P90>SUM($V90:W90)),IF(SUM($P90*$U90/12,$V90:W90)>$P90,$P90-SUM($V90:W90),$P90*$U90/12),0)","v":{"v":2.3453333333333335,"d":"2.35"}},{"$f":"IF(AND(Y$16*1>=$R90,Y$16*1<=$D$8,$R90<$D$8,$P90>SUM($V90:X90)),IF(SUM($P90*$U90/12,$V90:X90)>$P90,$P90-SUM($V90:X90),$P90*$U90/12),0)","v":{"v":2.3453333333333335,"d":"2.35"}},{"$f":"IF(AND(Z$16*1>=$R90,Z$16*1<=$D$8,$R90<$D$8,$P90>SUM($V90:Y90)),IF(SUM($P90*$U90/12,$V90:Y90)>$P90,$P90-SUM($V90:Y90),$P90*$U90/12),0)","v":{"v":2.3453333333333335,"d":"2.35"}},{"$f":"IF(AND(AA$16*1>=$R90,AA$16*1<=$D$8,$R90<$D$8,$P90>SUM($V90:Z90)),IF(SUM($P90*$U90/12,$V90:Z90)>$P90,$P90-SUM($V90:Z90),$P90*$U90/12),0)","v":{"v":2.3453333333333335,"d":"2.35"}},{"$f":"IF(AND(AB$16*1>=$R90,AB$16*1<=$D$8,$R90<$D$8,$P90>SUM($V90:AA90)),IF(SUM($P90*$U90/12,$V90:AA90)>$P90,$P90-SUM($V90:AA90),$P90*$U90/12),0)","v":{"v":0,"d":"0.00"}},{"$f":"IF(AND(AC$16*1>=$R90,AC$16*1<=$D$8,$R90<$D$8,$P90>SUM($V90:AB90)),IF(SUM($P90*$U90/12,$V90:AB90)>$P90,$P90-SUM($V90:AB90),$P90*$U90/12),0)","v":{"v":0,"d":"0.00"}},{"$f":"IF(AND(AD$16*1>=$R90,AD$16*1<=$D$8,$R90<$D$8,$P90>SUM($V90:AC90)),IF(SUM($P90*$U90/12,$V90:AC90)>$P90,$P90-SUM($V90:AC90),$P90*$U90/12),0)","v":{"v":0,"d":"0.00"}},{"$f":"IF(AND(AE$16*1>=$R90,AE$16*1<=$D$8,$R90<$D$8,$P90>SUM($V90:AD90)),IF(SUM($P90*$U90/12,$V90:AD90)>$P90,$P90-SUM($V90:AD90),$P90*$U90/12),0)","v":{"v":0,"d":"0.00"}},{"$f":"IF(AND(AF$16*1>=$R90,AF$16*1<=$D$8,$R90<$D$8,$P90>SUM($V90:AE90)),IF(SUM($P90*$U90/12,$V90:AE90)>$P90,$P90-SUM($V90:AE90),$P90*$U90/12),0)","v":{"v":0,"d":"0.00"}},{"$f":"IF(AND(AG$16*1>=$R90,AG$16*1<=$D$8,$R90<$D$8,$P90>SUM($V90:AF90)),IF(SUM($P90*$U90/12,$V90:AF90)>$P90,$P90-SUM($V90:AF90),$P90*$U90/12),0)","v":{"v":0,"d":"0.00"}},{"$f":"IF(AND(AH$16*1>=$R90,AH$16*1<=$D$8,$R90<$D$8,$P90>SUM($V90:AG90)),IF(SUM($P90*$U90/12,$V90:AG90)>$P90,$P90-SUM($V90:AG90),$P90*$U90/12),0)","v":{"v":0,"d":"0.00"}},{"v":11.726666666666667,"d":"11.73"},null,null,{"v":11.726,"d":"11.73"},null,{"v":11.726,"d":"11.73"}]
[null,null,75,"335211","LAMPARA DE PIE HALOGENA NEGRA",{"$nulls":3},76.87,{"$nulls":4},76.87,null,76.87,"2000-06-26","2000-07-01",null,null,{"v":0.1,"d":"10%"},76.87,{"$f":"IF(AND(W$16*1>=$R91,W$16*1<=$D$8,$R91<$D$8,$P91>SUM($V91:V91)),IF(SUM($P91*$U91/12,$V91:V91)>$P91,$P91-SUM($V91:V91),$P91*$U91/12),0)","v":{"v":0,"d":"0.00"}},{"$f":"IF(AND(X$16*1>=$R91,X$16*1<=$D$8,$R91<$D$8,$P91>SUM($V91:W91)),IF(SUM($P91*$U91/12,$V91:W91)>$P91,$P91-SUM($V91:W91),$P91*$U91/12),0)","v":{"v":0,"d":"0.00"}},{"$f":"IF(AND(Y$16*1>=$R91,Y$16*1<=$D$8,$R91<$D$8,$P91>SUM($V91:X91)),IF(SUM($P91*$U91/12,$V91:X91)>$P91,$P91-SUM($V91:X91),$P91*$U91/12),0)","v":{"v":0,"d":"0.00"}},{"$f":"IF(AND(Z$16*1>=$R91,Z$16*1<=$D$8,$R91<$D$8,$P91>SUM($V91:Y91)),IF(SUM($P91*$U91/12,$V91:Y91)>$P91,$P91-SUM($V91:Y91),$P91*$U91/12),0)","v":{"v":0,"d":"0.00"}},{"$f":"IF(AND(AA$16*1>=$R91,AA$16*1<=$D$8,$R91<$D$8,$P91>SUM($V91:Z91)),IF(SUM($P91*$U91/12,$V91:Z91)>$P91,$P91-SUM($V91:Z91),$P91*$U91/12),0)","v":{"v":0,"d":"0.00"}},{"$f":"IF(AND(AB$16*1>=$R91,AB$16*1<=$D$8,$R91<$D$8,$P91>SUM($V91:AA91)),IF(SUM($P91*$U91/12,$V91:AA91)>$P91,$P91-SUM($V91:AA91),$P91*$U91/12),0)","v":{"v":0,"d":"0.00"}},{"$f":"IF(AND(AC$16*1>=$R91,AC$16*1<=$D$8,$R91<$D$8,$P91>SUM($V91:AB91)),IF(SUM($P91*$U91/12,$V91:AB91)>$P91,$P91-SUM($V91:AB91),$P91*$U91/12),0)","v":{"v":0,"d":"0.00"}},{"$f":"IF(AND(AD$16*1>=$R91,AD$16*1<=$D$8,$R91<$D$8,$P91>SUM($V91:AC91)),IF(SUM($P91*$U91/12,$V91:AC91)>$P91,$P91-SUM($V91:AC91),$P91*$U91/12),0)","v":{"v":0,"d":"0.00"}},{"$f":"IF(AND(AE$16*1>=$R91,AE$16*1<=$D$8,$R91<$D$8,$P91>SUM($V91:AD91)),IF(SUM($P91*$U91/12,$V91:AD91)>$P91,$P91-SUM($V91:AD91),$P91*$U91/12),0)","v":{"v":0,"d":"0.00"}},{"$f":"IF(AND(AF$16*1>=$R91,AF$16*1<=$D$8,$R91<$D$8,$P91>SUM($V91:AE91)),IF(SUM($P91*$U91/12,$V91:AE91)>$P91,$P91-SUM($V91:AE91),$P91*$U91/12),0)","v":{"v":0,"d":"0.00"}},{"$f":"IF(AND(AG$16*1>=$R91,AG$16*1<=$D$8,$R91<$D$8,$P91>SUM($V91:AF91)),IF(SUM($P91*$U91/12,$V91:AF91)>$P91,$P91-SUM($V91:AF91),$P91*$U91/12),0)","v":{"v":0,"d":"0.00"}},{"$f":"IF(AND(AH$16*1>=$R91,AH$16*1<=$D$8,$R91<$D$8,$P91>SUM($V91:AG91)),IF(SUM($P91*$U91/12,$V91:AG91)>$P91,$P91-SUM($V91:AG91),$P91*$U91/12),0)","v":{"v":0,"d":"0.00"}},{"v":0,"d":"0.00"},null,null,76.87,null,76.87]
[null,null,76,"335211","LAMPARA HALOGENA 500 W",{"$nulls":3},14.77,{"$nulls":4},14.77,null,14.77,"2000-09-03","2000-10-01",null,null,{"v":0.1,"d":"10%"},14.77,{"$f":"IF(AND(W$16*1>=$R92,W$16*1<=$D$8,$R92<$D$8,$P92>SUM($V92:V92)),IF(SUM($P92*$U92/12,$V92:V92)>$P92,$P92-SUM($V92:V92),$P92*$U92/12),0)","v":{"v":0,"d":"0.00"}},{"$f":"IF(AND(X$16*1>=$R92,X$16*1<=$D$8,$R92<$D$8,$P92>SUM($V92:W92)),IF(SUM($P92*$U92/12,$V92:W92)>$P92,$P92-SUM($V92:W92),$P92*$U92/12),0)","v":{"v":0,"d":"0.00"}},{"$f":"IF(AND(Y$16*1>=$R92,Y$16*1<=$D$8,$R92<$D$8,$P92>SUM($V92:X92)),IF(SUM($P92*$U92/12,$V92:X92)>$P92,$P92-SUM($V92:X92),$P92*$U92/12),0)","v":{"v":0,"d":"0.00"}},{"$f":"IF(AND(Z$16*1>=$R92,Z$16*1<=$D$8,$R92<$D$8,$P92>SUM($V92:Y92)),IF(SUM($P92*$U92/12,$V92:Y92)>$P92,$P92-SUM($V92:Y92),$P92*$U92/12),0)","v":{"v":0,"d":"0.00"}},{"$f":"IF(AND(AA$16*1>=$R92,AA$16*1<=$D$8,$R92<$D$8,$P92>SUM($V92:Z92)),IF(SUM($P92*$U92/12,$V92:Z92)>$P92,$P92-SUM($V92:Z92),$P92*$U92/12),0)","v":{"v":0,"d":"0.00"}},{"$f":"IF(AND(AB$16*1>=$R92,AB$16*1<=$D$8,$R92<$D$8,$P92>SUM($V92:AA92)),IF(SUM($P92*$U92/12,$V92:AA92)>$P92,$P92-SUM($V92:AA92),$P92*$U92/12),0)","v":{"v":0,"d":"0.00"}},{"$f":"IF(AND(AC$16*1>=$R92,AC$16*1<=$D$8,$R92<$D$8,$P92>SUM($V92:AB92)),IF(SUM($P92*$U92/12,$V92:AB92)>$P92,$P92-SUM($V92:AB92),$P92*$U92/12),0)","v":{"v":0,"d":"0.00"}},{"$f":"IF(AND(AD$16*1>=$R92,AD$16*1<=$D$8,$R92<$D$8,$P92>SUM($V92:AC92)),IF(SUM($P92*$U92/12,$V92:AC92)>$P92,$P92-SUM($V92:AC92),$P92*$U92/12),0)","v":{"v":0,"d":"0.00"}},{"$f":"IF(AND(AE$16*1>=$R92,AE$16*1<=$D$8,$R92<$D$8,$P92>SUM($V92:AD92)),IF(SUM($P92*$U92/12,$V92:AD92)>$P92,$P92-SUM($V92:AD92),$P92*$U92/12),0)","v":{"v":0,"d":"0.00"}},{"$f":"IF(AND(AF$16*1>=$R92,AF$16*1<=$D$8,$R92<$D$8,$P92>SUM($V92:AE92)),IF(SUM($P92*$U92/12,$V92:AE92)>$P92,$P92-SUM($V92:AE92),$P92*$U92/12),0)","v":{"v":0,"d":"0.00"}},{"$f":"IF(AND(AG$16*1>=$R92,AG$16*1<=$D$8,$R92<$D$8,$P92>SUM($V92:AF92)),IF(SUM($P92*$U92/12,$V92:AF92)>$P92,$P92-SUM($V92:AF92),$P92*$U92/12),0)","v":{"v":0,"d":"0.00"}},{"$f":"IF(AND(AH$16*1>=$R92,AH$16*1<=$D$8,$R92<$D$8,$P92>SUM($V92:AG92)),IF(SUM($P92*$U92/12,$V92:AG92)>$P92,$P92-SUM($V92:AG92),$P92*$U92/12),0)","v":{"v":0,"d":"0.00"}},{"v":0,"d":"0.00"},null,null,14.77,null,14.77]
[null,null,77,"335211","LAMPARA PL-C 11 W OSTAN",{"$nulls":3},55.36,{"$nulls":4},55.36,null,55.36,"2000-09-03","2000-10-01",null,null,{"v":0.1,"d":"10%"},55.36,{"$f":"IF(AND(W$16*1>=$R93,W$16*1<=$D$8,$R93<$D$8,$P93>SUM($V93:V93)),IF(SUM($P93*$U93/12,$V93:V93)>$P93,$P93-SUM($V93:V93),$P93*$U93/12),0)","v":{"v":0,"d":"0.00"}},{"$f":"IF(AND(X$16*1>=$R93,X$16*1<=$D$8,$R93<$D$8,$P93>SUM($V93:W93)),IF(SUM($P93*$U93/12,$V93:W93)>$P93,$P93-SUM($V93:W93),$P93*$U93/12),0)","v":{"v":0,"d":"0.00"}},{"$f":"IF(AND(Y$16*1>=$R93,Y$16*1<=$D$8,$R93<$D$8,$P93>SUM($V93:X93)),IF(SUM($P93*$U93/12,$V93:X93)>$P93,$P93-SUM($V93:X93),$P93*$U93/12),0)","v":{"v":0,"d":"0.00"}},{"$f":"IF(AND(Z$16*1>=$R93,Z$16*1<=$D$8,$R93<$D$8,$P93>SUM($V93:Y93)),IF(SUM($P93*$U93/12,$V93:Y93)>$P93,$P93-SUM($V93:Y93),$P93*$U93/12),0)","v":{"v":0,"d":"0.00"}},{"$f":"IF(AND(AA$16*1>=$R93,AA$16*1<=$D$8,$R93<$D$8,$P93>SUM($V93:Z93)),IF(SUM($P93*$U93/12,$V93:Z93)>$P93,$P93-SUM($V93:Z93),$P93*$U93/12),0)","v":{"v":0,"d":"0.00"}},{"$f":"IF(AND(AB$16*1>=$R93,AB$16*1<=$D$8,$R93<$D$8,$P93>SUM($V93:AA93)),IF(SUM($P93*$U93/12,$V93:AA93)>$P93,$P93-SUM($V93:AA93),$P93*$U93/12),0)","v":{"v":0,"d":"0.00"}},{"$f":"IF(AND(AC$16*1>=$R93,AC$16*1<=$D$8,$R93<$D$8,$P93>SUM($V93:AB93)),IF(SUM($P93*$U93/12,$V93:AB93)>$P93,$P93-SUM($V93:AB93),$P93*$U93/12),0)","v":{"v":0,"d":"0.00"}},{"$f":"IF(AND(AD$16*1>=$R93,AD$16*1<=$D$8,$R93<$D$8,$P93>SUM($V93:AC93)),IF(SUM($P93*$U93/12,$V93:AC93)>$P93,$P93-SUM($V93:AC93),$P93*$U93/12),0)","v":{"v":0,"d":"0.00"}},{"$f":"IF(AND(AE$16*1>=$R93,AE$16*1<=$D$8,$R93<$D$8,$P93>SUM($V93:AD93)),IF(SUM($P93*$U93/12,$V93:AD93)>$P93,$P93-SUM($V93:AD93),$P93*$U93/12),0)","v":{"v":0,"d":"0.00"}},{"$f":"IF(AND(AF$16*1>=$R93,AF$16*1<=$D$8,$R93<$D$8,$P93>SUM($V93:AE93)),IF(SUM($P93*$U93/12,$V93:AE93)>$P93,$P93-SUM($V93:AE93),$P93*$U93/12),0)","v":{"v":0,"d":"0.00"}},{"$f":"IF(AND(AG$16*1>=$R93,AG$16*1<=$D$8,$R93<$D$8,$P93>SUM($V93:AF93)),IF(SUM($P93*$U93/12,$V93:AF93)>$P93,$P93-SUM($V93:AF93),$P93*$U93/12),0)","v":{"v":0,"d":"0.00"}},{"$f":"IF(AND(AH$16*1>=$R93,AH$16*1<=$D$8,$R93<$D$8,$P93>SUM($V93:AG93)),IF(SUM($P93*$U93/12,$V93:AG93)>$P93,$P93-SUM($V93:AG93),$P93*$U93/12),0)","v":{"v":0,"d":"0.00"}},{"v":0,"d":"0.00"},null,null,55.36,null,55.36]
[null,null,78,"335211","FOLDER COLGANTE ESCRIB",{"$nulls":3},57.67,{"$nulls":4},57.67,null,57.67,"2000-09-30","2000-10-01",null,null,{"v":0.1,"d":"10%"},57.67,{"$f":"IF(AND(W$16*1>=$R94,W$16*1<=$D$8,$R94<$D$8,$P94>SUM($V94:V94)),IF(SUM($P94*$U94/12,$V94:V94)>$P94,$P94-SUM($V94:V94),$P94*$U94/12),0)","v":{"v":0,"d":"0.00"}},{"$f":"IF(AND(X$16*1>=$R94,X$16*1<=$D$8,$R94<$D$8,$P94>SUM($V94:W94)),IF(SUM($P94*$U94/12,$V94:W94)>$P94,$P94-SUM($V94:W94),$P94*$U94/12),0)","v":{"v":0,"d":"0.00"}},{"$f":"IF(AND(Y$16*1>=$R94,Y$16*1<=$D$8,$R94<$D$8,$P94>SUM($V94:X94)),IF(SUM($P94*$U94/12,$V94:X94)>$P94,$P94-SUM($V94:X94),$P94*$U94/12),0)","v":{"v":0,"d":"0.00"}},{"$f":"IF(AND(Z$16*1>=$R94,Z$16*1<=$D$8,$R94<$D$8,$P94>SUM($V94:Y94)),IF(SUM($P94*$U94/12,$V94:Y94)>$P94,$P94-SUM($V94:Y94),$P94*$U94/12),0)","v":{"v":0,"d":"0.00"}},{"$f":"IF(AND(AA$16*1>=$R94,AA$16*1<=$D$8,$R94<$D$8,$P94>SUM($V94:Z94)),IF(SUM($P94*$U94/12,$V94:Z94)>$P94,$P94-SUM($V94:Z94),$P94*$U94/12),0)","v":{"v":0,"d":"0.00"}},{"$f":"IF(AND(AB$16*1>=$R94,AB$16*1<=$D$8,$R94<$D$8,$P94>SUM($V94:AA94)),IF(SUM($P94*$U94/12,$V94:AA94)>$P94,$P94-SUM($V94:AA94),$P94*$U94/12),0)","v":{"v":0,"d":"0.00"}},{"$f":"IF(AND(AC$16*1>=$R94,AC$16*1<=$D$8,$R94<$D$8,$P94>SUM($V94:AB94)),IF(SUM($P94*$U94/12,$V94:AB94)>$P94,$P94-SUM($V94:AB94),$P94*$U94/12),0)","v":{"v":0,"d":"0.00"}},{"$f":"IF(AND(AD$16*1>=$R94,AD$16*1<=$D$8,$R94<$D$8,$P94>SUM($V94:AC94)),IF(SUM($P94*$U94/12,$V94:AC94)>$P94,$P94-SUM($V94:AC94),$P94*$U94/12),0)","v":{"v":0,"d":"0.00"}},{"$f":"IF(AND(AE$16*1>=$R94,AE$16*1<=$D$8,$R94<$D$8,$P94>SUM($V94:AD94)),IF(SUM($P94*$U94/12,$V94:AD94)>$P94,$P94-SUM($V94:AD94),$P94*$U94/12),0)","v":{"v":0,"d":"0.00"}},{"$f":"IF(AND(AF$16*1>=$R94,AF$16*1<=$D$8,$R94<$D$8,$P94>SUM($V94:AE94)),IF(SUM($P94*$U94/12,$V94:AE94)>$P94,$P94-SUM($V94:AE94),$P94*$U94/12),0)","v":{"v":0,"d":"0.00"}},{"$f":"IF(AND(AG$16*1>=$R94,AG$16*1<=$D$8,$R94<$D$8,$P94>SUM($V94:AF94)),IF(SUM($P94*$U94/12,$V94:AF94)>$P94,$P94-SUM($V94:AF94),$P94*$U94/12),0)","v":{"v":0,"d":"0.00"}},{"$f":"IF(AND(AH$16*1>=$R94,AH$16*1<=$D$8,$R94<$D$8,$P94>SUM($V94:AG94)),IF(SUM($P94*$U94/12,$V94:AG94)>$P94,$P94-SUM($V94:AG94),$P94*$U94/12),0)","v":{"v":0,"d":"0.00"}},{"v":0,"d":"0.00"},null,null,57.67,null,57.67]
[null,null,79,"335211","TELEFONO DE MESA GENERAL ELECTRIC",{"$nulls":3},120.39,{"$nulls":4},120.39,null,120.39,"2000-12-18","2001-01-01",null,null,{"v":0.1,"d":"10%"},120.39,{"$f":"IF(AND(W$16*1>=$R95,W$16*1<=$D$8,$R95<$D$8,$P95>SUM($V95:V95)),IF(SUM($P95*$U95/12,$V95:V95)>$P95,$P95-SUM($V95:V95),$P95*$U95/12),0)","v":{"v":0,"d":"0.00"}},{"$f":"IF(AND(X$16*1>=$R95,X$16*1<=$D$8,$R95<$D$8,$P95>SUM($V95:W95)),IF(SUM($P95*$U95/12,$V95:W95)>$P95,$P95-SUM($V95:W95),$P95*$U95/12),0)","v":{"v":0,"d":"0.00"}},{"$f":"IF(AND(Y$16*1>=$R95,Y$16*1<=$D$8,$R95<$D$8,$P95>SUM($V95:X95)),IF(SUM($P95*$U95/12,$V95:X95)>$P95,$P95-SUM($V95:X95),$P95*$U95/12),0)","v":{"v":0,"d":"0.00"}},{"$f":"IF(AND(Z$16*1>=$R95,Z$16*1<=$D$8,$R95<$D$8,$P95>SUM($V95:Y95)),IF(SUM($P95*$U95/12,$V95:Y95)>$P95,$P95-SUM($V95:Y95),$P95*$U95/12),0)","v":{"v":0,"d":"0.00"}},{"$f":"IF(AND(AA$16*1>=$R95,AA$16*1<=$D$8,$R95<$D$8,$P95>SUM($V95:Z95)),IF(SUM($P95*$U95/12,$V95:Z95)>$P95,$P95-SUM($V95:Z95),$P95*$U95/12),0)","v":{"v":0,"d":"0.00"}},{"$f":"IF(AND(AB$16*1>=$R95,AB$16*1<=$D$8,$R95<$D$8,$P95>SUM($V95:AA95)),IF(SUM($P95*$U95/12,$V95:AA95)>$P95,$P95-SUM($V95:AA95),$P95*$U95/12),0)","v":{"v":0,"d":"0.00"}},{"$f":"IF(AND(AC$16*1>=$R95,AC$16*1<=$D$8,$R95<$D$8,$P95>SUM($V95:AB95)),IF(SUM($P95*$U95/12,$V95:AB95)>$P95,$P95-SUM($V95:AB95),$P95*$U95/12),0)","v":{"v":0,"d":"0.00"}},{"$f":"IF(AND(AD$16*1>=$R95,AD$16*1<=$D$8,$R95<$D$8,$P95>SUM($V95:AC95)),IF(SUM($P95*$U95/12,$V95:AC95)>$P95,$P95-SUM($V95:AC95),$P95*$U95/12),0)","v":{"v":0,"d":"0.00"}},{"$f":"IF(AND(AE$16*1>=$R95,AE$16*1<=$D$8,$R95<$D$8,$P95>SUM($V95:AD95)),IF(SUM($P95*$U95/12,$V95:AD95)>$P95,$P95-SUM($V95:AD95),$P95*$U95/12),0)","v":{"v":0,"d":"0.00"}},{"$f":"IF(AND(AF$16*1>=$R95,AF$16*1<=$D$8,$R95<$D$8,$P95>SUM($V95:AE95)),IF(SUM($P95*$U95/12,$V95:AE95)>$P95,$P95-SUM($V95:AE95),$P95*$U95/12),0)","v":{"v":0,"d":"0.00"}},{"$f":"IF(AND(AG$16*1>=$R95,AG$16*1<=$D$8,$R95<$D$8,$P95>SUM($V95:AF95)),IF(SUM($P95*$U95/12,$V95:AF95)>$P95,$P95-SUM($V95:AF95),$P95*$U95/12),0)","v":{"v":0,"d":"0.00"}},{"$f":"IF(AND(AH$16*1>=$R95,AH$16*1<=$D$8,$R95<$D$8,$P95>SUM($V95:AG95)),IF(SUM($P95*$U95/12,$V95:AG95)>$P95,$P95-SUM($V95:AG95),$P95*$U95/12),0)","v":{"v":0,"d":"0.00"}},{"v":0,"d":"0.00"},null,null,120.39,null,120.39]
[null,null,80,"335211","RELOJ DE MESA CASIO",{"$nulls":3},31.39,{"$nulls":4},31.39,null,31.39,"2000-12-17","2001-01-01",null,null,{"v":0.1,"d":"10%"},31.39,{"$f":"IF(AND(W$16*1>=$R96,W$16*1<=$D$8,$R96<$D$8,$P96>SUM($V96:V96)),IF(SUM($P96*$U96/12,$V96:V96)>$P96,$P96-SUM($V96:V96),$P96*$U96/12),0)","v":{"v":0,"d":"0.00"}},{"$f":"IF(AND(X$16*1>=$R96,X$16*1<=$D$8,$R96<$D$8,$P96>SUM($V96:W96)),IF(SUM($P96*$U96/12,$V96:W96)>$P96,$P96-SUM($V96:W96),$P96*$U96/12),0)","v":{"v":0,"d":"0.00"}},{"$f":"IF(AND(Y$16*1>=$R96,Y$16*1<=$D$8,$R96<$D$8,$P96>SUM($V96:X96)),IF(SUM($P96*$U96/12,$V96:X96)>$P96,$P96-SUM($V96:X96),$P96*$U96/12),0)","v":{"v":0,"d":"0.00"}},{"$f":"IF(AND(Z$16*1>=$R96,Z$16*1<=$D$8,$R96<$D$8,$P96>SUM($V96:Y96)),IF(SUM($P96*$U96/12,$V96:Y96)>$P96,$P96-SUM($V96:Y96),$P96*$U96/12),0)","v":{"v":0,"d":"0.00"}},{"$f":"IF(AND(AA$16*1>=$R96,AA$16*1<=$D$8,$R96<$D$8,$P96>SUM($V96:Z96)),IF(SUM($P96*$U96/12,$V96:Z96)>$P96,$P96-SUM($V96:Z96),$P96*$U96/12),0)","v":{"v":0,"d":"0.00"}},{"$f":"IF(AND(AB$16*1>=$R96,AB$16*1<=$D$8,$R96<$D$8,$P96>SUM($V96:AA96)),IF(SUM($P96*$U96/12,$V96:AA96)>$P96,$P96-SUM($V96:AA96),$P96*$U96/12),0)","v":{"v":0,"d":"0.00"}},{"$f":"IF(AND(AC$16*1>=$R96,AC$16*1<=$D$8,$R96<$D$8,$P96>SUM($V96:AB96)),IF(SUM($P96*$U96/12,$V96:AB96)>$P96,$P96-SUM($V96:AB96),$P96*$U96/12),0)","v":{"v":0,"d":"0.00"}},{"$f":"IF(AND(AD$16*1>=$R96,AD$16*1<=$D$8,$R96<$D$8,$P96>SUM($V96:AC96)),IF(SUM($P96*$U96/12,$V96:AC96)>$P96,$P96-SUM($V96:AC96),$P96*$U96/12),0)","v":{"v":0,"d":"0.00"}},{"$f":"IF(AND(AE$16*1>=$R96,AE$16*1<=$D$8,$R96<$D$8,$P96>SUM($V96:AD96)),IF(SUM($P96*$U96/12,$V96:AD96)>$P96,$P96-SUM($V96:AD96),$P96*$U96/12),0)","v":{"v":0,"d":"0.00"}},{"$f":"IF(AND(AF$16*1>=$R96,AF$16*1<=$D$8,$R96<$D$8,$P96>SUM($V96:AE96)),IF(SUM($P96*$U96/12,$V96:AE96)>$P96,$P96-SUM($V96:AE96),$P96*$U96/12),0)","v":{"v":0,"d":"0.00"}},{"$f":"IF(AND(AG$16*1>=$R96,AG$16*1<=$D$8,$R96<$D$8,$P96>SUM($V96:AF96)),IF(SUM($P96*$U96/12,$V96:AF96)>$P96,$P96-SUM($V96:AF96),$P96*$U96/12),0)","v":{"v":0,"d":"0.00"}},{"$f":"IF(AND(AH$16*1>=$R96,AH$16*1<=$D$8,$R96<$D$8,$P96>SUM($V96:AG96)),IF(SUM($P96*$U96/12,$V96:AG96)>$P96,$P96-SUM($V96:AG96),$P96*$U96/12),0)","v":{"v":0,"d":"0.00"}},{"v":0,"d":"0.00"},null,null,31.39,null,31.39]
[null,null,81,"335211","CUADRO ENMARCADO EN ACRILICO",{"$nulls":3},945.18,{"$nulls":4},945.18,null,945.18,"2004-09-22","2004-10-01",null,null,{"v":0.1,"d":"10%"},945.18,{"$f":"IF(AND(W$16*1>=$R97,W$16*1<=$D$8,$R97<$D$8,$P97>SUM($V97:V97)),IF(SUM($P97*$U97/12,$V97:V97)>$P97,$P97-SUM($V97:V97),$P97*$U97/12),0)","v":{"v":0,"d":"0.00"}},{"$f":"IF(AND(X$16*1>=$R97,X$16*1<=$D$8,$R97<$D$8,$P97>SUM($V97:W97)),IF(SUM($P97*$U97/12,$V97:W97)>$P97,$P97-SUM($V97:W97),$P97*$U97/12),0)","v":{"v":0,"d":"0.00"}},{"$f":"IF(AND(Y$16*1>=$R97,Y$16*1<=$D$8,$R97<$D$8,$P97>SUM($V97:X97)),IF(SUM($P97*$U97/12,$V97:X97)>$P97,$P97-SUM($V97:X97),$P97*$U97/12),0)","v":{"v":0,"d":"0.00"}},{"$f":"IF(AND(Z$16*1>=$R97,Z$16*1<=$D$8,$R97<$D$8,$P97>SUM($V97:Y97)),IF(SUM($P97*$U97/12,$V97:Y97)>$P97,$P97-SUM($V97:Y97),$P97*$U97/12),0)","v":{"v":0,"d":"0.00"}},{"$f":"IF(AND(AA$16*1>=$R97,AA$16*1<=$D$8,$R97<$D$8,$P97>SUM($V97:Z97)),IF(SUM($P97*$U97/12,$V97:Z97)>$P97,$P97-SUM($V97:Z97),$P97*$U97/12),0)","v":{"v":0,"d":"0.00"}},{"$f":"IF(AND(AB$16*1>=$R97,AB$16*1<=$D$8,$R97<$D$8,$P97>SUM($V97:AA97)),IF(SUM($P97*$U97/12,$V97:AA97)>$P97,$P97-SUM($V97:AA97),$P97*$U97/12),0)","v":{"v":0,"d":"0.00"}},{"$f":"IF(AND(AC$16*1>=$R97,AC$16*1<=$D$8,$R97<$D$8,$P97>SUM($V97:AB97)),IF(SUM($P97*$U97/12,$V97:AB97)>$P97,$P97-SUM($V97:AB97),$P97*$U97/12),0)","v":{"v":0,"d":"0.00"}},{"$f":"IF(AND(AD$16*1>=$R97,AD$16*1<=$D$8,$R97<$D$8,$P97>SUM($V97:AC97)),IF(SUM($P97*$U97/12,$V97:AC97)>$P97,$P97-SUM($V97:AC97),$P97*$U97/12),0)","v":{"v":0,"d":"0.00"}},{"$f":"IF(AND(AE$16*1>=$R97,AE$16*1<=$D$8,$R97<$D$8,$P97>SUM($V97:AD97)),IF(SUM($P97*$U97/12,$V97:AD97)>$P97,$P97-SUM($V97:AD97),$P97*$U97/12),0)","v":{"v":0,"d":"0.00"}},{"$f":"IF(AND(AF$16*1>=$R97,AF$16*1<=$D$8,$R97<$D$8,$P97>SUM($V97:AE97)),IF(SUM($P97*$U97/12,$V97:AE97)>$P97,$P97-SUM($V97:AE97),$P97*$U97/12),0)","v":{"v":0,"d":"0.00"}},{"$f":"IF(AND(AG$16*1>=$R97,AG$16*1<=$D$8,$R97<$D$8,$P97>SUM($V97:AF97)),IF(SUM($P97*$U97/12,$V97:AF97)>$P97,$P97-SUM($V97:AF97),$P97*$U97/12),0)","v":{"v":0,"d":"0.00"}},{"$f":"IF(AND(AH$16*1>=$R97,AH$16*1<=$D$8,$R97<$D$8,$P97>SUM($V97:AG97)),IF(SUM($P97*$U97/12,$V97:AG97)>$P97,$P97-SUM($V97:AG97),$P97*$U97/12),0)","v":{"v":0,"d":"0.00"}},{"v":0,"d":"0.00"},null,null,945.18,null,945.18]
[null,null,82,"335211","PINTURA OLEO ABSTRACTO",{"$nulls":3},1138.44,{"$nulls":4},1138.44,null,{"v":1138.44,"d":"1,138.44"},"2005-03-23","2005-04-01",null,null,{"v":0.1,"d":"10%"},{"v":1138.44,"d":"1,138.44"},{"$f":"IF(AND(W$16*1>=$R98,W$16*1<=$D$8,$R98<$D$8,$P98>SUM($V98:V98)),IF(SUM($P98*$U98/12,$V98:V98)>$P98,$P98-SUM($V98:V98),$P98*$U98/12),0)","v":{"v":0,"d":"0.00"}},{"$f":"IF(AND(X$16*1>=$R98,X$16*1<=$D$8,$R98<$D$8,$P98>SUM($V98:W98)),IF(SUM($P98*$U98/12,$V98:W98)>$P98,$P98-SUM($V98:W98),$P98*$U98/12),0)","v":{"v":0,"d":"0.00"}},{"$f":"IF(AND(Y$16*1>=$R98,Y$16*1<=$D$8,$R98<$D$8,$P98>SUM($V98:X98)),IF(SUM($P98*$U98/12,$V98:X98)>$P98,$P98-SUM($V98:X98),$P98*$U98/12),0)","v":{"v":0,"d":"0.00"}},{"$f":"IF(AND(Z$16*1>=$R98,Z$16*1<=$D$8,$R98<$D$8,$P98>SUM($V98:Y98)),IF(SUM($P98*$U98/12,$V98:Y98)>$P98,$P98-SUM($V98:Y98),$P98*$U98/12),0)","v":{"v":0,"d":"0.00"}},{"$f":"IF(AND(AA$16*1>=$R98,AA$16*1<=$D$8,$R98<$D$8,$P98>SUM($V98:Z98)),IF(SUM($P98*$U98/12,$V98:Z98)>$P98,$P98-SUM($V98:Z98),$P98*$U98/12),0)","v":{"v":0,"d":"0.00"}},{"$f":"IF(AND(AB$16*1>=$R98,AB$16*1<=$D$8,$R98<$D$8,$P98>SUM($V98:AA98)),IF(SUM($P98*$U98/12,$V98:AA98)>$P98,$P98-SUM($V98:AA98),$P98*$U98/12),0)","v":{"v":0,"d":"0.00"}},{"$f":"IF(AND(AC$16*1>=$R98,AC$16*1<=$D$8,$R98<$D$8,$P98>SUM($V98:AB98)),IF(SUM($P98*$U98/12,$V98:AB98)>$P98,$P98-SUM($V98:AB98),$P98*$U98/12),0)","v":{"v":0,"d":"0.00"}},{"$f":"IF(AND(AD$16*1>=$R98,AD$16*1<=$D$8,$R98<$D$8,$P98>SUM($V98:AC98)),IF(SUM($P98*$U98/12,$V98:AC98)>$P98,$P98-SUM($V98:AC98),$P98*$U98/12),0)","v":{"v":0,"d":"0.00"}},{"$f":"IF(AND(AE$16*1>=$R98,AE$16*1<=$D$8,$R98<$D$8,$P98>SUM($V98:AD98)),IF(SUM($P98*$U98/12,$V98:AD98)>$P98,$P98-SUM($V98:AD98),$P98*$U98/12),0)","v":{"v":0,"d":"0.00"}},{"$f":"IF(AND(AF$16*1>=$R98,AF$16*1<=$D$8,$R98<$D$8,$P98>SUM($V98:AE98)),IF(SUM($P98*$U98/12,$V98:AE98)>$P98,$P98-SUM($V98:AE98),$P98*$U98/12),0)","v":{"v":0,"d":"0.00"}},{"$f":"IF(AND(AG$16*1>=$R98,AG$16*1<=$D$8,$R98<$D$8,$P98>SUM($V98:AF98)),IF(SUM($P98*$U98/12,$V98:AF98)>$P98,$P98-SUM($V98:AF98),$P98*$U98/12),0)","v":{"v":0,"d":"0.00"}},{"$f":"IF(AND(AH$16*1>=$R98,AH$16*1<=$D$8,$R98<$D$8,$P98>SUM($V98:AG98)),IF(SUM($P98*$U98/12,$V98:AG98)>$P98,$P98-SUM($V98:AG98),$P98*$U98/12),0)","v":{"v":0,"d":"0.00"}},{"v":0,"d":"0.00"},null,null,{"v":1138.44,"d":"1,138.44"},null,{"v":1138.44,"d":"1,138.44"}]
[null,null,83,"335211","TAPIZON ACANALADO DIRECTORIO",{"$nulls":3},1600.28,{"$nulls":4},1600.28,null,{"v":1600.28,"d":"1,600.28"},"2005-06-30","2005-07-01",null,null,{"v":0.1,"d":"10%"},{"v":1600.28,"d":"1,600.28"},{"$f":"IF(AND(W$16*1>=$R99,W$16*1<=$D$8,$R99<$D$8,$P99>SUM($V99:V99)),IF(SUM($P99*$U99/12,$V99:V99)>$P99,$P99-SUM($V99:V99),$P99*$U99/12),0)","v":{"v":0,"d":"0.00"}},{"$f":"IF(AND(X$16*1>=$R99,X$16*1<=$D$8,$R99<$D$8,$P99>SUM($V99:W99)),IF(SUM($P99*$U99/12,$V99:W99)>$P99,$P99-SUM($V99:W99),$P99*$U99/12),0)","v":{"v":0,"d":"0.00"}},{"$f":"IF(AND(Y$16*1>=$R99,Y$16*1<=$D$8,$R99<$D$8,$P99>SUM($V99:X99)),IF(SUM($P99*$U99/12,$V99:X99)>$P99,$P99-SUM($V99:X99),$P99*$U99/12),0)","v":{"v":0,"d":"0.00"}},{"$f":"IF(AND(Z$16*1>=$R99,Z$16*1<=$D$8,$R99<$D$8,$P99>SUM($V99:Y99)),IF(SUM($P99*$U99/12,$V99:Y99)>$P99,$P99-SUM($V99:Y99),$P99*$U99/12),0)","v":{"v":0,"d":"0.00"}},{"$f":"IF(AND(AA$16*1>=$R99,AA$16*1<=$D$8,$R99<$D$8,$P99>SUM($V99:Z99)),IF(SUM($P99*$U99/12,$V99:Z99)>$P99,$P99-SUM($V99:Z99),$P99*$U99/12),0)","v":{"v":0,"d":"0.00"}},{"$f":"IF(AND(AB$16*1>=$R99,AB$16*1<=$D$8,$R99<$D$8,$P99>SUM($V99:AA99)),IF(SUM($P99*$U99/12,$V99:AA99)>$P99,$P99-SUM($V99:AA99),$P99*$U99/12),0)","v":{"v":0,"d":"0.00"}},{"$f":"IF(AND(AC$16*1>=$R99,AC$16*1<=$D$8,$R99<$D$8,$P99>SUM($V99:AB99)),IF(SUM($P99*$U99/12,$V99:AB99)>$P99,$P99-SUM($V99:AB99),$P99*$U99/12),0)","v":{"v":0,"d":"0.00"}},{"$f":"IF(AND(AD$16*1>=$R99,AD$16*1<=$D$8,$R99<$D$8,$P99>SUM($V99:AC99)),IF(SUM($P99*$U99/12,$V99:AC99)>$P99,$P99-SUM($V99:AC99),$P99*$U99/12),0)","v":{"v":0,"d":"0.00"}},{"$f":"IF(AND(AE$16*1>=$R99,AE$16*1<=$D$8,$R99<$D$8,$P99>SUM($V99:AD99)),IF(SUM($P99*$U99/12,$V99:AD99)>$P99,$P99-SUM($V99:AD99),$P99*$U99/12),0)","v":{"v":0,"d":"0.00"}},{"$f":"IF(AND(AF$16*1>=$R99,AF$16*1<=$D$8,$R99<$D$8,$P99>SUM($V99:AE99)),IF(SUM($P99*$U99/12,$V99:AE99)>$P99,$P99-SUM($V99:AE99),$P99*$U99/12),0)","v":{"v":0,"d":"0.00"}},{"$f":"IF(AND(AG$16*1>=$R99,AG$16*1<=$D$8,$R99<$D$8,$P99>SUM($V99:AF99)),IF(SUM($P99*$U99/12,$V99:AF99)>$P99,$P99-SUM($V99:AF99),$P99*$U99/12),0)","v":{"v":0,"d":"0.00"}},{"$f":"IF(AND(AH$16*1>=$R99,AH$16*1<=$D$8,$R99<$D$8,$P99>SUM($V99:AG99)),IF(SUM($P99*$U99/12,$V99:AG99)>$P99,$P99-SUM($V99:AG99),$P99*$U99/12),0)","v":{"v":0,"d":"0.00"}},{"v":0,"d":"0.00"},null,null,{"v":1600.28,"d":"1,600.28"},null,{"v":1600.28,"d":"1,600.28"}]
[null,null,84,"335211","2 CUADROS AL OLEO CON MARCO",{"$nulls":3},2565.46,{"$nulls":4},2565.46,null,{"v":2565.46,"d":"2,565.46"},"2006-08-26","2006-09-01",null,null,{"v":0.1,"d":"10%"},{"v":2565.46,"d":"2,565.46"},{"$f":"IF(AND(W$16*1>=$R100,W$16*1<=$D$8,$R100<$D$8,$P100>SUM($V100:V100)),IF(SUM($P100*$U100/12,$V100:V100)>$P100,$P100-SUM($V100:V100),$P100*$U100/12),0)","v":{"v":0,"d":"0.00"}},{"$f":"IF(AND(X$16*1>=$R100,X$16*1<=$D$8,$R100<$D$8,$P100>SUM($V100:W100)),IF(SUM($P100*$U100/12,$V100:W100)>$P100,$P100-SUM($V100:W100),$P100*$U100/12),0)","v":{"v":0,"d":"0.00"}},{"$f":"IF(AND(Y$16*1>=$R100,Y$16*1<=$D$8,$R100<$D$8,$P100>SUM($V100:X100)),IF(SUM($P100*$U100/12,$V100:X100)>$P100,$P100-SUM($V100:X100),$P100*$U100/12),0)","v":{"v":0,"d":"0.00"}},{"$f":"IF(AND(Z$16*1>=$R100,Z$16*1<=$D$8,$R100<$D$8,$P100>SUM($V100:Y100)),IF(SUM($P100*$U100/12,$V100:Y100)>$P100,$P100-SUM($V100:Y100),$P100*$U100/12),0)","v":{"v":0,"d":"0.00"}},{"$f":"IF(AND(AA$16*1>=$R100,AA$16*1<=$D$8,$R100<$D$8,$P100>SUM($V100:Z100)),IF(SUM($P100*$U100/12,$V100:Z100)>$P100,$P100-SUM($V100:Z100),$P100*$U100/12),0)","v":{"v":0,"d":"0.00"}},{"$f":"IF(AND(AB$16*1>=$R100,AB$16*1<=$D$8,$R100<$D$8,$P100>SUM($V100:AA100)),IF(SUM($P100*$U100/12,$V100:AA100)>$P100,$P100-SUM($V100:AA100),$P100*$U100/12),0)","v":{"v":0,"d":"0.00"}},{"$f":"IF(AND(AC$16*1>=$R100,AC$16*1<=$D$8,$R100<$D$8,$P100>SUM($V100:AB100)),IF(SUM($P100*$U100/12,$V100:AB100)>$P100,$P100-SUM($V100:AB100),$P100*$U100/12),0)","v":{"v":0,"d":"0.00"}},{"$f":"IF(AND(AD$16*1>=$R100,AD$16*1<=$D$8,$R100<$D$8,$P100>SUM($V100:AC100)),IF(SUM($P100*$U100/12,$V100:AC100)>$P100,$P100-SUM($V100:AC100),$P100*$U100/12),0)","v":{"v":0,"d":"0.00"}},{"$f":"IF(AND(AE$16*1>=$R100,AE$16*1<=$D$8,$R100<$D$8,$P100>SUM($V100:AD100)),IF(SUM($P100*$U100/12,$V100:AD100)>$P100,$P100-SUM($V100:AD100),$P100*$U100/12),0)","v":{"v":0,"d":"0.00"}},{"$f":"IF(AND(AF$16*1>=$R100,AF$16*1<=$D$8,$R100<$D$8,$P100>SUM($V100:AE100)),IF(SUM($P100*$U100/12,$V100:AE100)>$P100,$P100-SUM($V100:AE100),$P100*$U100/12),0)","v":{"v":0,"d":"0.00"}},{"$f":"IF(AND(AG$16*1>=$R100,AG$16*1<=$D$8,$R100<$D$8,$P100>SUM($V100:AF100)),IF(SUM($P100*$U100/12,$V100:AF100)>$P100,$P100-SUM($V100:AF100),$P100*$U100/12),0)","v":{"v":0,"d":"0.00"}},{"$f":"IF(AND(AH$16*1>=$R100,AH$16*1<=$D$8,$R100<$D$8,$P100>SUM($V100:AG100)),IF(SUM($P100*$U100/12,$V100:AG100)>$P100,$P100-SUM($V100:AG100),$P100*$U100/12),0)","v":{"v":0,"d":"0.00"}},{"v":0,"d":"0.00"},null,null,{"v":2565.46,"d":"2,565.46"},null,{"v":2565.46,"d":"2,565.46"}]
[null,null,85,"336111","IMPRESORA EPSON FX-1180",{"$nulls":3},1732.3,{"$nulls":4},1732.3,null,{"v":1732.3,"d":"1,732.30"},"2004-09-28","2004-10-01",null,null,{"v":0.25,"d":"25%"},{"v":1732.3,"d":"1,732.30"},{"$f":"IF(AND(W$16*1>=$R101,W$16*1<=$D$8,$R101<$D$8,$P101>SUM($V101:V101)),IF(SUM($P101*$U101/12,$V101:V101)>$P101,$P101-SUM($V101:V101),$P101*$U101/12),0)","v":{"v":0,"d":"0.00"}},{"$f":"IF(AND(X$16*1>=$R101,X$16*1<=$D$8,$R101<$D$8,$P101>SUM($V101:W101)),IF(SUM($P101*$U101/12,$V101:W101)>$P101,$P101-SUM($V101:W101),$P101*$U101/12),0)","v":{"v":0,"d":"0.00"}},{"$f":"IF(AND(Y$16*1>=$R101,Y$16*1<=$D$8,$R101<$D$8,$P101>SUM($V101:X101)),IF(SUM($P101*$U101/12,$V101:X101)>$P101,$P101-SUM($V101:X101),$P101*$U101/12),0)","v":{"v":0,"d":"0.00"}},{"$f":"IF(AND(Z$16*1>=$R101,Z$16*1<=$D$8,$R101<$D$8,$P101>SUM($V101:Y101)),IF(SUM($P101*$U101/12,$V101:Y101)>$P101,$P101-SUM($V101:Y101),$P101*$U101/12),0)","v":{"v":0,"d":"0.00"}},{"$f":"IF(AND(AA$16*1>=$R101,AA$16*1<=$D$8,$R101<$D$8,$P101>SUM($V101:Z101)),IF(SUM($P101*$U101/12,$V101:Z101)>$P101,$P101-SUM($V101:Z101),$P101*$U101/12),0)","v":{"v":0,"d":"0.00"}},{"$f":"IF(AND(AB$16*1>=$R101,AB$16*1<=$D$8,$R101<$D$8,$P101>SUM($V101:AA101)),IF(SUM($P101*$U101/12,$V101:AA101)>$P101,$P101-SUM($V101:AA101),$P101*$U101/12),0)","v":{"v":0,"d":"0.00"}},{"$f":"IF(AND(AC$16*1>=$R101,AC$16*1<=$D$8,$R101<$D$8,$P101>SUM($V101:AB101)),IF(SUM($P101*$U101/12,$V101:AB101)>$P101,$P101-SUM($V101:AB101),$P101*$U101/12),0)","v":{"v":0,"d":"0.00"}},{"$f":"IF(AND(AD$16*1>=$R101,AD$16*1<=$D$8,$R101<$D$8,$P101>SUM($V101:AC101)),IF(SUM($P101*$U101/12,$V101:AC101)>$P101,$P101-SUM($V101:AC101),$P101*$U101/12),0)","v":{"v":0,"d":"0.00"}},{"$f":"IF(AND(AE$16*1>=$R101,AE$16*1<=$D$8,$R101<$D$8,$P101>SUM($V101:AD101)),IF(SUM($P101*$U101/12,$V101:AD101)>$P101,$P101-SUM($V101:AD101),$P101*$U101/12),0)","v":{"v":0,"d":"0.00"}},{"$f":"IF(AND(AF$16*1>=$R101,AF$16*1<=$D$8,$R101<$D$8,$P101>SUM($V101:AE101)),IF(SUM($P101*$U101/12,$V101:AE101)>$P101,$P101-SUM($V101:AE101),$P101*$U101/12),0)","v":{"v":0,"d":"0.00"}},{"$f":"IF(AND(AG$16*1>=$R101,AG$16*1<=$D$8,$R101<$D$8,$P101>SUM($V101:AF101)),IF(SUM($P101*$U101/12,$V101:AF101)>$P101,$P101-SUM($V101:AF101),$P101*$U101/12),0)","v":{"v":0,"d":"0.00"}},{"$f":"IF(AND(AH$16*1>=$R101,AH$16*1<=$D$8,$R101<$D$8,$P101>SUM($V101:AG101)),IF(SUM($P101*$U101/12,$V101:AG101)>$P101,$P101-SUM($V101:AG101),$P101*$U101/12),0)","v":{"v":0,"d":"0.00"}},{"v":0,"d":"0.00"},null,null,{"v":1732.3,"d":"1,732.30"},null,{"v":1732.3,"d":"1,732.30"}]
[null,null,86,"336111","MONITOR 14\" VIEWSONIC",{"$nulls":3},576.92,{"$nulls":4},576.92,null,576.92,"2005-02-16","2005-03-01",null,null,{"v":0.25,"d":"25%"},576.92,{"$f":"IF(AND(W$16*1>=$R102,W$16*1<=$D$8,$R102<$D$8,$P102>SUM($V102:V102)),IF(SUM($P102*$U102/12,$V102:V102)>$P102,$P102-SUM($V102:V102),$P102*$U102/12),0)","v":{"v":0,"d":"0.00"}},{"$f":"IF(AND(X$16*1>=$R102,X$16*1<=$D$8,$R102<$D$8,$P102>SUM($V102:W102)),IF(SUM($P102*$U102/12,$V102:W102)>$P102,$P102-SUM($V102:W102),$P102*$U102/12),0)","v":{"v":0,"d":"0.00"}},{"$f":"IF(AND(Y$16*1>=$R102,Y$16*1<=$D$8,$R102<$D$8,$P102>SUM($V102:X102)),IF(SUM($P102*$U102/12,$V102:X102)>$P102,$P102-SUM($V102:X102),$P102*$U102/12),0)","v":{"v":0,"d":"0.00"}},{"$f":"IF(AND(Z$16*1>=$R102,Z$16*1<=$D$8,$R102<$D$8,$P102>SUM($V102:Y102)),IF(SUM($P102*$U102/12,$V102:Y102)>$P102,$P102-SUM($V102:Y102),$P102*$U102/12),0)","v":{"v":0,"d":"0.00"}},{"$f":"IF(AND(AA$16*1>=$R102,AA$16*1<=$D$8,$R102<$D$8,$P102>SUM($V102:Z102)),IF(SUM($P102*$U102/12,$V102:Z102)>$P102,$P102-SUM($V102:Z102),$P102*$U102/12),0)","v":{"v":0,"d":"0.00"}},{"$f":"IF(AND(AB$16*1>=$R102,AB$16*1<=$D$8,$R102<$D$8,$P102>SUM($V102:AA102)),IF(SUM($P102*$U102/12,$V102:AA102)>$P102,$P102-SUM($V102:AA102),$P102*$U102/12),0)","v":{"v":0,"d":"0.00"}},{"$f":"IF(AND(AC$16*1>=$R102,AC$16*1<=$D$8,$R102<$D$8,$P102>SUM($V102:AB102)),IF(SUM($P102*$U102/12,$V102:AB102)>$P102,$P102-SUM($V102:AB102),$P102*$U102/12),0)","v":{"v":0,"d":"0.00"}},{"$f":"IF(AND(AD$16*1>=$R102,AD$16*1<=$D$8,$R102<$D$8,$P102>SUM($V102:AC102)),IF(SUM($P102*$U102/12,$V102:AC102)>$P102,$P102-SUM($V102:AC102),$P102*$U102/12),0)","v":{"v":0,"d":"0.00"}},{"$f":"IF(AND(AE$16*1>=$R102,AE$16*1<=$D$8,$R102<$D$8,$P102>SUM($V102:AD102)),IF(SUM($P102*$U102/12,$V102:AD102)>$P102,$P102-SUM($V102:AD102),$P102*$U102/12),0)","v":{"v":0,"d":"0.00"}},{"$f":"IF(AND(AF$16*1>=$R102,AF$16*1<=$D$8,$R102<$D$8,$P102>SUM($V102:AE102)),IF(SUM($P102*$U102/12,$V102:AE102)>$P102,$P102-SUM($V102:AE102),$P102*$U102/12),0)","v":{"v":0,"d":"0.00"}},{"$f":"IF(AND(AG$16*1>=$R102,AG$16*1<=$D$8,$R102<$D$8,$P102>SUM($V102:AF102)),IF(SUM($P102*$U102/12,$V102:AF102)>$P102,$P102-SUM($V102:AF102),$P102*$U102/12),0)","v":{"v":0,"d":"0.00"}},{"$f":"IF(AND(AH$16*1>=$R102,AH$16*1<=$D$8,$R102<$D$8,$P102>SUM($V102:AG102)),IF(SUM($P102*$U102/12,$V102:AG102)>$P102,$P102-SUM($V102:AG102),$P102*$U102/12),0)","v":{"v":0,"d":"0.00"}},{"v":0,"d":"0.00"},null,null,576.92,null,576.92]
[null,null,87,"336111","COMPUTADORA PORTATIL",{"$nulls":3},6121.52,{"$nulls":4},6121.52,null,{"v":6121.52,"d":"6,121.52"},"2005-08-02","2005-09-01",null,null,{"v":0.25,"d":"25%"},{"v":6121.52,"d":"6,121.52"},{"$f":"IF(AND(W$16*1>=$R103,W$16*1<=$D$8,$R103<$D$8,$P103>SUM($V103:V103)),IF(SUM($P103*$U103/12,$V103:V103)>$P103,$P103-SUM($V103:V103),$P103*$U103/12),0)","v":{"v":0,"d":"0.00"}},{"$f":"IF(AND(X$16*1>=$R103,X$16*1<=$D$8,$R103<$D$8,$P103>SUM($V103:W103)),IF(SUM($P103*$U103/12,$V103:W103)>$P103,$P103-SUM($V103:W103),$P103*$U103/12),0)","v":{"v":0,"d":"0.00"}},{"$f":"IF(AND(Y$16*1>=$R103,Y$16*1<=$D$8,$R103<$D$8,$P103>SUM($V103:X103)),IF(SUM($P103*$U103/12,$V103:X103)>$P103,$P103-SUM($V103:X103),$P103*$U103/12),0)","v":{"v":0,"d":"0.00"}},{"$f":"IF(AND(Z$16*1>=$R103,Z$16*1<=$D$8,$R103<$D$8,$P103>SUM($V103:Y103)),IF(SUM($P103*$U103/12,$V103:Y103)>$P103,$P103-SUM($V103:Y103),$P103*$U103/12),0)","v":{"v":0,"d":"0.00"}},{"$f":"IF(AND(AA$16*1>=$R103,AA$16*1<=$D$8,$R103<$D$8,$P103>SUM($V103:Z103)),IF(SUM($P103*$U103/12,$V103:Z103)>$P103,$P103-SUM($V103:Z103),$P103*$U103/12),0)","v":{"v":0,"d":"0.00"}},{"$f":"IF(AND(AB$16*1>=$R103,AB$16*1<=$D$8,$R103<$D$8,$P103>SUM($V103:AA103)),IF(SUM($P103*$U103/12,$V103:AA103)>$P103,$P103-SUM($V103:AA103),$P103*$U103/12),0)","v":{"v":0,"d":"0.00"}},{"$f":"IF(AND(AC$16*1>=$R103,AC$16*1<=$D$8,$R103<$D$8,$P103>SUM($V103:AB103)),IF(SUM($P103*$U103/12,$V103:AB103)>$P103,$P103-SUM($V103:AB103),$P103*$U103/12),0)","v":{"v":0,"d":"0.00"}},{"$f":"IF(AND(AD$16*1>=$R103,AD$16*1<=$D$8,$R103<$D$8,$P103>SUM($V103:AC103)),IF(SUM($P103*$U103/12,$V103:AC103)>$P103,$P103-SUM($V103:AC103),$P103*$U103/12),0)","v":{"v":0,"d":"0.00"}},{"$f":"IF(AND(AE$16*1>=$R103,AE$16*1<=$D$8,$R103<$D$8,$P103>SUM($V103:AD103)),IF(SUM($P103*$U103/12,$V103:AD103)>$P103,$P103-SUM($V103:AD103),$P103*$U103/12),0)","v":{"v":0,"d":"0.00"}},{"$f":"IF(AND(AF$16*1>=$R103,AF$16*1<=$D$8,$R103<$D$8,$P103>SUM($V103:AE103)),IF(SUM($P103*$U103/12,$V103:AE103)>$P103,$P103-SUM($V103:AE103),$P103*$U103/12),0)","v":{"v":0,"d":"0.00"}},{"$f":"IF(AND(AG$16*1>=$R103,AG$16*1<=$D$8,$R103<$D$8,$P103>SUM($V103:AF103)),IF(SUM($P103*$U103/12,$V103:AF103)>$P103,$P103-SUM($V103:AF103),$P103*$U103/12),0)","v":{"v":0,"d":"0.00"}},{"$f":"IF(AND(AH$16*1>=$R103,AH$16*1<=$D$8,$R103<$D$8,$P103>SUM($V103:AG103)),IF(SUM($P103*$U103/12,$V103:AG103)>$P103,$P103-SUM($V103:AG103),$P103*$U103/12),0)","v":{"v":0,"d":"0.00"}},{"v":0,"d":"0.00"},null,null,{"v":6121.52,"d":"6,121.52"},null,{"v":6121.52,"d":"6,121.52"}]
[null,null,88,"336111","IMPRESORA ART JET 10 OLIVETTI",{"$nulls":3},313.2,{"$nulls":4},313.2,null,{"v":313.2,"d":"313.20"},"2006-03-13","2006-04-01",null,null,{"v":0.25,"d":"25%"},{"v":313.2,"d":"313.20"},{"$f":"IF(AND(W$16*1>=$R104,W$16*1<=$D$8,$R104<$D$8,$P104>SUM($V104:V104)),IF(SUM($P104*$U104/12,$V104:V104)>$P104,$P104-SUM($V104:V104),$P104*$U104/12),0)","v":{"v":0,"d":"0.00"}},{"$f":"IF(AND(X$16*1>=$R104,X$16*1<=$D$8,$R104<$D$8,$P104>SUM($V104:W104)),IF(SUM($P104*$U104/12,$V104:W104)>$P104,$P104-SUM($V104:W104),$P104*$U104/12),0)","v":{"v":0,"d":"0.00"}},{"$f":"IF(AND(Y$16*1>=$R104,Y$16*1<=$D$8,$R104<$D$8,$P104>SUM($V104:X104)),IF(SUM($P104*$U104/12,$V104:X104)>$P104,$P104-SUM($V104:X104),$P104*$U104/12),0)","v":{"v":0,"d":"0.00"}},{"$f":"IF(AND(Z$16*1>=$R104,Z$16*1<=$D$8,$R104<$D$8,$P104>SUM($V104:Y104)),IF(SUM($P104*$U104/12,$V104:Y104)>$P104,$P104-SUM($V104:Y104),$P104*$U104/12),0)","v":{"v":0,"d":"0.00"}},{"$f":"IF(AND(AA$16*1>=$R104,AA$16*1<=$D$8,$R104<$D$8,$P104>SUM($V104:Z104)),IF(SUM($P104*$U104/12,$V104:Z104)>$P104,$P104-SUM($V104:Z104),$P104*$U104/12),0)","v":{"v":0,"d":"0.00"}},{"$f":"IF(AND(AB$16*1>=$R104,AB$16*1<=$D$8,$R104<$D$8,$P104>SUM($V104:AA104)),IF(SUM($P104*$U104/12,$V104:AA104)>$P104,$P104-SUM($V104:AA104),$P104*$U104/12),0)","v":{"v":0,"d":"0.00"}},{"$f":"IF(AND(AC$16*1>=$R104,AC$16*1<=$D$8,$R104<$D$8,$P104>SUM($V104:AB104)),IF(SUM($P104*$U104/12,$V104:AB104)>$P104,$P104-SUM($V104:AB104),$P104*$U104/12),0)","v":{"v":0,"d":"0.00"}},{"$f":"IF(AND(AD$16*1>=$R104,AD$16*1<=$D$8,$R104<$D$8,$P104>SUM($V104:AC104)),IF(SUM($P104*$U104/12,$V104:AC104)>$P104,$P104-SUM($V104:AC104),$P104*$U104/12),0)","v":{"v":0,"d":"0.00"}},{"$f":"IF(AND(AE$16*1>=$R104,AE$16*1<=$D$8,$R104<$D$8,$P104>SUM($V104:AD104)),IF(SUM($P104*$U104/12,$V104:AD104)>$P104,$P104-SUM($V104:AD104),$P104*$U104/12),0)","v":{"v":0,"d":"0.00"}},{"$f":"IF(AND(AF$16*1>=$R104,AF$16*1<=$D$8,$R104<$D$8,$P104>SUM($V104:AE104)),IF(SUM($P104*$U104/12,$V104:AE104)>$P104,$P104-SUM($V104:AE104),$P104*$U104/12),0)","v":{"v":0,"d":"0.00"}},{"$f":"IF(AND(AG$16*1>=$R104,AG$16*1<=$D$8,$R104<$D$8,$P104>SUM($V104:AF104)),IF(SUM($P104*$U104/12,$V104:AF104)>$P104,$P104-SUM($V104:AF104),$P104*$U104/12),0)","v":{"v":0,"d":"0.00"}},{"$f":"IF(AND(AH$16*1>=$R104,AH$16*1<=$D$8,$R104<$D$8,$P104>SUM($V104:AG104)),IF(SUM($P104*$U104/12,$V104:AG104)>$P104,$P104-SUM($V104:AG104),$P104*$U104/12),0)","v":{"v":0,"d":"0.00"}},{"v":0,"d":"0.00"},null,null,{"v":313.2,"d":"313.20"},null,{"v":313.2,"d":"313.20"}]
[null,null,89,"336111","ZIP DRIVE 250 MB IOMEGA",{"$nulls":3},716.72,{"$nulls":4},716.72,null,716.72,"2006-04-05","2006-05-01",null,null,{"v":0.25,"d":"25%"},716.72,{"$f":"IF(AND(W$16*1>=$R105,W$16*1<=$D$8,$R105<$D$8,$P105>SUM($V105:V105)),IF(SUM($P105*$U105/12,$V105:V105)>$P105,$P105-SUM($V105:V105),$P105*$U105/12),0)","v":{"v":0,"d":"0.00"}},{"$f":"IF(AND(X$16*1>=$R105,X$16*1<=$D$8,$R105<$D$8,$P105>SUM($V105:W105)),IF(SUM($P105*$U105/12,$V105:W105)>$P105,$P105-SUM($V105:W105),$P105*$U105/12),0)","v":{"v":0,"d":"0.00"}},{"$f":"IF(AND(Y$16*1>=$R105,Y$16*1<=$D$8,$R105<$D$8,$P105>SUM($V105:X105)),IF(SUM($P105*$U105/12,$V105:X105)>$P105,$P105-SUM($V105:X105),$P105*$U105/12),0)","v":{"v":0,"d":"0.00"}},{"$f":"IF(AND(Z$16*1>=$R105,Z$16*1<=$D$8,$R105<$D$8,$P105>SUM($V105:Y105)),IF(SUM($P105*$U105/12,$V105:Y105)>$P105,$P105-SUM($V105:Y105),$P105*$U105/12),0)","v":{"v":0,"d":"0.00"}},{"$f":"IF(AND(AA$16*1>=$R105,AA$16*1<=$D$8,$R105<$D$8,$P105>SUM($V105:Z105)),IF(SUM($P105*$U105/12,$V105:Z105)>$P105,$P105-SUM($V105:Z105),$P105*$U105/12),0)","v":{"v":0,"d":"0.00"}},{"$f":"IF(AND(AB$16*1>=$R105,AB$16*1<=$D$8,$R105<$D$8,$P105>SUM($V105:AA105)),IF(SUM($P105*$U105/12,$V105:AA105)>$P105,$P105-SUM($V105:AA105),$P105*$U105/12),0)","v":{"v":0,"d":"0.00"}},{"$f":"IF(AND(AC$16*1>=$R105,AC$16*1<=$D$8,$R105<$D$8,$P105>SUM($V105:AB105)),IF(SUM($P105*$U105/12,$V105:AB105)>$P105,$P105-SUM($V105:AB105),$P105*$U105/12),0)","v":{"v":0,"d":"0.00"}},{"$f":"IF(AND(AD$16*1>=$R105,AD$16*1<=$D$8,$R105<$D$8,$P105>SUM($V105:AC105)),IF(SUM($P105*$U105/12,$V105:AC105)>$P105,$P105-SUM($V105:AC105),$P105*$U105/12),0)","v":{"v":0,"d":"0.00"}},{"$f":"IF(AND(AE$16*1>=$R105,AE$16*1<=$D$8,$R105<$D$8,$P105>SUM($V105:AD105)),IF(SUM($P105*$U105/12,$V105:AD105)>$P105,$P105-SUM($V105:AD105),$P105*$U105/12),0)","v":{"v":0,"d":"0.00"}},{"$f":"IF(AND(AF$16*1>=$R105,AF$16*1<=$D$8,$R105<$D$8,$P105>SUM($V105:AE105)),IF(SUM($P105*$U105/12,$V105:AE105)>$P105,$P105-SUM($V105:AE105),$P105*$U105/12),0)","v":{"v":0,"d":"0.00"}},{"$f":"IF(AND(AG$16*1>=$R105,AG$16*1<=$D$8,$R105<$D$8,$P105>SUM($V105:AF105)),IF(SUM($P105*$U105/12,$V105:AF105)>$P105,$P105-SUM($V105:AF105),$P105*$U105/12),0)","v":{"v":0,"d":"0.00"}},{"$f":"IF(AND(AH$16*1>=$R105,AH$16*1<=$D$8,$R105<$D$8,$P105>SUM($V105:AG105)),IF(SUM($P105*$U105/12,$V105:AG105)>$P105,$P105-SUM($V105:AG105),$P105*$U105/12),0)","v":{"v":0,"d":"0.00"}},{"v":0,"d":"0.00"},null,null,716.72,null,716.72]
[null,null,90,"336111","IMPRESORA LEXMARK X83",{"$nulls":3},506.12,{"$nulls":4},506.12,null,506.12,"2008-07-16","2008-08-01",null,null,{"v":0.25,"d":"25%"},506.12,{"$f":"IF(AND(W$16*1>=$R106,W$16*1<=$D$8,$R106<$D$8,$P106>SUM($V106:V106)),IF(SUM($P106*$U106/12,$V106:V106)>$P106,$P106-SUM($V106:V106),$P106*$U106/12),0)","v":{"v":0,"d":"0.00"}},{"$f":"IF(AND(X$16*1>=$R106,X$16*1<=$D$8,$R106<$D$8,$P106>SUM($V106:W106)),IF(SUM($P106*$U106/12,$V106:W106)>$P106,$P106-SUM($V106:W106),$P106*$U106/12),0)","v":{"v":0,"d":"0.00"}},{"$f":"IF(AND(Y$16*1>=$R106,Y$16*1<=$D$8,$R106<$D$8,$P106>SUM($V106:X106)),IF(SUM($P106*$U106/12,$V106:X106)>$P106,$P106-SUM($V106:X106),$P106*$U106/12),0)","v":{"v":0,"d":"0.00"}},{"$f":"IF(AND(Z$16*1>=$R106,Z$16*1<=$D$8,$R106<$D$8,$P106>SUM($V106:Y106)),IF(SUM($P106*$U106/12,$V106:Y106)>$P106,$P106-SUM($V106:Y106),$P106*$U106/12),0)","v":{"v":0,"d":"0.00"}},{"$f":"IF(AND(AA$16*1>=$R106,AA$16*1<=$D$8,$R106<$D$8,$P106>SUM($V106:Z106)),IF(SUM($P106*$U106/12,$V106:Z106)>$P106,$P106-SUM($V106:Z106),$P106*$U106/12),0)","v":{"v":0,"d":"0.00"}},{"$f":"IF(AND(AB$16*1>=$R106,AB$16*1<=$D$8,$R106<$D$8,$P106>SUM($V106:AA106)),IF(SUM($P106*$U106/12,$V106:AA106)>$P106,$P106-SUM($V106:AA106),$P106*$U106/12),0)","v":{"v":0,"d":"0.00"}},{"$f":"IF(AND(AC$16*1>=$R106,AC$16*1<=$D$8,$R106<$D$8,$P106>SUM($V106:AB106)),IF(SUM($P106*$U106/12,$V106:AB106)>$P106,$P106-SUM($V106:AB106),$P106*$U106/12),0)","v":{"v":0,"d":"0.00"}},{"$f":"IF(AND(AD$16*1>=$R106,AD$16*1<=$D$8,$R106<$D$8,$P106>SUM($V106:AC106)),IF(SUM($P106*$U106/12,$V106:AC106)>$P106,$P106-SUM($V106:AC106),$P106*$U106/12),0)","v":{"v":0,"d":"0.00"}},{"$f":"IF(AND(AE$16*1>=$R106,AE$16*1<=$D$8,$R106<$D$8,$P106>SUM($V106:AD106)),IF(SUM($P106*$U106/12,$V106:AD106)>$P106,$P106-SUM($V106:AD106),$P106*$U106/12),0)","v":{"v":0,"d":"0.00"}},{"$f":"IF(AND(AF$16*1>=$R106,AF$16*1<=$D$8,$R106<$D$8,$P106>SUM($V106:AE106)),IF(SUM($P106*$U106/12,$V106:AE106)>$P106,$P106-SUM($V106:AE106),$P106*$U106/12),0)","v":{"v":0,"d":"0.00"}},{"$f":"IF(AND(AG$16*1>=$R106,AG$16*1<=$D$8,$R106<$D$8,$P106>SUM($V106:AF106)),IF(SUM($P106*$U106/12,$V106:AF106)>$P106,$P106-SUM($V106:AF106),$P106*$U106/12),0)","v":{"v":0,"d":"0.00"}},{"$f":"IF(AND(AH$16*1>=$R106,AH$16*1<=$D$8,$R106<$D$8,$P106>SUM($V106:AG106)),IF(SUM($P106*$U106/12,$V106:AG106)>$P106,$P106-SUM($V106:AG106),$P106*$U106/12),0)","v":{"v":0,"d":"0.00"}},{"v":0,"d":"0.00"},null,null,506.12,null,506.12]
[null,null,91,"336111","COMPUTADORA PORTATIL DELL",{"$nulls":3},8809.31,{"$nulls":4},8809.31,null,{"v":8809.31,"d":"8,809.31"},"2008-11-23","2008-12-01",null,null,{"v":0.25,"d":"25%"},{"v":8809.31,"d":"8,809.31"},{"$f":"IF(AND(W$16*1>=$R107,W$16*1<=$D$8,$R107<$D$8,$P107>SUM($V107:V107)),IF(SUM($P107*$U107/12,$V107:V107)>$P107,$P107-SUM($V107:V107),$P107*$U107/12),0)","v":{"v":0,"d":"0.00"}},{"$f":"IF(AND(X$16*1>=$R107,X$16*1<=$D$8,$R107<$D$8,$P107>SUM($V107:W107)),IF(SUM($P107*$U107/12,$V107:W107)>$P107,$P107-SUM($V107:W107),$P107*$U107/12),0)","v":{"v":0,"d":"0.00"}},{"$f":"IF(AND(Y$16*1>=$R107,Y$16*1<=$D$8,$R107<$D$8,$P107>SUM($V107:X107)),IF(SUM($P107*$U107/12,$V107:X107)>$P107,$P107-SUM($V107:X107),$P107*$U107/12),0)","v":{"v":0,"d":"0.00"}},{"$f":"IF(AND(Z$16*1>=$R107,Z$16*1<=$D$8,$R107<$D$8,$P107>SUM($V107:Y107)),IF(SUM($P107*$U107/12,$V107:Y107)>$P107,$P107-SUM($V107:Y107),$P107*$U107/12),0)","v":{"v":0,"d":"0.00"}},{"$f":"IF(AND(AA$16*1>=$R107,AA$16*1<=$D$8,$R107<$D$8,$P107>SUM($V107:Z107)),IF(SUM($P107*$U107/12,$V107:Z107)>$P107,$P107-SUM($V107:Z107),$P107*$U107/12),0)","v":{"v":0,"d":"0.00"}},{"$f":"IF(AND(AB$16*1>=$R107,AB$16*1<=$D$8,$R107<$D$8,$P107>SUM($V107:AA107)),IF(SUM($P107*$U107/12,$V107:AA107)>$P107,$P107-SUM($V107:AA107),$P107*$U107/12),0)","v":{"v":0,"d":"0.00"}},{"$f":"IF(AND(AC$16*1>=$R107,AC$16*1<=$D$8,$R107<$D$8,$P107>SUM($V107:AB107)),IF(SUM($P107*$U107/12,$V107:AB107)>$P107,$P107-SUM($V107:AB107),$P107*$U107/12),0)","v":{"v":0,"d":"0.00"}},{"$f":"IF(AND(AD$16*1>=$R107,AD$16*1<=$D$8,$R107<$D$8,$P107>SUM($V107:AC107)),IF(SUM($P107*$U107/12,$V107:AC107)>$P107,$P107-SUM($V107:AC107),$P107*$U107/12),0)","v":{"v":0,"d":"0.00"}},{"$f":"IF(AND(AE$16*1>=$R107,AE$16*1<=$D$8,$R107<$D$8,$P107>SUM($V107:AD107)),IF(SUM($P107*$U107/12,$V107:AD107)>$P107,$P107-SUM($V107:AD107),$P107*$U107/12),0)","v":{"v":0,"d":"0.00"}},{"$f":"IF(AND(AF$16*1>=$R107,AF$16*1<=$D$8,$R107<$D$8,$P107>SUM($V107:AE107)),IF(SUM($P107*$U107/12,$V107:AE107)>$P107,$P107-SUM($V107:AE107),$P107*$U107/12),0)","v":{"v":0,"d":"0.00"}},{"$f":"IF(AND(AG$16*1>=$R107,AG$16*1<=$D$8,$R107<$D$8,$P107>SUM($V107:AF107)),IF(SUM($P107*$U107/12,$V107:AF107)>$P107,$P107-SUM($V107:AF107),$P107*$U107/12),0)","v":{"v":0,"d":"0.00"}},{"$f":"IF(AND(AH$16*1>=$R107,AH$16*1<=$D$8,$R107<$D$8,$P107>SUM($V107:AG107)),IF(SUM($P107*$U107/12,$V107:AG107)>$P107,$P107-SUM($V107:AG107),$P107*$U107/12),0)","v":{"v":0,"d":"0.00"}},{"v":0,"d":"0.00"},null,null,{"v":8809.31,"d":"8,809.31"},null,{"v":8809.31,"d":"8,809.31"}]
[null,null,92,"336111","COMPUTADORA DELL",{"$nulls":3},4796.13,{"$nulls":4},4796.13,null,{"v":4796.13,"d":"4,796.13"},"2008-11-23","2008-12-01",null,null,{"v":0.25,"d":"25%"},{"v":4796.13,"d":"4,796.13"},{"$f":"IF(AND(W$16*1>=$R108,W$16*1<=$D$8,$R108<$D$8,$P108>SUM($V108:V108)),IF(SUM($P108*$U108/12,$V108:V108)>$P108,$P108-SUM($V108:V108),$P108*$U108/12),0)","v":{"v":0,"d":"0.00"}},{"$f":"IF(AND(X$16*1>=$R108,X$16*1<=$D$8,$R108<$D$8,$P108>SUM($V108:W108)),IF(SUM($P108*$U108/12,$V108:W108)>$P108,$P108-SUM($V108:W108),$P108*$U108/12),0)","v":{"v":0,"d":"0.00"}},{"$f":"IF(AND(Y$16*1>=$R108,Y$16*1<=$D$8,$R108<$D$8,$P108>SUM($V108:X108)),IF(SUM($P108*$U108/12,$V108:X108)>$P108,$P108-SUM($V108:X108),$P108*$U108/12),0)","v":{"v":0,"d":"0.00"}},{"$f":"IF(AND(Z$16*1>=$R108,Z$16*1<=$D$8,$R108<$D$8,$P108>SUM($V108:Y108)),IF(SUM($P108*$U108/12,$V108:Y108)>$P108,$P108-SUM($V108:Y108),$P108*$U108/12),0)","v":{"v":0,"d":"0.00"}},{"$f":"IF(AND(AA$16*1>=$R108,AA$16*1<=$D$8,$R108<$D$8,$P108>SUM($V108:Z108)),IF(SUM($P108*$U108/12,$V108:Z108)>$P108,$P108-SUM($V108:Z108),$P108*$U108/12),0)","v":{"v":0,"d":"0.00"}},{"$f":"IF(AND(AB$16*1>=$R108,AB$16*1<=$D$8,$R108<$D$8,$P108>SUM($V108:AA108)),IF(SUM($P108*$U108/12,$V108:AA108)>$P108,$P108-SUM($V108:AA108),$P108*$U108/12),0)","v":{"v":0,"d":"0.00"}},{"$f":"IF(AND(AC$16*1>=$R108,AC$16*1<=$D$8,$R108<$D$8,$P108>SUM($V108:AB108)),IF(SUM($P108*$U108/12,$V108:AB108)>$P108,$P108-SUM($V108:AB108),$P108*$U108/12),0)","v":{"v":0,"d":"0.00"}},{"$f":"IF(AND(AD$16*1>=$R108,AD$16*1<=$D$8,$R108<$D$8,$P108>SUM($V108:AC108)),IF(SUM($P108*$U108/12,$V108:AC108)>$P108,$P108-SUM($V108:AC108),$P108*$U108/12),0)","v":{"v":0,"d":"0.00"}},{"$f":"IF(AND(AE$16*1>=$R108,AE$16*1<=$D$8,$R108<$D$8,$P108>SUM($V108:AD108)),IF(SUM($P108*$U108/12,$V108:AD108)>$P108,$P108-SUM($V108:AD108),$P108*$U108/12),0)","v":{"v":0,"d":"0.00"}},{"$f":"IF(AND(AF$16*1>=$R108,AF$16*1<=$D$8,$R108<$D$8,$P108>SUM($V108:AE108)),IF(SUM($P108*$U108/12,$V108:AE108)>$P108,$P108-SUM($V108:AE108),$P108*$U108/12),0)","v":{"v":0,"d":"0.00"}},{"$f":"IF(AND(AG$16*1>=$R108,AG$16*1<=$D$8,$R108<$D$8,$P108>SUM($V108:AF108)),IF(SUM($P108*$U108/12,$V108:AF108)>$P108,$P108-SUM($V108:AF108),$P108*$U108/12),0)","v":{"v":0,"d":"0.00"}},{"$f":"IF(AND(AH$16*1>=$R108,AH$16*1<=$D$8,$R108<$D$8,$P108>SUM($V108:AG108)),IF(SUM($P108*$U108/12,$V108:AG108)>$P108,$P108-SUM($V108:AG108),$P108*$U108/12),0)","v":{"v":0,"d":"0.00"}},{"v":0,"d":"0.00"},null,null,{"v":4796.13,"d":"4,796.13"},null,{"v":4796.13,"d":"4,796.13"}]
[null,null,93,"336111","COMPUTADORA DELL",{"$nulls":3},4796.13,{"$nulls":4},4796.13,null,{"v":4796.13,"d":"4,796.13"},"2008-11-23","2008-12-01",null,null,{"v":0.25,"d":"25%"},{"v":4796.13,"d":"4,796.13"},{"$f":"IF(AND(W$16*1>=$R109,W$16*1<=$D$8,$R109<$D$8,$P109>SUM($V109:V109)),IF(SUM($P109*$U109/12,$V109:V109)>$P109,$P109-SUM($V109:V109),$P109*$U109/12),0)","v":{"v":0,"d":"0.00"}},{"$f":"IF(AND(X$16*1>=$R109,X$16*1<=$D$8,$R109<$D$8,$P109>SUM($V109:W109)),IF(SUM($P109*$U109/12,$V109:W109)>$P109,$P109-SUM($V109:W109),$P109*$U109/12),0)","v":{"v":0,"d":"0.00"}},{"$f":"IF(AND(Y$16*1>=$R109,Y$16*1<=$D$8,$R109<$D$8,$P109>SUM($V109:X109)),IF(SUM($P109*$U109/12,$V109:X109)>$P109,$P109-SUM($V109:X109),$P109*$U109/12),0)","v":{"v":0,"d":"0.00"}},{"$f":"IF(AND(Z$16*1>=$R109,Z$16*1<=$D$8,$R109<$D$8,$P109>SUM($V109:Y109)),IF(SUM($P109*$U109/12,$V109:Y109)>$P109,$P109-SUM($V109:Y109),$P109*$U109/12),0)","v":{"v":0,"d":"0.00"}},{"$f":"IF(AND(AA$16*1>=$R109,AA$16*1<=$D$8,$R109<$D$8,$P109>SUM($V109:Z109)),IF(SUM($P109*$U109/12,$V109:Z109)>$P109,$P109-SUM($V109:Z109),$P109*$U109/12),0)","v":{"v":0,"d":"0.00"}},{"$f":"IF(AND(AB$16*1>=$R109,AB$16*1<=$D$8,$R109<$D$8,$P109>SUM($V109:AA109)),IF(SUM($P109*$U109/12,$V109:AA109)>$P109,$P109-SUM($V109:AA109),$P109*$U109/12),0)","v":{"v":0,"d":"0.00"}},{"$f":"IF(AND(AC$16*1>=$R109,AC$16*1<=$D$8,$R109<$D$8,$P109>SUM($V109:AB109)),IF(SUM($P109*$U109/12,$V109:AB109)>$P109,$P109-SUM($V109:AB109),$P109*$U109/12),0)","v":{"v":0,"d":"0.00"}},{"$f":"IF(AND(AD$16*1>=$R109,AD$16*1<=$D$8,$R109<$D$8,$P109>SUM($V109:AC109)),IF(SUM($P109*$U109/12,$V109:AC109)>$P109,$P109-SUM($V109:AC109),$P109*$U109/12),0)","v":{"v":0,"d":"0.00"}},{"$f":"IF(AND(AE$16*1>=$R109,AE$16*1<=$D$8,$R109<$D$8,$P109>SUM($V109:AD109)),IF(SUM($P109*$U109/12,$V109:AD109)>$P109,$P109-SUM($V109:AD109),$P109*$U109/12),0)","v":{"v":0,"d":"0.00"}},{"$f":"IF(AND(AF$16*1>=$R109,AF$16*1<=$D$8,$R109<$D$8,$P109>SUM($V109:AE109)),IF(SUM($P109*$U109/12,$V109:AE109)>$P109,$P109-SUM($V109:AE109),$P109*$U109/12),0)","v":{"v":0,"d":"0.00"}},{"$f":"IF(AND(AG$16*1>=$R109,AG$16*1<=$D$8,$R109<$D$8,$P109>SUM($V109:AF109)),IF(SUM($P109*$U109/12,$V109:AF109)>$P109,$P109-SUM($V109:AF109),$P109*$U109/12),0)","v":{"v":0,"d":"0.00"}},{"$f":"IF(AND(AH$16*1>=$R109,AH$16*1<=$D$8,$R109<$D$8,$P109>SUM($V109:AG109)),IF(SUM($P109*$U109/12,$V109:AG109)>$P109,$P109-SUM($V109:AG109),$P109*$U109/12),0)","v":{"v":0,"d":"0.00"}},{"v":0,"d":"0.00"},null,null,{"v":4796.13,"d":"4,796.13"},null,{"v":4796.13,"d":"4,796.13"}]
[null,null,94,"336111","COMPUTADORA DELL",{"$nulls":3},4796.13,{"$nulls":4},4796.13,null,{"v":4796.13,"d":"4,796.13"},"2008-11-23","2008-12-01",null,null,{"v":0.25,"d":"25%"},{"v":4796.13,"d":"4,796.13"},{"$f":"IF(AND(W$16*1>=$R110,W$16*1<=$D$8,$R110<$D$8,$P110>SUM($V110:V110)),IF(SUM($P110*$U110/12,$V110:V110)>$P110,$P110-SUM($V110:V110),$P110*$U110/12),0)","v":{"v":0,"d":"0.00"}},{"$f":"IF(AND(X$16*1>=$R110,X$16*1<=$D$8,$R110<$D$8,$P110>SUM($V110:W110)),IF(SUM($P110*$U110/12,$V110:W110)>$P110,$P110-SUM($V110:W110),$P110*$U110/12),0)","v":{"v":0,"d":"0.00"}},{"$f":"IF(AND(Y$16*1>=$R110,Y$16*1<=$D$8,$R110<$D$8,$P110>SUM($V110:X110)),IF(SUM($P110*$U110/12,$V110:X110)>$P110,$P110-SUM($V110:X110),$P110*$U110/12),0)","v":{"v":0,"d":"0.00"}},{"$f":"IF(AND(Z$16*1>=$R110,Z$16*1<=$D$8,$R110<$D$8,$P110>SUM($V110:Y110)),IF(SUM($P110*$U110/12,$V110:Y110)>$P110,$P110-SUM($V110:Y110),$P110*$U110/12),0)","v":{"v":0,"d":"0.00"}},{"$f":"IF(AND(AA$16*1>=$R110,AA$16*1<=$D$8,$R110<$D$8,$P110>SUM($V110:Z110)),IF(SUM($P110*$U110/12,$V110:Z110)>$P110,$P110-SUM($V110:Z110),$P110*$U110/12),0)","v":{"v":0,"d":"0.00"}},{"$f":"IF(AND(AB$16*1>=$R110,AB$16*1<=$D$8,$R110<$D$8,$P110>SUM($V110:AA110)),IF(SUM($P110*$U110/12,$V110:AA110)>$P110,$P110-SUM($V110:AA110),$P110*$U110/12),0)","v":{"v":0,"d":"0.00"}},{"$f":"IF(AND(AC$16*1>=$R110,AC$16*1<=$D$8,$R110<$D$8,$P110>SUM($V110:AB110)),IF(SUM($P110*$U110/12,$V110:AB110)>$P110,$P110-SUM($V110:AB110),$P110*$U110/12),0)","v":{"v":0,"d":"0.00"}},{"$f":"IF(AND(AD$16*1>=$R110,AD$16*1<=$D$8,$R110<$D$8,$P110>SUM($V110:AC110)),IF(SUM($P110*$U110/12,$V110:AC110)>$P110,$P110-SUM($V110:AC110),$P110*$U110/12),0)","v":{"v":0,"d":"0.00"}},{"$f":"IF(AND(AE$16*1>=$R110,AE$16*1<=$D$8,$R110<$D$8,$P110>SUM($V110:AD110)),IF(SUM($P110*$U110/12,$V110:AD110)>$P110,$P110-SUM($V110:AD110),$P110*$U110/12),0)","v":{"v":0,"d":"0.00"}},{"$f":"IF(AND(AF$16*1>=$R110,AF$16*1<=$D$8,$R110<$D$8,$P110>SUM($V110:AE110)),IF(SUM($P110*$U110/12,$V110:AE110)>$P110,$P110-SUM($V110:AE110),$P110*$U110/12),0)","v":{"v":0,"d":"0.00"}},{"$f":"IF(AND(AG$16*1>=$R110,AG$16*1<=$D$8,$R110<$D$8,$P110>SUM($V110:AF110)),IF(SUM($P110*$U110/12,$V110:AF110)>$P110,$P110-SUM($V110:AF110),$P110*$U110/12),0)","v":{"v":0,"d":"0.00"}},{"$f":"IF(AND(AH$16*1>=$R110,AH$16*1<=$D$8,$R110<$D$8,$P110>SUM($V110:AG110)),IF(SUM($P110*$U110/12,$V110:AG110)>$P110,$P110-SUM($V110:AG110),$P110*$U110/12),0)","v":{"v":0,"d":"0.00"}},{"v":0,"d":"0.00"},null,null,{"v":4796.13,"d":"4,796.13"},null,{"v":4796.13,"d":"4,796.13"}]
[null,null,95,"336111","COMPUTADORA DELL",{"$nulls":3},4796.13,{"$nulls":4},4796.13,null,{"v":4796.13,"d":"4,796.13"},"2008-11-23","2008-12-01",null,null,{"v":0.25,"d":"25%"},{"v":4796.13,"d":"4,796.13"},{"$f":"IF(AND(W$16*1>=$R111,W$16*1<=$D$8,$R111<$D$8,$P111>SUM($V111:V111)),IF(SUM($P111*$U111/12,$V111:V111)>$P111,$P111-SUM($V111:V111),$P111*$U111/12),0)","v":{"v":0,"d":"0.00"}},{"$f":"IF(AND(X$16*1>=$R111,X$16*1<=$D$8,$R111<$D$8,$P111>SUM($V111:W111)),IF(SUM($P111*$U111/12,$V111:W111)>$P111,$P111-SUM($V111:W111),$P111*$U111/12),0)","v":{"v":0,"d":"0.00"}},{"$f":"IF(AND(Y$16*1>=$R111,Y$16*1<=$D$8,$R111<$D$8,$P111>SUM($V111:X111)),IF(SUM($P111*$U111/12,$V111:X111)>$P111,$P111-SUM($V111:X111),$P111*$U111/12),0)","v":{"v":0,"d":"0.00"}},{"$f":"IF(AND(Z$16*1>=$R111,Z$16*1<=$D$8,$R111<$D$8,$P111>SUM($V111:Y111)),IF(SUM($P111*$U111/12,$V111:Y111)>$P111,$P111-SUM($V111:Y111),$P111*$U111/12),0)","v":{"v":0,"d":"0.00"}},{"$f":"IF(AND(AA$16*1>=$R111,AA$16*1<=$D$8,$R111<$D$8,$P111>SUM($V111:Z111)),IF(SUM($P111*$U111/12,$V111:Z111)>$P111,$P111-SUM($V111:Z111),$P111*$U111/12),0)","v":{"v":0,"d":"0.00"}},{"$f":"IF(AND(AB$16*1>=$R111,AB$16*1<=$D$8,$R111<$D$8,$P111>SUM($V111:AA111)),IF(SUM($P111*$U111/12,$V111:AA111)>$P111,$P111-SUM($V111:AA111),$P111*$U111/12),0)","v":{"v":0,"d":"0.00"}},{"$f":"IF(AND(AC$16*1>=$R111,AC$16*1<=$D$8,$R111<$D$8,$P111>SUM($V111:AB111)),IF(SUM($P111*$U111/12,$V111:AB111)>$P111,$P111-SUM($V111:AB111),$P111*$U111/12),0)","v":{"v":0,"d":"0.00"}},{"$f":"IF(AND(AD$16*1>=$R111,AD$16*1<=$D$8,$R111<$D$8,$P111>SUM($V111:AC111)),IF(SUM($P111*$U111/12,$V111:AC111)>$P111,$P111-SUM($V111:AC111),$P111*$U111/12),0)","v":{"v":0,"d":"0.00"}},{"$f":"IF(AND(AE$16*1>=$R111,AE$16*1<=$D$8,$R111<$D$8,$P111>SUM($V111:AD111)),IF(SUM($P111*$U111/12,$V111:AD111)>$P111,$P111-SUM($V111:AD111),$P111*$U111/12),0)","v":{"v":0,"d":"0.00"}},{"$f":"IF(AND(AF$16*1>=$R111,AF$16*1<=$D$8,$R111<$D$8,$P111>SUM($V111:AE111)),IF(SUM($P111*$U111/12,$V111:AE111)>$P111,$P111-SUM($V111:AE111),$P111*$U111/12),0)","v":{"v":0,"d":"0.00"}},{"$f":"IF(AND(AG$16*1>=$R111,AG$16*1<=$D$8,$R111<$D$8,$P111>SUM($V111:AF111)),IF(SUM($P111*$U111/12,$V111:AF111)>$P111,$P111-SUM($V111:AF111),$P111*$U111/12),0)","v":{"v":0,"d":"0.00"}},{"$f":"IF(AND(AH$16*1>=$R111,AH$16*1<=$D$8,$R111<$D$8,$P111>SUM($V111:AG111)),IF(SUM($P111*$U111/12,$V111:AG111)>$P111,$P111-SUM($V111:AG111),$P111*$U111/12),0)","v":{"v":0,"d":"0.00"}},{"v":0,"d":"0.00"},null,null,{"v":4796.13,"d":"4,796.13"},null,{"v":4796.13,"d":"4,796.13"}]
[null,null,96,"336111","COMPUTADORA DELL",{"$nulls":3},4796.12,{"$nulls":4},4796.12,null,{"v":4796.12,"d":"4,796.12"},"2008-11-23","2008-12-01",null,null,{"v":0.25,"d":"25%"},{"v":4796.12,"d":"4,796.12"},{"$f":"IF(AND(W$16*1>=$R112,W$16*1<=$D$8,$R112<$D$8,$P112>SUM($V112:V112)),IF(SUM($P112*$U112/12,$V112:V112)>$P112,$P112-SUM($V112:V112),$P112*$U112/12),0)","v":{"v":0,"d":"0.00"}},{"$f":"IF(AND(X$16*1>=$R112,X$16*1<=$D$8,$R112<$D$8,$P112>SUM($V112:W112)),IF(SUM($P112*$U112/12,$V112:W112)>$P112,$P112-SUM($V112:W112),$P112*$U112/12),0)","v":{"v":0,"d":"0.00"}},{"$f":"IF(AND(Y$16*1>=$R112,Y$16*1<=$D$8,$R112<$D$8,$P112>SUM($V112:X112)),IF(SUM($P112*$U112/12,$V112:X112)>$P112,$P112-SUM($V112:X112),$P112*$U112/12),0)","v":{"v":0,"d":"0.00"}},{"$f":"IF(AND(Z$16*1>=$R112,Z$16*1<=$D$8,$R112<$D$8,$P112>SUM($V112:Y112)),IF(SUM($P112*$U112/12,$V112:Y112)>$P112,$P112-SUM($V112:Y112),$P112*$U112/12),0)","v":{"v":0,"d":"0.00"}},{"$f":"IF(AND(AA$16*1>=$R112,AA$16*1<=$D$8,$R112<$D$8,$P112>SUM($V112:Z112)),IF(SUM($P112*$U112/12,$V112:Z112)>$P112,$P112-SUM($V112:Z112),$P112*$U112/12),0)","v":{"v":0,"d":"0.00"}},{"$f":"IF(AND(AB$16*1>=$R112,AB$16*1<=$D$8,$R112<$D$8,$P112>SUM($V112:AA112)),IF(SUM($P112*$U112/12,$V112:AA112)>$P112,$P112-SUM($V112:AA112),$P112*$U112/12),0)","v":{"v":0,"d":"0.00"}},{"$f":"IF(AND(AC$16*1>=$R112,AC$16*1<=$D$8,$R112<$D$8,$P112>SUM($V112:AB112)),IF(SUM($P112*$U112/12,$V112:AB112)>$P112,$P112-SUM($V112:AB112),$P112*$U112/12),0)","v":{"v":0,"d":"0.00"}},{"$f":"IF(AND(AD$16*1>=$R112,AD$16*1<=$D$8,$R112<$D$8,$P112>SUM($V112:AC112)),IF(SUM($P112*$U112/12,$V112:AC112)>$P112,$P112-SUM($V112:AC112),$P112*$U112/12),0)","v":{"v":0,"d":"0.00"}},{"$f":"IF(AND(AE$16*1>=$R112,AE$16*1<=$D$8,$R112<$D$8,$P112>SUM($V112:AD112)),IF(SUM($P112*$U112/12,$V112:AD112)>$P112,$P112-SUM($V112:AD112),$P112*$U112/12),0)","v":{"v":0,"d":"0.00"}},{"$f":"IF(AND(AF$16*1>=$R112,AF$16*1<=$D$8,$R112<$D$8,$P112>SUM($V112:AE112)),IF(SUM($P112*$U112/12,$V112:AE112)>$P112,$P112-SUM($V112:AE112),$P112*$U112/12),0)","v":{"v":0,"d":"0.00"}},{"$f":"IF(AND(AG$16*1>=$R112,AG$16*1<=$D$8,$R112<$D$8,$P112>SUM($V112:AF112)),IF(SUM($P112*$U112/12,$V112:AF112)>$P112,$P112-SUM($V112:AF112),$P112*$U112/12),0)","v":{"v":0,"d":"0.00"}},{"$f":"IF(AND(AH$16*1>=$R112,AH$16*1<=$D$8,$R112<$D$8,$P112>SUM($V112:AG112)),IF(SUM($P112*$U112/12,$V112:AG112)>$P112,$P112-SUM($V112:AG112),$P112*$U112/12),0)","v":{"v":0,"d":"0.00"}},{"v":0,"d":"0.00"},null,null,{"v":4796.12,"d":"4,796.12"},null,{"v":4796.12,"d":"4,796.12"}]
[null,null,97,"336111","COMPUTADORA SERVIDOR DELL",{"$nulls":3},14988.52,{"$nulls":4},14988.52,null,{"v":14988.52,"d":"14,988.52"},"2008-11-23","2008-12-01",null,null,{"v":0.25,"d":"25%"},{"v":14988.52,"d":"14,988.52"},{"$f":"IF(AND(W$16*1>=$R113,W$16*1<=$D$8,$R113<$D$8,$P113>SUM($V113:V113)),IF(SUM($P113*$U113/12,$V113:V113)>$P113,$P113-SUM($V113:V113),$P113*$U113/12),0)","v":{"v":0,"d":"0.00"}},{"$f":"IF(AND(X$16*1>=$R113,X$16*1<=$D$8,$R113<$D$8,$P113>SUM($V113:W113)),IF(SUM($P113*$U113/12,$V113:W113)>$P113,$P113-SUM($V113:W113),$P113*$U113/12),0)","v":{"v":0,"d":"0.00"}},{"$f":"IF(AND(Y$16*1>=$R113,Y$16*1<=$D$8,$R113<$D$8,$P113>SUM($V113:X113)),IF(SUM($P113*$U113/12,$V113:X113)>$P113,$P113-SUM($V113:X113),$P113*$U113/12),0)","v":{"v":0,"d":"0.00"}},{"$f":"IF(AND(Z$16*1>=$R113,Z$16*1<=$D$8,$R113<$D$8,$P113>SUM($V113:Y113)),IF(SUM($P113*$U113/12,$V113:Y113)>$P113,$P113-SUM($V113:Y113),$P113*$U113/12),0)","v":{"v":0,"d":"0.00"}},{"$f":"IF(AND(AA$16*1>=$R113,AA$16*1<=$D$8,$R113<$D$8,$P113>SUM($V113:Z113)),IF(SUM($P113*$U113/12,$V113:Z113)>$P113,$P113-SUM($V113:Z113),$P113*$U113/12),0)","v":{"v":0,"d":"0.00"}},{"$f":"IF(AND(AB$16*1>=$R113,AB$16*1<=$D$8,$R113<$D$8,$P113>SUM($V113:AA113)),IF(SUM($P113*$U113/12,$V113:AA113)>$P113,$P113-SUM($V113:AA113),$P113*$U113/12),0)","v":{"v":0,"d":"0.00"}},{"$f":"IF(AND(AC$16*1>=$R113,AC$16*1<=$D$8,$R113<$D$8,$P113>SUM($V113:AB113)),IF(SUM($P113*$U113/12,$V113:AB113)>$P113,$P113-SUM($V113:AB113),$P113*$U113/12),0)","v":{"v":0,"d":"0.00"}},{"$f":"IF(AND(AD$16*1>=$R113,AD$16*1<=$D$8,$R113<$D$8,$P113>SUM($V113:AC113)),IF(SUM($P113*$U113/12,$V113:AC113)>$P113,$P113-SUM($V113:AC113),$P113*$U113/12),0)","v":{"v":0,"d":"0.00"}},{"$f":"IF(AND(AE$16*1>=$R113,AE$16*1<=$D$8,$R113<$D$8,$P113>SUM($V113:AD113)),IF(SUM($P113*$U113/12,$V113:AD113)>$P113,$P113-SUM($V113:AD113),$P113*$U113/12),0)","v":{"v":0,"d":"0.00"}},{"$f":"IF(AND(AF$16*1>=$R113,AF$16*1<=$D$8,$R113<$D$8,$P113>SUM($V113:AE113)),IF(SUM($P113*$U113/12,$V113:AE113)>$P113,$P113-SUM($V113:AE113),$P113*$U113/12),0)","v":{"v":0,"d":"0.00"}},{"$f":"IF(AND(AG$16*1>=$R113,AG$16*1<=$D$8,$R113<$D$8,$P113>SUM($V113:AF113)),IF(SUM($P113*$U113/12,$V113:AF113)>$P113,$P113-SUM($V113:AF113),$P113*$U113/12),0)","v":{"v":0,"d":"0.00"}},{"$f":"IF(AND(AH$16*1>=$R113,AH$16*1<=$D$8,$R113<$D$8,$P113>SUM($V113:AG113)),IF(SUM($P113*$U113/12,$V113:AG113)>$P113,$P113-SUM($V113:AG113),$P113*$U113/12),0)","v":{"v":0,"d":"0.00"}},{"v":0,"d":"0.00"},null,null,{"v":14988.52,"d":"14,988.52"},null,{"v":14988.52,"d":"14,988.52"}]
[null,null,98,"336111","DISCO DURO",{"$nulls":3},543.32,{"$nulls":4},543.32,null,543.32,"2010-12-22","2011-01-01",null,null,{"v":0.25,"d":"25%"},543.32,{"$f":"IF(AND(W$16*1>=$R114,W$16*1<=$D$8,$R114<$D$8,$P114>SUM($V114:V114)),IF(SUM($P114*$U114/12,$V114:V114)>$P114,$P114-SUM($V114:V114),$P114*$U114/12),0)","v":{"v":0,"d":"0.00"}},{"$f":"IF(AND(X$16*1>=$R114,X$16*1<=$D$8,$R114<$D$8,$P114>SUM($V114:W114)),IF(SUM($P114*$U114/12,$V114:W114)>$P114,$P114-SUM($V114:W114),$P114*$U114/12),0)","v":{"v":0,"d":"0.00"}},{"$f":"IF(AND(Y$16*1>=$R114,Y$16*1<=$D$8,$R114<$D$8,$P114>SUM($V114:X114)),IF(SUM($P114*$U114/12,$V114:X114)>$P114,$P114-SUM($V114:X114),$P114*$U114/12),0)","v":{"v":0,"d":"0.00"}},{"$f":"IF(AND(Z$16*1>=$R114,Z$16*1<=$D$8,$R114<$D$8,$P114>SUM($V114:Y114)),IF(SUM($P114*$U114/12,$V114:Y114)>$P114,$P114-SUM($V114:Y114),$P114*$U114/12),0)","v":{"v":0,"d":"0.00"}},{"$f":"IF(AND(AA$16*1>=$R114,AA$16*1<=$D$8,$R114<$D$8,$P114>SUM($V114:Z114)),IF(SUM($P114*$U114/12,$V114:Z114)>$P114,$P114-SUM($V114:Z114),$P114*$U114/12),0)","v":{"v":0,"d":"0.00"}},{"$f":"IF(AND(AB$16*1>=$R114,AB$16*1<=$D$8,$R114<$D$8,$P114>SUM($V114:AA114)),IF(SUM($P114*$U114/12,$V114:AA114)>$P114,$P114-SUM($V114:AA114),$P114*$U114/12),0)","v":{"v":0,"d":"0.00"}},{"$f":"IF(AND(AC$16*1>=$R114,AC$16*1<=$D$8,$R114<$D$8,$P114>SUM($V114:AB114)),IF(SUM($P114*$U114/12,$V114:AB114)>$P114,$P114-SUM($V114:AB114),$P114*$U114/12),0)","v":{"v":0,"d":"0.00"}},{"$f":"IF(AND(AD$16*1>=$R114,AD$16*1<=$D$8,$R114<$D$8,$P114>SUM($V114:AC114)),IF(SUM($P114*$U114/12,$V114:AC114)>$P114,$P114-SUM($V114:AC114),$P114*$U114/12),0)","v":{"v":0,"d":"0.00"}},{"$f":"IF(AND(AE$16*1>=$R114,AE$16*1<=$D$8,$R114<$D$8,$P114>SUM($V114:AD114)),IF(SUM($P114*$U114/12,$V114:AD114)>$P114,$P114-SUM($V114:AD114),$P114*$U114/12),0)","v":{"v":0,"d":"0.00"}},{"$f":"IF(AND(AF$16*1>=$R114,AF$16*1<=$D$8,$R114<$D$8,$P114>SUM($V114:AE114)),IF(SUM($P114*$U114/12,$V114:AE114)>$P114,$P114-SUM($V114:AE114),$P114*$U114/12),0)","v":{"v":0,"d":"0.00"}},{"$f":"IF(AND(AG$16*1>=$R114,AG$16*1<=$D$8,$R114<$D$8,$P114>SUM($V114:AF114)),IF(SUM($P114*$U114/12,$V114:AF114)>$P114,$P114-SUM($V114:AF114),$P114*$U114/12),0)","v":{"v":0,"d":"0.00"}},{"$f":"IF(AND(AH$16*1>=$R114,AH$16*1<=$D$8,$R114<$D$8,$P114>SUM($V114:AG114)),IF(SUM($P114*$U114/12,$V114:AG114)>$P114,$P114-SUM($V114:AG114),$P114*$U114/12),0)","v":{"v":0,"d":"0.00"}},{"v":0,"d":"0.00"},null,null,543.32,null,543.32]
[null,null,99,"336111","IMPRESORA LASER MARCA EPSON",{"$nulls":3},839.5,{"$nulls":4},839.5,null,{"v":839.5,"d":"839.50"},"2011-09-12","2011-10-01",null,null,{"v":0.25,"d":"25%"},{"v":839.5,"d":"839.50"},{"$f":"IF(AND(W$16*1>=$R115,W$16*1<=$D$8,$R115<$D$8,$P115>SUM($V115:V115)),IF(SUM($P115*$U115/12,$V115:V115)>$P115,$P115-SUM($V115:V115),$P115*$U115/12),0)","v":{"v":0,"d":"0.00"}},{"$f":"IF(AND(X$16*1>=$R115,X$16*1<=$D$8,$R115<$D$8,$P115>SUM($V115:W115)),IF(SUM($P115*$U115/12,$V115:W115)>$P115,$P115-SUM($V115:W115),$P115*$U115/12),0)","v":{"v":0,"d":"0.00"}},{"$f":"IF(AND(Y$16*1>=$R115,Y$16*1<=$D$8,$R115<$D$8,$P115>SUM($V115:X115)),IF(SUM($P115*$U115/12,$V115:X115)>$P115,$P115-SUM($V115:X115),$P115*$U115/12),0)","v":{"v":0,"d":"0.00"}},{"$f":"IF(AND(Z$16*1>=$R115,Z$16*1<=$D$8,$R115<$D$8,$P115>SUM($V115:Y115)),IF(SUM($P115*$U115/12,$V115:Y115)>$P115,$P115-SUM($V115:Y115),$P115*$U115/12),0)","v":{"v":0,"d":"0.00"}},{"$f":"IF(AND(AA$16*1>=$R115,AA$16*1<=$D$8,$R115<$D$8,$P115>SUM($V115:Z115)),IF(SUM($P115*$U115/12,$V115:Z115)>$P115,$P115-SUM($V115:Z115),$P115*$U115/12),0)","v":{"v":0,"d":"0.00"}},{"$f":"IF(AND(AB$16*1>=$R115,AB$16*1<=$D$8,$R115<$D$8,$P115>SUM($V115:AA115)),IF(SUM($P115*$U115/12,$V115:AA115)>$P115,$P115-SUM($V115:AA115),$P115*$U115/12),0)","v":{"v":0,"d":"0.00"}},{"$f":"IF(AND(AC$16*1>=$R115,AC$16*1<=$D$8,$R115<$D$8,$P115>SUM($V115:AB115)),IF(SUM($P115*$U115/12,$V115:AB115)>$P115,$P115-SUM($V115:AB115),$P115*$U115/12),0)","v":{"v":0,"d":"0.00"}},{"$f":"IF(AND(AD$16*1>=$R115,AD$16*1<=$D$8,$R115<$D$8,$P115>SUM($V115:AC115)),IF(SUM($P115*$U115/12,$V115:AC115)>$P115,$P115-SUM($V115:AC115),$P115*$U115/12),0)","v":{"v":0,"d":"0.00"}},{"$f":"IF(AND(AE$16*1>=$R115,AE$16*1<=$D$8,$R115<$D$8,$P115>SUM($V115:AD115)),IF(SUM($P115*$U115/12,$V115:AD115)>$P115,$P115-SUM($V115:AD115),$P115*$U115/12),0)","v":{"v":0,"d":"0.00"}},{"$f":"IF(AND(AF$16*1>=$R115,AF$16*1<=$D$8,$R115<$D$8,$P115>SUM($V115:AE115)),IF(SUM($P115*$U115/12,$V115:AE115)>$P115,$P115-SUM($V115:AE115),$P115*$U115/12),0)","v":{"v":0,"d":"0.00"}},{"$f":"IF(AND(AG$16*1>=$R115,AG$16*1<=$D$8,$R115<$D$8,$P115>SUM($V115:AF115)),IF(SUM($P115*$U115/12,$V115:AF115)>$P115,$P115-SUM($V115:AF115),$P115*$U115/12),0)","v":{"v":0,"d":"0.00"}},{"$f":"IF(AND(AH$16*1>=$R115,AH$16*1<=$D$8,$R115<$D$8,$P115>SUM($V115:AG115)),IF(SUM($P115*$U115/12,$V115:AG115)>$P115,$P115-SUM($V115:AG115),$P115*$U115/12),0)","v":{"v":0,"d":"0.00"}},{"v":0,"d":"0.00"},null,null,{"v":839.5,"d":"839.50"},null,{"v":839.5,"d":"839.50"}]
[null,null,100,"336111","MONITOR LCD 17\" MARCA LG",{"$nulls":3},755.46,{"$nulls":4},755.46,null,755.46,"2011-09-12","2011-10-01",null,null,{"v":0.25,"d":"25%"},755.46,{"$f":"IF(AND(W$16*1>=$R116,W$16*1<=$D$8,$R116<$D$8,$P116>SUM($V116:V116)),IF(SUM($P116*$U116/12,$V116:V116)>$P116,$P116-SUM($V116:V116),$P116*$U116/12),0)","v":{"v":0,"d":"0.00"}},{"$f":"IF(AND(X$16*1>=$R116,X$16*1<=$D$8,$R116<$D$8,$P116>SUM($V116:W116)),IF(SUM($P116*$U116/12,$V116:W116)>$P116,$P116-SUM($V116:W116),$P116*$U116/12),0)","v":{"v":0,"d":"0.00"}},{"$f":"IF(AND(Y$16*1>=$R116,Y$16*1<=$D$8,$R116<$D$8,$P116>SUM($V116:X116)),IF(SUM($P116*$U116/12,$V116:X116)>$P116,$P116-SUM($V116:X116),$P116*$U116/12),0)","v":{"v":0,"d":"0.00"}},{"$f":"IF(AND(Z$16*1>=$R116,Z$16*1<=$D$8,$R116<$D$8,$P116>SUM($V116:Y116)),IF(SUM($P116*$U116/12,$V116:Y116)>$P116,$P116-SUM($V116:Y116),$P116*$U116/12),0)","v":{"v":0,"d":"0.00"}},{"$f":"IF(AND(AA$16*1>=$R116,AA$16*1<=$D$8,$R116<$D$8,$P116>SUM($V116:Z116)),IF(SUM($P116*$U116/12,$V116:Z116)>$P116,$P116-SUM($V116:Z116),$P116*$U116/12),0)","v":{"v":0,"d":"0.00"}},{"$f":"IF(AND(AB$16*1>=$R116,AB$16*1<=$D$8,$R116<$D$8,$P116>SUM($V116:AA116)),IF(SUM($P116*$U116/12,$V116:AA116)>$P116,$P116-SUM($V116:AA116),$P116*$U116/12),0)","v":{"v":0,"d":"0.00"}},{"$f":"IF(AND(AC$16*1>=$R116,AC$16*1<=$D$8,$R116<$D$8,$P116>SUM($V116:AB116)),IF(SUM($P116*$U116/12,$V116:AB116)>$P116,$P116-SUM($V116:AB116),$P116*$U116/12),0)","v":{"v":0,"d":"0.00"}},{"$f":"IF(AND(AD$16*1>=$R116,AD$16*1<=$D$8,$R116<$D$8,$P116>SUM($V116:AC116)),IF(SUM($P116*$U116/12,$V116:AC116)>$P116,$P116-SUM($V116:AC116),$P116*$U116/12),0)","v":{"v":0,"d":"0.00"}},{"$f":"IF(AND(AE$16*1>=$R116,AE$16*1<=$D$8,$R116<$D$8,$P116>SUM($V116:AD116)),IF(SUM($P116*$U116/12,$V116:AD116)>$P116,$P116-SUM($V116:AD116),$P116*$U116/12),0)","v":{"v":0,"d":"0.00"}},{"$f":"IF(AND(AF$16*1>=$R116,AF$16*1<=$D$8,$R116<$D$8,$P116>SUM($V116:AE116)),IF(SUM($P116*$U116/12,$V116:AE116)>$P116,$P116-SUM($V116:AE116),$P116*$U116/12),0)","v":{"v":0,"d":"0.00"}},{"$f":"IF(AND(AG$16*1>=$R116,AG$16*1<=$D$8,$R116<$D$8,$P116>SUM($V116:AF116)),IF(SUM($P116*$U116/12,$V116:AF116)>$P116,$P116-SUM($V116:AF116),$P116*$U116/12),0)","v":{"v":0,"d":"0.00"}},{"$f":"IF(AND(AH$16*1>=$R116,AH$16*1<=$D$8,$R116<$D$8,$P116>SUM($V116:AG116)),IF(SUM($P116*$U116/12,$V116:AG116)>$P116,$P116-SUM($V116:AG116),$P116*$U116/12),0)","v":{"v":0,"d":"0.00"}},{"v":0,"d":"0.00"},null,null,755.46,null,755.46]
[null,null,101,"336111","COMPUTADORA COMPATIBLE (MG)",{"$nulls":3},1876.49,{"$nulls":4},1876.49,null,{"v":1876.49,"d":"1,876.49"},"2012-01-16","2012-02-01",null,null,{"v":0.25,"d":"25%"},{"v":1876.49,"d":"1,876.49"},{"$f":"IF(AND(W$16*1>=$R117,W$16*1<=$D$8,$R117<$D$8,$P117>SUM($V117:V117)),IF(SUM($P117*$U117/12,$V117:V117)>$P117,$P117-SUM($V117:V117),$P117*$U117/12),0)","v":{"v":0,"d":"0.00"}},{"$f":"IF(AND(X$16*1>=$R117,X$16*1<=$D$8,$R117<$D$8,$P117>SUM($V117:W117)),IF(SUM($P117*$U117/12,$V117:W117)>$P117,$P117-SUM($V117:W117),$P117*$U117/12),0)","v":{"v":0,"d":"0.00"}},{"$f":"IF(AND(Y$16*1>=$R117,Y$16*1<=$D$8,$R117<$D$8,$P117>SUM($V117:X117)),IF(SUM($P117*$U117/12,$V117:X117)>$P117,$P117-SUM($V117:X117),$P117*$U117/12),0)","v":{"v":0,"d":"0.00"}},{"$f":"IF(AND(Z$16*1>=$R117,Z$16*1<=$D$8,$R117<$D$8,$P117>SUM($V117:Y117)),IF(SUM($P117*$U117/12,$V117:Y117)>$P117,$P117-SUM($V117:Y117),$P117*$U117/12),0)","v":{"v":0,"d":"0.00"}},{"$f":"IF(AND(AA$16*1>=$R117,AA$16*1<=$D$8,$R117<$D$8,$P117>SUM($V117:Z117)),IF(SUM($P117*$U117/12,$V117:Z117)>$P117,$P117-SUM($V117:Z117),$P117*$U117/12),0)","v":{"v":0,"d":"0.00"}},{"$f":"IF(AND(AB$16*1>=$R117,AB$16*1<=$D$8,$R117<$D$8,$P117>SUM($V117:AA117)),IF(SUM($P117*$U117/12,$V117:AA117)>$P117,$P117-SUM($V117:AA117),$P117*$U117/12),0)","v":{"v":0,"d":"0.00"}},{"$f":"IF(AND(AC$16*1>=$R117,AC$16*1<=$D$8,$R117<$D$8,$P117>SUM($V117:AB117)),IF(SUM($P117*$U117/12,$V117:AB117)>$P117,$P117-SUM($V117:AB117),$P117*$U117/12),0)","v":{"v":0,"d":"0.00"}},{"$f":"IF(AND(AD$16*1>=$R117,AD$16*1<=$D$8,$R117<$D$8,$P117>SUM($V117:AC117)),IF(SUM($P117*$U117/12,$V117:AC117)>$P117,$P117-SUM($V117:AC117),$P117*$U117/12),0)","v":{"v":0,"d":"0.00"}},{"$f":"IF(AND(AE$16*1>=$R117,AE$16*1<=$D$8,$R117<$D$8,$P117>SUM($V117:AD117)),IF(SUM($P117*$U117/12,$V117:AD117)>$P117,$P117-SUM($V117:AD117),$P117*$U117/12),0)","v":{"v":0,"d":"0.00"}},{"$f":"IF(AND(AF$16*1>=$R117,AF$16*1<=$D$8,$R117<$D$8,$P117>SUM($V117:AE117)),IF(SUM($P117*$U117/12,$V117:AE117)>$P117,$P117-SUM($V117:AE117),$P117*$U117/12),0)","v":{"v":0,"d":"0.00"}},{"$f":"IF(AND(AG$16*1>=$R117,AG$16*1<=$D$8,$R117<$D$8,$P117>SUM($V117:AF117)),IF(SUM($P117*$U117/12,$V117:AF117)>$P117,$P117-SUM($V117:AF117),$P117*$U117/12),0)","v":{"v":0,"d":"0.00"}},{"$f":"IF(AND(AH$16*1>=$R117,AH$16*1<=$D$8,$R117<$D$8,$P117>SUM($V117:AG117)),IF(SUM($P117*$U117/12,$V117:AG117)>$P117,$P117-SUM($V117:AG117),$P117*$U117/12),0)","v":{"v":0,"d":"0.00"}},{"v":0,"d":"0.00"},null,null,{"v":1876.49,"d":"1,876.49"},null,{"v":1876.49,"d":"1,876.49"}]
[null,null,102,"336111","IMPRESORA MARCA LEXMARK (CF)",{"$nulls":3},200.84,{"$nulls":4},200.84,null,200.84,"2012-01-21","2012-02-01",null,null,{"v":0.25,"d":"25%"},200.84,{"$f":"IF(AND(W$16*1>=$R118,W$16*1<=$D$8,$R118<$D$8,$P118>SUM($V118:V118)),IF(SUM($P118*$U118/12,$V118:V118)>$P118,$P118-SUM($V118:V118),$P118*$U118/12),0)","v":{"v":0,"d":"0.00"}},{"$f":"IF(AND(X$16*1>=$R118,X$16*1<=$D$8,$R118<$D$8,$P118>SUM($V118:W118)),IF(SUM($P118*$U118/12,$V118:W118)>$P118,$P118-SUM($V118:W118),$P118*$U118/12),0)","v":{"v":0,"d":"0.00"}},{"$f":"IF(AND(Y$16*1>=$R118,Y$16*1<=$D$8,$R118<$D$8,$P118>SUM($V118:X118)),IF(SUM($P118*$U118/12,$V118:X118)>$P118,$P118-SUM($V118:X118),$P118*$U118/12),0)","v":{"v":0,"d":"0.00"}},{"$f":"IF(AND(Z$16*1>=$R118,Z$16*1<=$D$8,$R118<$D$8,$P118>SUM($V118:Y118)),IF(SUM($P118*$U118/12,$V118:Y118)>$P118,$P118-SUM($V118:Y118),$P118*$U118/12),0)","v":{"v":0,"d":"0.00"}},{"$f":"IF(AND(AA$16*1>=$R118,AA$16*1<=$D$8,$R118<$D$8,$P118>SUM($V118:Z118)),IF(SUM($P118*$U118/12,$V118:Z118)>$P118,$P118-SUM($V118:Z118),$P118*$U118/12),0)","v":{"v":0,"d":"0.00"}},{"$f":"IF(AND(AB$16*1>=$R118,AB$16*1<=$D$8,$R118<$D$8,$P118>SUM($V118:AA118)),IF(SUM($P118*$U118/12,$V118:AA118)>$P118,$P118-SUM($V118:AA118),$P118*$U118/12),0)","v":{"v":0,"d":"0.00"}},{"$f":"IF(AND(AC$16*1>=$R118,AC$16*1<=$D$8,$R118<$D$8,$P118>SUM($V118:AB118)),IF(SUM($P118*$U118/12,$V118:AB118)>$P118,$P118-SUM($V118:AB118),$P118*$U118/12),0)","v":{"v":0,"d":"0.00"}},{"$f":"IF(AND(AD$16*1>=$R118,AD$16*1<=$D$8,$R118<$D$8,$P118>SUM($V118:AC118)),IF(SUM($P118*$U118/12,$V118:AC118)>$P118,$P118-SUM($V118:AC118),$P118*$U118/12),0)","v":{"v":0,"d":"0.00"}},{"$f":"IF(AND(AE$16*1>=$R118,AE$16*1<=$D$8,$R118<$D$8,$P118>SUM($V118:AD118)),IF(SUM($P118*$U118/12,$V118:AD118)>$P118,$P118-SUM($V118:AD118),$P118*$U118/12),0)","v":{"v":0,"d":"0.00"}},{"$f":"IF(AND(AF$16*1>=$R118,AF$16*1<=$D$8,$R118<$D$8,$P118>SUM($V118:AE118)),IF(SUM($P118*$U118/12,$V118:AE118)>$P118,$P118-SUM($V118:AE118),$P118*$U118/12),0)","v":{"v":0,"d":"0.00"}},{"$f":"IF(AND(AG$16*1>=$R118,AG$16*1<=$D$8,$R118<$D$8,$P118>SUM($V118:AF118)),IF(SUM($P118*$U118/12,$V118:AF118)>$P118,$P118-SUM($V118:AF118),$P118*$U118/12),0)","v":{"v":0,"d":"0.00"}},{"$f":"IF(AND(AH$16*1>=$R118,AH$16*1<=$D$8,$R118<$D$8,$P118>SUM($V118:AG118)),IF(SUM($P118*$U118/12,$V118:AG118)>$P118,$P118-SUM($V118:AG118),$P118*$U118/12),0)","v":{"v":0,"d":"0.00"}},{"v":0,"d":"0.00"},null,null,200.84,null,200.84]
[null,null,103,"336111","COMPUT.NOTEBOOK LENOVO (CF)",{"$nulls":3},5368.04,{"$nulls":4},5368.04,null,{"v":5368.04,"d":"5,368.04"},"2012-08-26","2012-09-01",null,null,{"v":0.25,"d":"25%"},{"v":5368.04,"d":"5,368.04"},{"$f":"IF(AND(W$16*1>=$R119,W$16*1<=$D$8,$R119<$D$8,$P119>SUM($V119:V119)),IF(SUM($P119*$U119/12,$V119:V119)>$P119,$P119-SUM($V119:V119),$P119*$U119/12),0)","v":{"v":0,"d":"0.00"}},{"$f":"IF(AND(X$16*1>=$R119,X$16*1<=$D$8,$R119<$D$8,$P119>SUM($V119:W119)),IF(SUM($P119*$U119/12,$V119:W119)>$P119,$P119-SUM($V119:W119),$P119*$U119/12),0)","v":{"v":0,"d":"0.00"}},{"$f":"IF(AND(Y$16*1>=$R119,Y$16*1<=$D$8,$R119<$D$8,$P119>SUM($V119:X119)),IF(SUM($P119*$U119/12,$V119:X119)>$P119,$P119-SUM($V119:X119),$P119*$U119/12),0)","v":{"v":0,"d":"0.00"}},{"$f":"IF(AND(Z$16*1>=$R119,Z$16*1<=$D$8,$R119<$D$8,$P119>SUM($V119:Y119)),IF(SUM($P119*$U119/12,$V119:Y119)>$P119,$P119-SUM($V119:Y119),$P119*$U119/12),0)","v":{"v":0,"d":"0.00"}},{"$f":"IF(AND(AA$16*1>=$R119,AA$16*1<=$D$8,$R119<$D$8,$P119>SUM($V119:Z119)),IF(SUM($P119*$U119/12,$V119:Z119)>$P119,$P119-SUM($V119:Z119),$P119*$U119/12),0)","v":{"v":0,"d":"0.00"}},{"$f":"IF(AND(AB$16*1>=$R119,AB$16*1<=$D$8,$R119<$D$8,$P119>SUM($V119:AA119)),IF(SUM($P119*$U119/12,$V119:AA119)>$P119,$P119-SUM($V119:AA119),$P119*$U119/12),0)","v":{"v":0,"d":"0.00"}},{"$f":"IF(AND(AC$16*1>=$R119,AC$16*1<=$D$8,$R119<$D$8,$P119>SUM($V119:AB119)),IF(SUM($P119*$U119/12,$V119:AB119)>$P119,$P119-SUM($V119:AB119),$P119*$U119/12),0)","v":{"v":0,"d":"0.00"}},{"$f":"IF(AND(AD$16*1>=$R119,AD$16*1<=$D$8,$R119<$D$8,$P119>SUM($V119:AC119)),IF(SUM($P119*$U119/12,$V119:AC119)>$P119,$P119-SUM($V119:AC119),$P119*$U119/12),0)","v":{"v":0,"d":"0.00"}},{"$f":"IF(AND(AE$16*1>=$R119,AE$16*1<=$D$8,$R119<$D$8,$P119>SUM($V119:AD119)),IF(SUM($P119*$U119/12,$V119:AD119)>$P119,$P119-SUM($V119:AD119),$P119*$U119/12),0)","v":{"v":0,"d":"0.00"}},{"$f":"IF(AND(AF$16*1>=$R119,AF$16*1<=$D$8,$R119<$D$8,$P119>SUM($V119:AE119)),IF(SUM($P119*$U119/12,$V119:AE119)>$P119,$P119-SUM($V119:AE119),$P119*$U119/12),0)","v":{"v":0,"d":"0.00"}},{"$f":"IF(AND(AG$16*1>=$R119,AG$16*1<=$D$8,$R119<$D$8,$P119>SUM($V119:AF119)),IF(SUM($P119*$U119/12,$V119:AF119)>$P119,$P119-SUM($V119:AF119),$P119*$U119/12),0)","v":{"v":0,"d":"0.00"}},{"$f":"IF(AND(AH$16*1>=$R119,AH$16*1<=$D$8,$R119<$D$8,$P119>SUM($V119:AG119)),IF(SUM($P119*$U119/12,$V119:AG119)>$P119,$P119-SUM($V119:AG119),$P119*$U119/12),0)","v":{"v":0,"d":"0.00"}},{"v":0,"d":"0.00"},null,null,{"v":5368.04,"d":"5,368.04"},null,{"v":5368.04,"d":"5,368.04"}]
[null,null,104,"336111","IMPRESORA XEROX PHASER 6110N (MG)",{"$nulls":3},1041.25,{"$nulls":4},1041.25,null,{"v":1041.25,"d":"1,041.25"},"2012-12-18","2013-01-01",null,null,{"v":0.25,"d":"25%"},{"v":1041.25,"d":"1,041.25"},{"$f":"IF(AND(W$16*1>=$R120,W$16*1<=$D$8,$R120<$D$8,$P120>SUM($V120:V120)),IF(SUM($P120*$U120/12,$V120:V120)>$P120,$P120-SUM($V120:V120),$P120*$U120/12),0)","v":{"v":0,"d":"0.00"}},{"$f":"IF(AND(X$16*1>=$R120,X$16*1<=$D$8,$R120<$D$8,$P120>SUM($V120:W120)),IF(SUM($P120*$U120/12,$V120:W120)>$P120,$P120-SUM($V120:W120),$P120*$U120/12),0)","v":{"v":0,"d":"0.00"}},{"$f":"IF(AND(Y$16*1>=$R120,Y$16*1<=$D$8,$R120<$D$8,$P120>SUM($V120:X120)),IF(SUM($P120*$U120/12,$V120:X120)>$P120,$P120-SUM($V120:X120),$P120*$U120/12),0)","v":{"v":0,"d":"0.00"}},{"$f":"IF(AND(Z$16*1>=$R120,Z$16*1<=$D$8,$R120<$D$8,$P120>SUM($V120:Y120)),IF(SUM($P120*$U120/12,$V120:Y120)>$P120,$P120-SUM($V120:Y120),$P120*$U120/12),0)","v":{"v":0,"d":"0.00"}},{"$f":"IF(AND(AA$16*1>=$R120,AA$16*1<=$D$8,$R120<$D$8,$P120>SUM($V120:Z120)),IF(SUM($P120*$U120/12,$V120:Z120)>$P120,$P120-SUM($V120:Z120),$P120*$U120/12),0)","v":{"v":0,"d":"0.00"}},{"$f":"IF(AND(AB$16*1>=$R120,AB$16*1<=$D$8,$R120<$D$8,$P120>SUM($V120:AA120)),IF(SUM($P120*$U120/12,$V120:AA120)>$P120,$P120-SUM($V120:AA120),$P120*$U120/12),0)","v":{"v":0,"d":"0.00"}},{"$f":"IF(AND(AC$16*1>=$R120,AC$16*1<=$D$8,$R120<$D$8,$P120>SUM($V120:AB120)),IF(SUM($P120*$U120/12,$V120:AB120)>$P120,$P120-SUM($V120:AB120),$P120*$U120/12),0)","v":{"v":0,"d":"0.00"}},{"$f":"IF(AND(AD$16*1>=$R120,AD$16*1<=$D$8,$R120<$D$8,$P120>SUM($V120:AC120)),IF(SUM($P120*$U120/12,$V120:AC120)>$P120,$P120-SUM($V120:AC120),$P120*$U120/12),0)","v":{"v":0,"d":"0.00"}},{"$f":"IF(AND(AE$16*1>=$R120,AE$16*1<=$D$8,$R120<$D$8,$P120>SUM($V120:AD120)),IF(SUM($P120*$U120/12,$V120:AD120)>$P120,$P120-SUM($V120:AD120),$P120*$U120/12),0)","v":{"v":0,"d":"0.00"}},{"$f":"IF(AND(AF$16*1>=$R120,AF$16*1<=$D$8,$R120<$D$8,$P120>SUM($V120:AE120)),IF(SUM($P120*$U120/12,$V120:AE120)>$P120,$P120-SUM($V120:AE120),$P120*$U120/12),0)","v":{"v":0,"d":"0.00"}},{"$f":"IF(AND(AG$16*1>=$R120,AG$16*1<=$D$8,$R120<$D$8,$P120>SUM($V120:AF120)),IF(SUM($P120*$U120/12,$V120:AF120)>$P120,$P120-SUM($V120:AF120),$P120*$U120/12),0)","v":{"v":0,"d":"0.00"}},{"$f":"IF(AND(AH$16*1>=$R120,AH$16*1<=$D$8,$R120<$D$8,$P120>SUM($V120:AG120)),IF(SUM($P120*$U120/12,$V120:AG120)>$P120,$P120-SUM($V120:AG120),$P120*$U120/12),0)","v":{"v":0,"d":"0.00"}},{"v":0,"d":"0.00"},null,null,{"v":1041.25,"d":"1,041.25"},null,{"v":1041.25,"d":"1,041.25"}]
[null,null,105,"336111","IMPRESORA MULTIFUNCIONAL HP(Recepc.)",{"$nulls":3},489.92,{"$nulls":4},489.92,null,489.92,"2013-04-02","2013-05-01",null,null,{"v":0.25,"d":"25%"},489.92,{"$f":"IF(AND(W$16*1>=$R121,W$16*1<=$D$8,$R121<$D$8,$P121>SUM($V121:V121)),IF(SUM($P121*$U121/12,$V121:V121)>$P121,$P121-SUM($V121:V121),$P121*$U121/12),0)","v":{"v":0,"d":"0.00"}},{"$f":"IF(AND(X$16*1>=$R121,X$16*1<=$D$8,$R121<$D$8,$P121>SUM($V121:W121)),IF(SUM($P121*$U121/12,$V121:W121)>$P121,$P121-SUM($V121:W121),$P121*$U121/12),0)","v":{"v":0,"d":"0.00"}},{"$f":"IF(AND(Y$16*1>=$R121,Y$16*1<=$D$8,$R121<$D$8,$P121>SUM($V121:X121)),IF(SUM($P121*$U121/12,$V121:X121)>$P121,$P121-SUM($V121:X121),$P121*$U121/12),0)","v":{"v":0,"d":"0.00"}},{"$f":"IF(AND(Z$16*1>=$R121,Z$16*1<=$D$8,$R121<$D$8,$P121>SUM($V121:Y121)),IF(SUM($P121*$U121/12,$V121:Y121)>$P121,$P121-SUM($V121:Y121),$P121*$U121/12),0)","v":{"v":0,"d":"0.00"}},{"$f":"IF(AND(AA$16*1>=$R121,AA$16*1<=$D$8,$R121<$D$8,$P121>SUM($V121:Z121)),IF(SUM($P121*$U121/12,$V121:Z121)>$P121,$P121-SUM($V121:Z121),$P121*$U121/12),0)","v":{"v":0,"d":"0.00"}},{"$f":"IF(AND(AB$16*1>=$R121,AB$16*1<=$D$8,$R121<$D$8,$P121>SUM($V121:AA121)),IF(SUM($P121*$U121/12,$V121:AA121)>$P121,$P121-SUM($V121:AA121),$P121*$U121/12),0)","v":{"v":0,"d":"0.00"}},{"$f":"IF(AND(AC$16*1>=$R121,AC$16*1<=$D$8,$R121<$D$8,$P121>SUM($V121:AB121)),IF(SUM($P121*$U121/12,$V121:AB121)>$P121,$P121-SUM($V121:AB121),$P121*$U121/12),0)","v":{"v":0,"d":"0.00"}},{"$f":"IF(AND(AD$16*1>=$R121,AD$16*1<=$D$8,$R121<$D$8,$P121>SUM($V121:AC121)),IF(SUM($P121*$U121/12,$V121:AC121)>$P121,$P121-SUM($V121:AC121),$P121*$U121/12),0)","v":{"v":0,"d":"0.00"}},{"$f":"IF(AND(AE$16*1>=$R121,AE$16*1<=$D$8,$R121<$D$8,$P121>SUM($V121:AD121)),IF(SUM($P121*$U121/12,$V121:AD121)>$P121,$P121-SUM($V121:AD121),$P121*$U121/12),0)","v":{"v":0,"d":"0.00"}},{"$f":"IF(AND(AF$16*1>=$R121,AF$16*1<=$D$8,$R121<$D$8,$P121>SUM($V121:AE121)),IF(SUM($P121*$U121/12,$V121:AE121)>$P121,$P121-SUM($V121:AE121),$P121*$U121/12),0)","v":{"v":0,"d":"0.00"}},{"$f":"IF(AND(AG$16*1>=$R121,AG$16*1<=$D$8,$R121<$D$8,$P121>SUM($V121:AF121)),IF(SUM($P121*$U121/12,$V121:AF121)>$P121,$P121-SUM($V121:AF121),$P121*$U121/12),0)","v":{"v":0,"d":"0.00"}},{"$f":"IF(AND(AH$16*1>=$R121,AH$16*1<=$D$8,$R121<$D$8,$P121>SUM($V121:AG121)),IF(SUM($P121*$U121/12,$V121:AG121)>$P121,$P121-SUM($V121:AG121),$P121*$U121/12),0)","v":{"v":0,"d":"0.00"}},{"v":0,"d":"0.00"},null,null,489.92,null,489.92]
[null,null,106,"336111","CPU PROCESADOR INTEL, 2 GBH",{"$nulls":3},1254.2,{"$nulls":4},1254.2,null,{"v":1254.2,"d":"1,254.20"},"2013-10-02","2013-11-01",null,null,{"v":0.25,"d":"25%"},{"v":1254.2,"d":"1,254.20"},{"$f":"IF(AND(W$16*1>=$R122,W$16*1<=$D$8,$R122<$D$8,$P122>SUM($V122:V122)),IF(SUM($P122*$U122/12,$V122:V122)>$P122,$P122-SUM($V122:V122),$P122*$U122/12),0)","v":{"v":0,"d":"0.00"}},{"$f":"IF(AND(X$16*1>=$R122,X$16*1<=$D$8,$R122<$D$8,$P122>SUM($V122:W122)),IF(SUM($P122*$U122/12,$V122:W122)>$P122,$P122-SUM($V122:W122),$P122*$U122/12),0)","v":{"v":0,"d":"0.00"}},{"$f":"IF(AND(Y$16*1>=$R122,Y$16*1<=$D$8,$R122<$D$8,$P122>SUM($V122:X122)),IF(SUM($P122*$U122/12,$V122:X122)>$P122,$P122-SUM($V122:X122),$P122*$U122/12),0)","v":{"v":0,"d":"0.00"}},{"$f":"IF(AND(Z$16*1>=$R122,Z$16*1<=$D$8,$R122<$D$8,$P122>SUM($V122:Y122)),IF(SUM($P122*$U122/12,$V122:Y122)>$P122,$P122-SUM($V122:Y122),$P122*$U122/12),0)","v":{"v":0,"d":"0.00"}},{"$f":"IF(AND(AA$16*1>=$R122,AA$16*1<=$D$8,$R122<$D$8,$P122>SUM($V122:Z122)),IF(SUM($P122*$U122/12,$V122:Z122)>$P122,$P122-SUM($V122:Z122),$P122*$U122/12),0)","v":{"v":0,"d":"0.00"}},{"$f":"IF(AND(AB$16*1>=$R122,AB$16*1<=$D$8,$R122<$D$8,$P122>SUM($V122:AA122)),IF(SUM($P122*$U122/12,$V122:AA122)>$P122,$P122-SUM($V122:AA122),$P122*$U122/12),0)","v":{"v":0,"d":"0.00"}},{"$f":"IF(AND(AC$16*1>=$R122,AC$16*1<=$D$8,$R122<$D$8,$P122>SUM($V122:AB122)),IF(SUM($P122*$U122/12,$V122:AB122)>$P122,$P122-SUM($V122:AB122),$P122*$U122/12),0)","v":{"v":0,"d":"0.00"}},{"$f":"IF(AND(AD$16*1>=$R122,AD$16*1<=$D$8,$R122<$D$8,$P122>SUM($V122:AC122)),IF(SUM($P122*$U122/12,$V122:AC122)>$P122,$P122-SUM($V122:AC122),$P122*$U122/12),0)","v":{"v":0,"d":"0.00"}},{"$f":"IF(AND(AE$16*1>=$R122,AE$16*1<=$D$8,$R122<$D$8,$P122>SUM($V122:AD122)),IF(SUM($P122*$U122/12,$V122:AD122)>$P122,$P122-SUM($V122:AD122),$P122*$U122/12),0)","v":{"v":0,"d":"0.00"}},{"$f":"IF(AND(AF$16*1>=$R122,AF$16*1<=$D$8,$R122<$D$8,$P122>SUM($V122:AE122)),IF(SUM($P122*$U122/12,$V122:AE122)>$P122,$P122-SUM($V122:AE122),$P122*$U122/12),0)","v":{"v":0,"d":"0.00"}},{"$f":"IF(AND(AG$16*1>=$R122,AG$16*1<=$D$8,$R122<$D$8,$P122>SUM($V122:AF122)),IF(SUM($P122*$U122/12,$V122:AF122)>$P122,$P122-SUM($V122:AF122),$P122*$U122/12),0)","v":{"v":0,"d":"0.00"}},{"$f":"IF(AND(AH$16*1>=$R122,AH$16*1<=$D$8,$R122<$D$8,$P122>SUM($V122:AG122)),IF(SUM($P122*$U122/12,$V122:AG122)>$P122,$P122-SUM($V122:AG122),$P122*$U122/12),0)","v":{"v":0,"d":"0.00"}},{"v":0,"d":"0.00"},null,null,{"v":1254.2,"d":"1,254.20"},null,{"v":1254.2,"d":"1,254.20"}]
[null,null,107,"336111","CPU INTEL CORE (DR)",{"$nulls":3},1186.73,{"$nulls":4},1186.73,null,{"v":1186.73,"d":"1,186.73"},"2015-02-11","2015-03-01",null,null,{"v":0.25,"d":"25%"},{"v":1137.28,"d":"1,137.28"},{"$f":"IF(AND(W$16*1>=$R123,W$16*1<=$D$8,$R123<$D$8,$P123>SUM($V123:V123)),IF(SUM($P123*$U123/12,$V123:V123)>$P123,$P123-SUM($V123:V123),$P123*$U123/12),0)","v":{"v":24.723541666666666,"d":"24.72"}},{"$f":"IF(AND(X$16*1>=$R123,X$16*1<=$D$8,$R123<$D$8,$P123>SUM($V123:W123)),IF(SUM($P123*$U123/12,$V123:W123)>$P123,$P123-SUM($V123:W123),$P123*$U123/12),0)","v":{"v":24.723541666666666,"d":"24.72"}},{"$f":"IF(AND(Y$16*1>=$R123,Y$16*1<=$D$8,$R123<$D$8,$P123>SUM($V123:X123)),IF(SUM($P123*$U123/12,$V123:X123)>$P123,$P123-SUM($V123:X123),$P123*$U123/12),0)","v":{"v":0.002916666666578749,"d":"0.00"}},{"$f":"IF(AND(Z$16*1>=$R123,Z$16*1<=$D$8,$R123<$D$8,$P123>SUM($V123:Y123)),IF(SUM($P123*$U123/12,$V123:Y123)>$P123,$P123-SUM($V123:Y123),$P123*$U123/12),0)","v":{"v":0,"d":"0.00"}},{"$f":"IF(AND(AA$16*1>=$R123,AA$16*1<=$D$8,$R123<$D$8,$P123>SUM($V123:Z123)),IF(SUM($P123*$U123/12,$V123:Z123)>$P123,$P123-SUM($V123:Z123),$P123*$U123/12),0)","v":{"v":0,"d":"0.00"}},{"$f":"IF(AND(AB$16*1>=$R123,AB$16*1<=$D$8,$R123<$D$8,$P123>SUM($V123:AA123)),IF(SUM($P123*$U123/12,$V123:AA123)>$P123,$P123-SUM($V123:AA123),$P123*$U123/12),0)","v":{"v":0,"d":"0.00"}},{"$f":"IF(AND(AC$16*1>=$R123,AC$16*1<=$D$8,$R123<$D$8,$P123>SUM($V123:AB123)),IF(SUM($P123*$U123/12,$V123:AB123)>$P123,$P123-SUM($V123:AB123),$P123*$U123/12),0)","v":{"v":0,"d":"0.00"}},{"$f":"IF(AND(AD$16*1>=$R123,AD$16*1<=$D$8,$R123<$D$8,$P123>SUM($V123:AC123)),IF(SUM($P123*$U123/12,$V123:AC123)>$P123,$P123-SUM($V123:AC123),$P123*$U123/12),0)","v":{"v":0,"d":"0.00"}},{"$f":"IF(AND(AE$16*1>=$R123,AE$16*1<=$D$8,$R123<$D$8,$P123>SUM($V123:AD123)),IF(SUM($P123*$U123/12,$V123:AD123)>$P123,$P123-SUM($V123:AD123),$P123*$U123/12),0)","v":{"v":0,"d":"0.00"}},{"$f":"IF(AND(AF$16*1>=$R123,AF$16*1<=$D$8,$R123<$D$8,$P123>SUM($V123:AE123)),IF(SUM($P123*$U123/12,$V123:AE123)>$P123,$P123-SUM($V123:AE123),$P123*$U123/12),0)","v":{"v":0,"d":"0.00"}},{"$f":"IF(AND(AG$16*1>=$R123,AG$16*1<=$D$8,$R123<$D$8,$P123>SUM($V123:AF123)),IF(SUM($P123*$U123/12,$V123:AF123)>$P123,$P123-SUM($V123:AF123),$P123*$U123/12),0)","v":{"v":0,"d":"0.00"}},{"$f":"IF(AND(AH$16*1>=$R123,AH$16*1<=$D$8,$R123<$D$8,$P123>SUM($V123:AG123)),IF(SUM($P123*$U123/12,$V123:AG123)>$P123,$P123-SUM($V123:AG123),$P123*$U123/12),0)","v":{"v":0,"d":"0.00"}},{"v":49.44999999999991,"d":"49.45"},null,null,{"v":1186.7299999999998,"d":"1,186.73"},null,{"v":1186.7299999999998,"d":"1,186.73"}]
[null,null,108,"336111","CPU INTEL CORE (CF)",{"$nulls":3},1268.89,{"$nulls":4},1268.89,null,{"v":1268.89,"d":"1,268.89"},"2015-06-06","2015-07-01",null,null,{"v":0.25,"d":"25%"},{"v":1110.27,"d":"1,110.27"},{"$f":"IF(AND(W$16*1>=$R124,W$16*1<=$D$8,$R124<$D$8,$P124>SUM($V124:V124)),IF(SUM($P124*$U124/12,$V124:V124)>$P124,$P124-SUM($V124:V124),$P124*$U124/12),0)","v":{"v":26.435208333333335,"d":"26.44"}},{"$f":"IF(AND(X$16*1>=$R124,X$16*1<=$D$8,$R124<$D$8,$P124>SUM($V124:W124)),IF(SUM($P124*$U124/12,$V124:W124)>$P124,$P124-SUM($V124:W124),$P124*$U124/12),0)","v":{"v":26.435208333333335,"d":"26.44"}},{"$f":"IF(AND(Y$16*1>=$R124,Y$16*1<=$D$8,$R124<$D$8,$P124>SUM($V124:X124)),IF(SUM($P124*$U124/12,$V124:X124)>$P124,$P124-SUM($V124:X124),$P124*$U124/12),0)","v":{"v":26.435208333333335,"d":"26.44"}},{"$f":"IF(AND(Z$16*1>=$R124,Z$16*1<=$D$8,$R124<$D$8,$P124>SUM($V124:Y124)),IF(SUM($P124*$U124/12,$V124:Y124)>$P124,$P124-SUM($V124:Y124),$P124*$U124/12),0)","v":{"v":26.435208333333335,"d":"26.44"}},{"$f":"IF(AND(AA$16*1>=$R124,AA$16*1<=$D$8,$R124<$D$8,$P124>SUM($V124:Z124)),IF(SUM($P124*$U124/12,$V124:Z124)>$P124,$P124-SUM($V124:Z124),$P124*$U124/12),0)","v":{"v":26.435208333333335,"d":"26.44"}},{"$f":"IF(AND(AB$16*1>=$R124,AB$16*1<=$D$8,$R124<$D$8,$P124>SUM($V124:AA124)),IF(SUM($P124*$U124/12,$V124:AA124)>$P124,$P124-SUM($V124:AA124),$P124*$U124/12),0)","v":{"v":0,"d":"0.00"}},{"$f":"IF(AND(AC$16*1>=$R124,AC$16*1<=$D$8,$R124<$D$8,$P124>SUM($V124:AB124)),IF(SUM($P124*$U124/12,$V124:AB124)>$P124,$P124-SUM($V124:AB124),$P124*$U124/12),0)","v":{"v":0,"d":"0.00"}},{"$f":"IF(AND(AD$16*1>=$R124,AD$16*1<=$D$8,$R124<$D$8,$P124>SUM($V124:AC124)),IF(SUM($P124*$U124/12,$V124:AC124)>$P124,$P124-SUM($V124:AC124),$P124*$U124/12),0)","v":{"v":0,"d":"0.00"}},{"$f":"IF(AND(AE$16*1>=$R124,AE$16*1<=$D$8,$R124<$D$8,$P124>SUM($V124:AD124)),IF(SUM($P124*$U124/12,$V124:AD124)>$P124,$P124-SUM($V124:AD124),$P124*$U124/12),0)","v":{"v":0,"d":"0.00"}},{"$f":"IF(AND(AF$16*1>=$R124,AF$16*1<=$D$8,$R124<$D$8,$P124>SUM($V124:AE124)),IF(SUM($P124*$U124/12,$V124:AE124)>$P124,$P124-SUM($V124:AE124),$P124*$U124/12),0)","v":{"v":0,"d":"0.00"}},{"$f":"IF(AND(AG$16*1>=$R124,AG$16*1<=$D$8,$R124<$D$8,$P124>SUM($V124:AF124)),IF(SUM($P124*$U124/12,$V124:AF124)>$P124,$P124-SUM($V124:AF124),$P124*$U124/12),0)","v":{"v":0,"d":"0.00"}},{"$f":"IF(AND(AH$16*1>=$R124,AH$16*1<=$D$8,$R124<$D$8,$P124>SUM($V124:AG124)),IF(SUM($P124*$U124/12,$V124:AG124)>$P124,$P124-SUM($V124:AG124),$P124*$U124/12),0)","v":{"v":0,"d":"0.00"}},{"v":132.17604166666666,"d":"132.18"},null,null,{"v":1189.575625,"d":"1,189.58"},null,{"v":1189.575625,"d":"1,189.58"}]
[null,null,109,"336111","CPU INTEL CORE (MCH)",{"$nulls":3},1268.86,{"$nulls":4},1268.86,null,{"v":1268.86,"d":"1,268.86"},"2015-06-06","2015-07-01",null,null,{"v":0.25,"d":"25%"},{"v":1110.27,"d":"1,110.27"},{"$f":"IF(AND(W$16*1>=$R125,W$16*1<=$D$8,$R125<$D$8,$P125>SUM($V125:V125)),IF(SUM($P125*$U125/12,$V125:V125)>$P125,$P125-SUM($V125:V125),$P125*$U125/12),0)","v":{"v":26.434583333333332,"d":"26.43"}},{"$f":"IF(AND(X$16*1>=$R125,X$16*1<=$D$8,$R125<$D$8,$P125>SUM($V125:W125)),IF(SUM($P125*$U125/12,$V125:W125)>$P125,$P125-SUM($V125:W125),$P125*$U125/12),0)","v":{"v":26.434583333333332,"d":"26.43"}},{"$f":"IF(AND(Y$16*1>=$R125,Y$16*1<=$D$8,$R125<$D$8,$P125>SUM($V125:X125)),IF(SUM($P125*$U125/12,$V125:X125)>$P125,$P125-SUM($V125:X125),$P125*$U125/12),0)","v":{"v":26.434583333333332,"d":"26.43"}},{"$f":"IF(AND(Z$16*1>=$R125,Z$16*1<=$D$8,$R125<$D$8,$P125>SUM($V125:Y125)),IF(SUM($P125*$U125/12,$V125:Y125)>$P125,$P125-SUM($V125:Y125),$P125*$U125/12),0)","v":{"v":26.434583333333332,"d":"26.43"}},{"$f":"IF(AND(AA$16*1>=$R125,AA$16*1<=$D$8,$R125<$D$8,$P125>SUM($V125:Z125)),IF(SUM($P125*$U125/12,$V125:Z125)>$P125,$P125-SUM($V125:Z125),$P125*$U125/12),0)","v":{"v":26.434583333333332,"d":"26.43"}},{"$f":"IF(AND(AB$16*1>=$R125,AB$16*1<=$D$8,$R125<$D$8,$P125>SUM($V125:AA125)),IF(SUM($P125*$U125/12,$V125:AA125)>$P125,$P125-SUM($V125:AA125),$P125*$U125/12),0)","v":{"v":0,"d":"0.00"}},{"$f":"IF(AND(AC$16*1>=$R125,AC$16*1<=$D$8,$R125<$D$8,$P125>SUM($V125:AB125)),IF(SUM($P125*$U125/12,$V125:AB125)>$P125,$P125-SUM($V125:AB125),$P125*$U125/12),0)","v":{"v":0,"d":"0.00"}},{"$f":"IF(AND(AD$16*1>=$R125,AD$16*1<=$D$8,$R125<$D$8,$P125>SUM($V125:AC125)),IF(SUM($P125*$U125/12,$V125:AC125)>$P125,$P125-SUM($V125:AC125),$P125*$U125/12),0)","v":{"v":0,"d":"0.00"}},{"$f":"IF(AND(AE$16*1>=$R125,AE$16*1<=$D$8,$R125<$D$8,$P125>SUM($V125:AD125)),IF(SUM($P125*$U125/12,$V125:AD125)>$P125,$P125-SUM($V125:AD125),$P125*$U125/12),0)","v":{"v":0,"d":"0.00"}},{"$f":"IF(AND(AF$16*1>=$R125,AF$16*1<=$D$8,$R125<$D$8,$P125>SUM($V125:AE125)),IF(SUM($P125*$U125/12,$V125:AE125)>$P125,$P125-SUM($V125:AE125),$P125*$U125/12),0)","v":{"v":0,"d":"0.00"}},{"$f":"IF(AND(AG$16*1>=$R125,AG$16*1<=$D$8,$R125<$D$8,$P125>SUM($V125:AF125)),IF(SUM($P125*$U125/12,$V125:AF125)>$P125,$P125-SUM($V125:AF125),$P125*$U125/12),0)","v":{"v":0,"d":"0.00"}},{"$f":"IF(AND(AH$16*1>=$R125,AH$16*1<=$D$8,$R125<$D$8,$P125>SUM($V125:AG125)),IF(SUM($P125*$U125/12,$V125:AG125)>$P125,$P125-SUM($V125:AG125),$P125*$U125/12),0)","v":{"v":0,"d":"0.00"}},{"v":132.17291666666665,"d":"132.17"},null,null,{"v":1189.57375,"d":"1,189.57"},null,{"v":1189.57375,"d":"1,189.57"}]
[null,null,110,"336111","MONITOR HYNDAI (JM)",{"$nulls":3},411.14,{"$nulls":4},411.14,null,411.14,"2015-08-03","2015-09-01",null,null,{"v":0.25,"d":"25%"},342.63,{"$f":"IF(AND(W$16*1>=$R126,W$16*1<=$D$8,$R126<$D$8,$P126>SUM($V126:V126)),IF(SUM($P126*$U126/12,$V126:V126)>$P126,$P126-SUM($V126:V126),$P126*$U126/12),0)","v":{"v":8.565416666666666,"d":"8.57"}},{"$f":"IF(AND(X$16*1>=$R126,X$16*1<=$D$8,$R126<$D$8,$P126>SUM($V126:W126)),IF(SUM($P126*$U126/12,$V126:W126)>$P126,$P126-SUM($V126:W126),$P126*$U126/12),0)","v":{"v":8.565416666666666,"d":"8.57"}},{"$f":"IF(AND(Y$16*1>=$R126,Y$16*1<=$D$8,$R126<$D$8,$P126>SUM($V126:X126)),IF(SUM($P126*$U126/12,$V126:X126)>$P126,$P126-SUM($V126:X126),$P126*$U126/12),0)","v":{"v":8.565416666666666,"d":"8.57"}},{"$f":"IF(AND(Z$16*1>=$R126,Z$16*1<=$D$8,$R126<$D$8,$P126>SUM($V126:Y126)),IF(SUM($P126*$U126/12,$V126:Y126)>$P126,$P126-SUM($V126:Y126),$P126*$U126/12),0)","v":{"v":8.565416666666666,"d":"8.57"}},{"$f":"IF(AND(AA$16*1>=$R126,AA$16*1<=$D$8,$R126<$D$8,$P126>SUM($V126:Z126)),IF(SUM($P126*$U126/12,$V126:Z126)>$P126,$P126-SUM($V126:Z126),$P126*$U126/12),0)","v":{"v":8.565416666666666,"d":"8.57"}},{"$f":"IF(AND(AB$16*1>=$R126,AB$16*1<=$D$8,$R126<$D$8,$P126>SUM($V126:AA126)),IF(SUM($P126*$U126/12,$V126:AA126)>$P126,$P126-SUM($V126:AA126),$P126*$U126/12),0)","v":{"v":0,"d":"0.00"}},{"$f":"IF(AND(AC$16*1>=$R126,AC$16*1<=$D$8,$R126<$D$8,$P126>SUM($V126:AB126)),IF(SUM($P126*$U126/12,$V126:AB126)>$P126,$P126-SUM($V126:AB126),$P126*$U126/12),0)","v":{"v":0,"d":"0.00"}},{"$f":"IF(AND(AD$16*1>=$R126,AD$16*1<=$D$8,$R126<$D$8,$P126>SUM($V126:AC126)),IF(SUM($P126*$U126/12,$V126:AC126)>$P126,$P126-SUM($V126:AC126),$P126*$U126/12),0)","v":{"v":0,"d":"0.00"}},{"$f":"IF(AND(AE$16*1>=$R126,AE$16*1<=$D$8,$R126<$D$8,$P126>SUM($V126:AD126)),IF(SUM($P126*$U126/12,$V126:AD126)>$P126,$P126-SUM($V126:AD126),$P126*$U126/12),0)","v":{"v":0,"d":"0.00"}},{"$f":"IF(AND(AF$16*1>=$R126,AF$16*1<=$D$8,$R126<$D$8,$P126>SUM($V126:AE126)),IF(SUM($P126*$U126/12,$V126:AE126)>$P126,$P126-SUM($V126:AE126),$P126*$U126/12),0)","v":{"v":0,"d":"0.00"}},{"$f":"IF(AND(AG$16*1>=$R126,AG$16*1<=$D$8,$R126<$D$8,$P126>SUM($V126:AF126)),IF(SUM($P126*$U126/12,$V126:AF126)>$P126,$P126-SUM($V126:AF126),$P126*$U126/12),0)","v":{"v":0,"d":"0.00"}},{"$f":"IF(AND(AH$16*1>=$R126,AH$16*1<=$D$8,$R126<$D$8,$P126>SUM($V126:AG126)),IF(SUM($P126*$U126/12,$V126:AG126)>$P126,$P126-SUM($V126:AG126),$P126*$U126/12),0)","v":{"v":0,"d":"0.00"}},{"v":42.82708333333333,"d":"42.83"},null,null,{"v":368.32625,"d":"368.33"},null,{"v":368.32625,"d":"368.33"}]
[null,null,111,"336111","LAPTOP TOSHIBA (CF)",{"$nulls":3},2683.89,{"$nulls":4},2683.89,null,{"v":2683.89,"d":"2,683.89"},"2015-11-16","2015-12-01",null,null,{"v":0.25,"d":"25%"},{"v":2068.82,"d":"2,068.82"},{"$f":"IF(AND(W$16*1>=$R127,W$16*1<=$D$8,$R127<$D$8,$P127>SUM($V127:V127)),IF(SUM($P127*$U127/12,$V127:V127)>$P127,$P127-SUM($V127:V127),$P127*$U127/12),0)","v":{"v":55.914375,"d":"55.91"}},{"$f":"IF(AND(X$16*1>=$R127,X$16*1<=$D$8,$R127<$D$8,$P127>SUM($V127:W127)),IF(SUM($P127*$U127/12,$V127:W127)>$P127,$P127-SUM($V127:W127),$P127*$U127/12),0)","v":{"v":55.914375,"d":"55.91"}},{"$f":"IF(AND(Y$16*1>=$R127,Y$16*1<=$D$8,$R127<$D$8,$P127>SUM($V127:X127)),IF(SUM($P127*$U127/12,$V127:X127)>$P127,$P127-SUM($V127:X127),$P127*$U127/12),0)","v":{"v":55.914375,"d":"55.91"}},{"$f":"IF(AND(Z$16*1>=$R127,Z$16*1<=$D$8,$R127<$D$8,$P127>SUM($V127:Y127)),IF(SUM($P127*$U127/12,$V127:Y127)>$P127,$P127-SUM($V127:Y127),$P127*$U127/12),0)","v":{"v":55.914375,"d":"55.91"}},{"$f":"IF(AND(AA$16*1>=$R127,AA$16*1<=$D$8,$R127<$D$8,$P127>SUM($V127:Z127)),IF(SUM($P127*$U127/12,$V127:Z127)>$P127,$P127-SUM($V127:Z127),$P127*$U127/12),0)","v":{"v":55.914375,"d":"55.91"}},{"$f":"IF(AND(AB$16*1>=$R127,AB$16*1<=$D$8,$R127<$D$8,$P127>SUM($V127:AA127)),IF(SUM($P127*$U127/12,$V127:AA127)>$P127,$P127-SUM($V127:AA127),$P127*$U127/12),0)","v":{"v":0,"d":"0.00"}},{"$f":"IF(AND(AC$16*1>=$R127,AC$16*1<=$D$8,$R127<$D$8,$P127>SUM($V127:AB127)),IF(SUM($P127*$U127/12,$V127:AB127)>$P127,$P127-SUM($V127:AB127),$P127*$U127/12),0)","v":{"v":0,"d":"0.00"}},{"$f":"IF(AND(AD$16*1>=$R127,AD$16*1<=$D$8,$R127<$D$8,$P127>SUM($V127:AC127)),IF(SUM($P127*$U127/12,$V127:AC127)>$P127,$P127-SUM($V127:AC127),$P127*$U127/12),0)","v":{"v":0,"d":"0.00"}},{"$f":"IF(AND(AE$16*1>=$R127,AE$16*1<=$D$8,$R127<$D$8,$P127>SUM($V127:AD127)),IF(SUM($P127*$U127/12,$V127:AD127)>$P127,$P127-SUM($V127:AD127),$P127*$U127/12),0)","v":{"v":0,"d":"0.00"}},{"$f":"IF(AND(AF$16*1>=$R127,AF$16*1<=$D$8,$R127<$D$8,$P127>SUM($V127:AE127)),IF(SUM($P127*$U127/12,$V127:AE127)>$P127,$P127-SUM($V127:AE127),$P127*$U127/12),0)","v":{"v":0,"d":"0.00"}},{"$f":"IF(AND(AG$16*1>=$R127,AG$16*1<=$D$8,$R127<$D$8,$P127>SUM($V127:AF127)),IF(SUM($P127*$U127/12,$V127:AF127)>$P127,$P127-SUM($V127:AF127),$P127*$U127/12),0)","v":{"v":0,"d":"0.00"}},{"$f":"IF(AND(AH$16*1>=$R127,AH$16*1<=$D$8,$R127<$D$8,$P127>SUM($V127:AG127)),IF(SUM($P127*$U127/12,$V127:AG127)>$P127,$P127-SUM($V127:AG127),$P127*$U127/12),0)","v":{"v":0,"d":"0.00"}},{"v":279.571875,"d":"279.57"},null,null,{"v":2236.563125,"d":"2,236.56"},null,{"v":2236.563125,"d":"2,236.56"}]
[null,null,112,"336111","2 DISCO DURO EXT.(SERVIDOR)",{"$nulls":3},987.99,{"$nulls":4},987.99,null,987.99,"2015-11-18","2015-12-01",null,null,{"v":0.25,"d":"25%"},761.58,{"$f":"IF(AND(W$16*1>=$R128,W$16*1<=$D$8,$R128<$D$8,$P128>SUM($V128:V128)),IF(SUM($P128*$U128/12,$V128:V128)>$P128,$P128-SUM($V128:V128),$P128*$U128/12),0)","v":{"v":20.583125,"d":"20.58"}},{"$f":"IF(AND(X$16*1>=$R128,X$16*1<=$D$8,$R128<$D$8,$P128>SUM($V128:W128)),IF(SUM($P128*$U128/12,$V128:W128)>$P128,$P128-SUM($V128:W128),$P128*$U128/12),0)","v":{"v":20.583125,"d":"20.58"}},{"$f":"IF(AND(Y$16*1>=$R128,Y$16*1<=$D$8,$R128<$D$8,$P128>SUM($V128:X128)),IF(SUM($P128*$U128/12,$V128:X128)>$P128,$P128-SUM($V128:X128),$P128*$U128/12),0)","v":{"v":20.583125,"d":"20.58"}},{"$f":"IF(AND(Z$16*1>=$R128,Z$16*1<=$D$8,$R128<$D$8,$P128>SUM($V128:Y128)),IF(SUM($P128*$U128/12,$V128:Y128)>$P128,$P128-SUM($V128:Y128),$P128*$U128/12),0)","v":{"v":20.583125,"d":"20.58"}},{"$f":"IF(AND(AA$16*1>=$R128,AA$16*1<=$D$8,$R128<$D$8,$P128>SUM($V128:Z128)),IF(SUM($P128*$U128/12,$V128:Z128)>$P128,$P128-SUM($V128:Z128),$P128*$U128/12),0)","v":{"v":20.583125,"d":"20.58"}},{"$f":"IF(AND(AB$16*1>=$R128,AB$16*1<=$D$8,$R128<$D$8,$P128>SUM($V128:AA128)),IF(SUM($P128*$U128/12,$V128:AA128)>$P128,$P128-SUM($V128:AA128),$P128*$U128/12),0)","v":{"v":0,"d":"0.00"}},{"$f":"IF(AND(AC$16*1>=$R128,AC$16*1<=$D$8,$R128<$D$8,$P128>SUM($V128:AB128)),IF(SUM($P128*$U128/12,$V128:AB128)>$P128,$P128-SUM($V128:AB128),$P128*$U128/12),0)","v":{"v":0,"d":"0.00"}},{"$f":"IF(AND(AD$16*1>=$R128,AD$16*1<=$D$8,$R128<$D$8,$P128>SUM($V128:AC128)),IF(SUM($P128*$U128/12,$V128:AC128)>$P128,$P128-SUM($V128:AC128),$P128*$U128/12),0)","v":{"v":0,"d":"0.00"}},{"$f":"IF(AND(AE$16*1>=$R128,AE$16*1<=$D$8,$R128<$D$8,$P128>SUM($V128:AD128)),IF(SUM($P128*$U128/12,$V128:AD128)>$P128,$P128-SUM($V128:AD128),$P128*$U128/12),0)","v":{"v":0,"d":"0.00"}},{"$f":"IF(AND(AF$16*1>=$R128,AF$16*1<=$D$8,$R128<$D$8,$P128>SUM($V128:AE128)),IF(SUM($P128*$U128/12,$V128:AE128)>$P128,$P128-SUM($V128:AE128),$P128*$U128/12),0)","v":{"v":0,"d":"0.00"}},{"$f":"IF(AND(AG$16*1>=$R128,AG$16*1<=$D$8,$R128<$D$8,$P128>SUM($V128:AF128)),IF(SUM($P128*$U128/12,$V128:AF128)>$P128,$P128-SUM($V128:AF128),$P128*$U128/12),0)","v":{"v":0,"d":"0.00"}},{"$f":"IF(AND(AH$16*1>=$R128,AH$16*1<=$D$8,$R128<$D$8,$P128>SUM($V128:AG128)),IF(SUM($P128*$U128/12,$V128:AG128)>$P128,$P128-SUM($V128:AG128),$P128*$U128/12),0)","v":{"v":0,"d":"0.00"}},{"v":102.91562499999999,"d":"102.92"},null,null,{"v":823.329375,"d":"823.33"},null,{"v":823.329375,"d":"823.33"}]
[null,null,113,"336111","CPU Servidor HP",{"$nulls":3},2681.39,{"$nulls":4},2681.39,null,{"v":2681.39,"d":"2,681.39"},"2016-05-07","2016-06-01",null,null,{"v":0.25,"d":"25%"},{"v":1731.74,"d":"1,731.74"},{"$f":"IF(AND(W$16*1>=$R129,W$16*1<=$D$8,$R129<$D$8,$P129>SUM($V129:V129)),IF(SUM($P129*$U129/12,$V129:V129)>$P129,$P129-SUM($V129:V129),$P129*$U129/12),0)","v":{"v":55.862291666666664,"d":"55.86"}},{"$f":"IF(AND(X$16*1>=$R129,X$16*1<=$D$8,$R129<$D$8,$P129>SUM($V129:W129)),IF(SUM($P129*$U129/12,$V129:W129)>$P129,$P129-SUM($V129:W129),$P129*$U129/12),0)","v":{"v":55.862291666666664,"d":"55.86"}},{"$f":"IF(AND(Y$16*1>=$R129,Y$16*1<=$D$8,$R129<$D$8,$P129>SUM($V129:X129)),IF(SUM($P129*$U129/12,$V129:X129)>$P129,$P129-SUM($V129:X129),$P129*$U129/12),0)","v":{"v":55.862291666666664,"d":"55.86"}},{"$f":"IF(AND(Z$16*1>=$R129,Z$16*1<=$D$8,$R129<$D$8,$P129>SUM($V129:Y129)),IF(SUM($P129*$U129/12,$V129:Y129)>$P129,$P129-SUM($V129:Y129),$P129*$U129/12),0)","v":{"v":55.862291666666664,"d":"55.86"}},{"$f":"IF(AND(AA$16*1>=$R129,AA$16*1<=$D$8,$R129<$D$8,$P129>SUM($V129:Z129)),IF(SUM($P129*$U129/12,$V129:Z129)>$P129,$P129-SUM($V129:Z129),$P129*$U129/12),0)","v":{"v":55.862291666666664,"d":"55.86"}},{"$f":"IF(AND(AB$16*1>=$R129,AB$16*1<=$D$8,$R129<$D$8,$P129>SUM($V129:AA129)),IF(SUM($P129*$U129/12,$V129:AA129)>$P129,$P129-SUM($V129:AA129),$P129*$U129/12),0)","v":{"v":0,"d":"0.00"}},{"$f":"IF(AND(AC$16*1>=$R129,AC$16*1<=$D$8,$R129<$D$8,$P129>SUM($V129:AB129)),IF(SUM($P129*$U129/12,$V129:AB129)>$P129,$P129-SUM($V129:AB129),$P129*$U129/12),0)","v":{"v":0,"d":"0.00"}},{"$f":"IF(AND(AD$16*1>=$R129,AD$16*1<=$D$8,$R129<$D$8,$P129>SUM($V129:AC129)),IF(SUM($P129*$U129/12,$V129:AC129)>$P129,$P129-SUM($V129:AC129),$P129*$U129/12),0)","v":{"v":0,"d":"0.00"}},{"$f":"IF(AND(AE$16*1>=$R129,AE$16*1<=$D$8,$R129<$D$8,$P129>SUM($V129:AD129)),IF(SUM($P129*$U129/12,$V129:AD129)>$P129,$P129-SUM($V129:AD129),$P129*$U129/12),0)","v":{"v":0,"d":"0.00"}},{"$f":"IF(AND(AF$16*1>=$R129,AF$16*1<=$D$8,$R129<$D$8,$P129>SUM($V129:AE129)),IF(SUM($P129*$U129/12,$V129:AE129)>$P129,$P129-SUM($V129:AE129),$P129*$U129/12),0)","v":{"v":0,"d":"0.00"}},{"$f":"IF(AND(AG$16*1>=$R129,AG$16*1<=$D$8,$R129<$D$8,$P129>SUM($V129:AF129)),IF(SUM($P129*$U129/12,$V129:AF129)>$P129,$P129-SUM($V129:AF129),$P129*$U129/12),0)","v":{"v":0,"d":"0.00"}},{"$f":"IF(AND(AH$16*1>=$R129,AH$16*1<=$D$8,$R129<$D$8,$P129>SUM($V129:AG129)),IF(SUM($P129*$U129/12,$V129:AG129)>$P129,$P129-SUM($V129:AG129),$P129*$U129/12),0)","v":{"v":0,"d":"0.00"}},{"v":279.31145833333335,"d":"279.31"},null,null,{"v":1899.326875,"d":"1,899.33"},null,{"v":1899.326875,"d":"1,899.33"}]
[null,null,114,"336111","MONITOR LG 20\" (OFIC.MARCAS)",{"$nulls":3},363.56,{"$nulls":4},363.56,null,363.56,"2017-01-08","2017-02-01",null,null,{"v":0.25,"d":"25%"},174.21,{"$f":"IF(AND(W$16*1>=$R130,W$16*1<=$D$8,$R130<$D$8,$P130>SUM($V130:V130)),IF(SUM($P130*$U130/12,$V130:V130)>$P130,$P130-SUM($V130:V130),$P130*$U130/12),0)","v":{"v":7.574166666666667,"d":"7.57"}},{"$f":"IF(AND(X$16*1>=$R130,X$16*1<=$D$8,$R130<$D$8,$P130>SUM($V130:W130)),IF(SUM($P130*$U130/12,$V130:W130)>$P130,$P130-SUM($V130:W130),$P130*$U130/12),0)","v":{"v":7.574166666666667,"d":"7.57"}},{"$f":"IF(AND(Y$16*1>=$R130,Y$16*1<=$D$8,$R130<$D$8,$P130>SUM($V130:X130)),IF(SUM($P130*$U130/12,$V130:X130)>$P130,$P130-SUM($V130:X130),$P130*$U130/12),0)","v":{"v":7.574166666666667,"d":"7.57"}},{"$f":"IF(AND(Z$16*1>=$R130,Z$16*1<=$D$8,$R130<$D$8,$P130>SUM($V130:Y130)),IF(SUM($P130*$U130/12,$V130:Y130)>$P130,$P130-SUM($V130:Y130),$P130*$U130/12),0)","v":{"v":7.574166666666667,"d":"7.57"}},{"$f":"IF(AND(AA$16*1>=$R130,AA$16*1<=$D$8,$R130<$D$8,$P130>SUM($V130:Z130)),IF(SUM($P130*$U130/12,$V130:Z130)>$P130,$P130-SUM($V130:Z130),$P130*$U130/12),0)","v":{"v":7.574166666666667,"d":"7.57"}},{"$f":"IF(AND(AB$16*1>=$R130,AB$16*1<=$D$8,$R130<$D$8,$P130>SUM($V130:AA130)),IF(SUM($P130*$U130/12,$V130:AA130)>$P130,$P130-SUM($V130:AA130),$P130*$U130/12),0)","v":{"v":0,"d":"0.00"}},{"$f":"IF(AND(AC$16*1>=$R130,AC$16*1<=$D$8,$R130<$D$8,$P130>SUM($V130:AB130)),IF(SUM($P130*$U130/12,$V130:AB130)>$P130,$P130-SUM($V130:AB130),$P130*$U130/12),0)","v":{"v":0,"d":"0.00"}},{"$f":"IF(AND(AD$16*1>=$R130,AD$16*1<=$D$8,$R130<$D$8,$P130>SUM($V130:AC130)),IF(SUM($P130*$U130/12,$V130:AC130)>$P130,$P130-SUM($V130:AC130),$P130*$U130/12),0)","v":{"v":0,"d":"0.00"}},{"$f":"IF(AND(AE$16*1>=$R130,AE$16*1<=$D$8,$R130<$D$8,$P130>SUM($V130:AD130)),IF(SUM($P130*$U130/12,$V130:AD130)>$P130,$P130-SUM($V130:AD130),$P130*$U130/12),0)","v":{"v":0,"d":"0.00"}},{"$f":"IF(AND(AF$16*1>=$R130,AF$16*1<=$D$8,$R130<$D$8,$P130>SUM($V130:AE130)),IF(SUM($P130*$U130/12,$V130:AE130)>$P130,$P130-SUM($V130:AE130),$P130*$U130/12),0)","v":{"v":0,"d":"0.00"}},{"$f":"IF(AND(AG$16*1>=$R130,AG$16*1<=$D$8,$R130<$D$8,$P130>SUM($V130:AF130)),IF(SUM($P130*$U130/12,$V130:AF130)>$P130,$P130-SUM($V130:AF130),$P130*$U130/12),0)","v":{"v":0,"d":"0.00"}},{"$f":"IF(AND(AH$16*1>=$R130,AH$16*1<=$D$8,$R130<$D$8,$P130>SUM($V130:AG130)),IF(SUM($P130*$U130/12,$V130:AG130)>$P130,$P130-SUM($V130:AG130),$P130*$U130/12),0)","v":{"v":0,"d":"0.00"}},{"v":37.87083333333334,"d":"37.87"},null,null,{"v":196.9325,"d":"196.93"},null,{"v":196.9325,"d":"196.93"}]
[null,null,115,"336111","MONITOR SAMSUNG LED 20\" S200300 (SG)",{"$nulls":3},362.71,{"$nulls":4},362.71,null,362.71,"2017-01-31","2017-02-01",null,null,{"v":0.25,"d":"25%"},166.24,{"$f":"IF(AND(W$16*1>=$R131,W$16*1<=$D$8,$R131<$D$8,$P131>SUM($V131:V131)),IF(SUM($P131*$U131/12,$V131:V131)>$P131,$P131-SUM($V131:V131),$P131*$U131/12),0)","v":{"v":7.556458333333333,"d":"7.56"}},{"$f":"IF(AND(X$16*1>=$R131,X$16*1<=$D$8,$R131<$D$8,$P131>SUM($V131:W131)),IF(SUM($P131*$U131/12,$V131:W131)>$P131,$P131-SUM($V131:W131),$P131*$U131/12),0)","v":{"v":7.556458333333333,"d":"7.56"}},{"$f":"IF(AND(Y$16*1>=$R131,Y$16*1<=$D$8,$R131<$D$8,$P131>SUM($V131:X131)),IF(SUM($P131*$U131/12,$V131:X131)>$P131,$P131-SUM($V131:X131),$P131*$U131/12),0)","v":{"v":7.556458333333333,"d":"7.56"}},{"$f":"IF(AND(Z$16*1>=$R131,Z$16*1<=$D$8,$R131<$D$8,$P131>SUM($V131:Y131)),IF(SUM($P131*$U131/12,$V131:Y131)>$P131,$P131-SUM($V131:Y131),$P131*$U131/12),0)","v":{"v":7.556458333333333,"d":"7.56"}},{"$f":"IF(AND(AA$16*1>=$R131,AA$16*1<=$D$8,$R131<$D$8,$P131>SUM($V131:Z131)),IF(SUM($P131*$U131/12,$V131:Z131)>$P131,$P131-SUM($V131:Z131),$P131*$U131/12),0)","v":{"v":7.556458333333333,"d":"7.56"}},{"$f":"IF(AND(AB$16*1>=$R131,AB$16*1<=$D$8,$R131<$D$8,$P131>SUM($V131:AA131)),IF(SUM($P131*$U131/12,$V131:AA131)>$P131,$P131-SUM($V131:AA131),$P131*$U131/12),0)","v":{"v":0,"d":"0.00"}},{"$f":"IF(AND(AC$16*1>=$R131,AC$16*1<=$D$8,$R131<$D$8,$P131>SUM($V131:AB131)),IF(SUM($P131*$U131/12,$V131:AB131)>$P131,$P131-SUM($V131:AB131),$P131*$U131/12),0)","v":{"v":0,"d":"0.00"}},{"$f":"IF(AND(AD$16*1>=$R131,AD$16*1<=$D$8,$R131<$D$8,$P131>SUM($V131:AC131)),IF(SUM($P131*$U131/12,$V131:AC131)>$P131,$P131-SUM($V131:AC131),$P131*$U131/12),0)","v":{"v":0,"d":"0.00"}},{"$f":"IF(AND(AE$16*1>=$R131,AE$16*1<=$D$8,$R131<$D$8,$P131>SUM($V131:AD131)),IF(SUM($P131*$U131/12,$V131:AD131)>$P131,$P131-SUM($V131:AD131),$P131*$U131/12),0)","v":{"v":0,"d":"0.00"}},{"$f":"IF(AND(AF$16*1>=$R131,AF$16*1<=$D$8,$R131<$D$8,$P131>SUM($V131:AE131)),IF(SUM($P131*$U131/12,$V131:AE131)>$P131,$P131-SUM($V131:AE131),$P131*$U131/12),0)","v":{"v":0,"d":"0.00"}},{"$f":"IF(AND(AG$16*1>=$R131,AG$16*1<=$D$8,$R131<$D$8,$P131>SUM($V131:AF131)),IF(SUM($P131*$U131/12,$V131:AF131)>$P131,$P131-SUM($V131:AF131),$P131*$U131/12),0)","v":{"v":0,"d":"0.00"}},{"$f":"IF(AND(AH$16*1>=$R131,AH$16*1<=$D$8,$R131<$D$8,$P131>SUM($V131:AG131)),IF(SUM($P131*$U131/12,$V131:AG131)>$P131,$P131-SUM($V131:AG131),$P131*$U131/12),0)","v":{"v":0,"d":"0.00"}},{"v":37.782291666666666,"d":"37.78"},null,null,{"v":188.909375,"d":"188.91"},null,{"v":188.909375,"d":"188.91"}]
[null,null,116,"336111","COMPUT.INTEL CORE 4GB(ADM.MN)",{"$nulls":3},1628.81,{"$nulls":4},1628.81,null,{"v":1628.81,"d":"1,628.81"},"2017-07-15","2017-08-01",null,null,{"v":0.25,"d":"25%"},576.87,{"$f":"IF(AND(W$16*1>=$R132,W$16*1<=$D$8,$R132<$D$8,$P132>SUM($V132:V132)),IF(SUM($P132*$U132/12,$V132:V132)>$P132,$P132-SUM($V132:V132),$P132*$U132/12),0)","v":{"v":33.93354166666666,"d":"33.93"}},{"$f":"IF(AND(X$16*1>=$R132,X$16*1<=$D$8,$R132<$D$8,$P132>SUM($V132:W132)),IF(SUM($P132*$U132/12,$V132:W132)>$P132,$P132-SUM($V132:W132),$P132*$U132/12),0)","v":{"v":33.93354166666666,"d":"33.93"}},{"$f":"IF(AND(Y$16*1>=$R132,Y$16*1<=$D$8,$R132<$D$8,$P132>SUM($V132:X132)),IF(SUM($P132*$U132/12,$V132:X132)>$P132,$P132-SUM($V132:X132),$P132*$U132/12),0)","v":{"v":33.93354166666666,"d":"33.93"}},{"$f":"IF(AND(Z$16*1>=$R132,Z$16*1<=$D$8,$R132<$D$8,$P132>SUM($V132:Y132)),IF(SUM($P132*$U132/12,$V132:Y132)>$P132,$P132-SUM($V132:Y132),$P132*$U132/12),0)","v":{"v":33.93354166666666,"d":"33.93"}},{"$f":"IF(AND(AA$16*1>=$R132,AA$16*1<=$D$8,$R132<$D$8,$P132>SUM($V132:Z132)),IF(SUM($P132*$U132/12,$V132:Z132)>$P132,$P132-SUM($V132:Z132),$P132*$U132/12),0)","v":{"v":33.93354166666666,"d":"33.93"}},{"$f":"IF(AND(AB$16*1>=$R132,AB$16*1<=$D$8,$R132<$D$8,$P132>SUM($V132:AA132)),IF(SUM($P132*$U132/12,$V132:AA132)>$P132,$P132-SUM($V132:AA132),$P132*$U132/12),0)","v":{"v":0,"d":"0.00"}},{"$f":"IF(AND(AC$16*1>=$R132,AC$16*1<=$D$8,$R132<$D$8,$P132>SUM($V132:AB132)),IF(SUM($P132*$U132/12,$V132:AB132)>$P132,$P132-SUM($V132:AB132),$P132*$U132/12),0)","v":{"v":0,"d":"0.00"}},{"$f":"IF(AND(AD$16*1>=$R132,AD$16*1<=$D$8,$R132<$D$8,$P132>SUM($V132:AC132)),IF(SUM($P132*$U132/12,$V132:AC132)>$P132,$P132-SUM($V132:AC132),$P132*$U132/12),0)","v":{"v":0,"d":"0.00"}},{"$f":"IF(AND(AE$16*1>=$R132,AE$16*1<=$D$8,$R132<$D$8,$P132>SUM($V132:AD132)),IF(SUM($P132*$U132/12,$V132:AD132)>$P132,$P132-SUM($V132:AD132),$P132*$U132/12),0)","v":{"v":0,"d":"0.00"}},{"$f":"IF(AND(AF$16*1>=$R132,AF$16*1<=$D$8,$R132<$D$8,$P132>SUM($V132:AE132)),IF(SUM($P132*$U132/12,$V132:AE132)>$P132,$P132-SUM($V132:AE132),$P132*$U132/12),0)","v":{"v":0,"d":"0.00"}},{"$f":"IF(AND(AG$16*1>=$R132,AG$16*1<=$D$8,$R132<$D$8,$P132>SUM($V132:AF132)),IF(SUM($P132*$U132/12,$V132:AF132)>$P132,$P132-SUM($V132:AF132),$P132*$U132/12),0)","v":{"v":0,"d":"0.00"}},{"$f":"IF(AND(AH$16*1>=$R132,AH$16*1<=$D$8,$R132<$D$8,$P132>SUM($V132:AG132)),IF(SUM($P132*$U132/12,$V132:AG132)>$P132,$P132-SUM($V132:AG132),$P132*$U132/12),0)","v":{"v":0,"d":"0.00"}},{"v":169.6677083333333,"d":"169.67"},null,null,{"v":678.670625,"d":"678.67"},null,{"v":678.670625,"d":"678.67"}]
[null,null,117,"336111","DISCO DURO HP DISCO DURO HP(1000GB)SERVIDOR",{"$nulls":3},687.29,{"$nulls":4},687.29,null,687.29,"2017-10-21","2017-11-01",null,null,{"v":0.25,"d":"25%"},200.46,{"$f":"IF(AND(W$16*1>=$R133,W$16*1<=$D$8,$R133<$D$8,$P133>SUM($V133:V133)),IF(SUM($P133*$U133/12,$V133:V133)>$P133,$P133-SUM($V133:V133),$P133*$U133/12),0)","v":{"v":14.318541666666667,"d":"14.32"}},{"$f":"IF(AND(X$16*1>=$R133,X$16*1<=$D$8,$R133<$D$8,$P133>SUM($V133:W133)),IF(SUM($P133*$U133/12,$V133:W133)>$P133,$P133-SUM($V133:W133),$P133*$U133/12),0)","v":{"v":14.318541666666667,"d":"14.32"}},{"$f":"IF(AND(Y$16*1>=$R133,Y$16*1<=$D$8,$R133<$D$8,$P133>SUM($V133:X133)),IF(SUM($P133*$U133/12,$V133:X133)>$P133,$P133-SUM($V133:X133),$P133*$U133/12),0)","v":{"v":14.318541666666667,"d":"14.32"}},{"$f":"IF(AND(Z$16*1>=$R133,Z$16*1<=$D$8,$R133<$D$8,$P133>SUM($V133:Y133)),IF(SUM($P133*$U133/12,$V133:Y133)>$P133,$P133-SUM($V133:Y133),$P133*$U133/12),0)","v":{"v":14.318541666666667,"d":"14.32"}},{"$f":"IF(AND(AA$16*1>=$R133,AA$16*1<=$D$8,$R133<$D$8,$P133>SUM($V133:Z133)),IF(SUM($P133*$U133/12,$V133:Z133)>$P133,$P133-SUM($V133:Z133),$P133*$U133/12),0)","v":{"v":14.318541666666667,"d":"14.32"}},{"$f":"IF(AND(AB$16*1>=$R133,AB$16*1<=$D$8,$R133<$D$8,$P133>SUM($V133:AA133)),IF(SUM($P133*$U133/12,$V133:AA133)>$P133,$P133-SUM($V133:AA133),$P133*$U133/12),0)","v":{"v":0,"d":"0.00"}},{"$f":"IF(AND(AC$16*1>=$R133,AC$16*1<=$D$8,$R133<$D$8,$P133>SUM($V133:AB133)),IF(SUM($P133*$U133/12,$V133:AB133)>$P133,$P133-SUM($V133:AB133),$P133*$U133/12),0)","v":{"v":0,"d":"0.00"}},{"$f":"IF(AND(AD$16*1>=$R133,AD$16*1<=$D$8,$R133<$D$8,$P133>SUM($V133:AC133)),IF(SUM($P133*$U133/12,$V133:AC133)>$P133,$P133-SUM($V133:AC133),$P133*$U133/12),0)","v":{"v":0,"d":"0.00"}},{"$f":"IF(AND(AE$16*1>=$R133,AE$16*1<=$D$8,$R133<$D$8,$P133>SUM($V133:AD133)),IF(SUM($P133*$U133/12,$V133:AD133)>$P133,$P133-SUM($V133:AD133),$P133*$U133/12),0)","v":{"v":0,"d":"0.00"}},{"$f":"IF(AND(AF$16*1>=$R133,AF$16*1<=$D$8,$R133<$D$8,$P133>SUM($V133:AE133)),IF(SUM($P133*$U133/12,$V133:AE133)>$P133,$P133-SUM($V133:AE133),$P133*$U133/12),0)","v":{"v":0,"d":"0.00"}},{"$f":"IF(AND(AG$16*1>=$R133,AG$16*1<=$D$8,$R133<$D$8,$P133>SUM($V133:AF133)),IF(SUM($P133*$U133/12,$V133:AF133)>$P133,$P133-SUM($V133:AF133),$P133*$U133/12),0)","v":{"v":0,"d":"0.00"}},{"$f":"IF(AND(AH$16*1>=$R133,AH$16*1<=$D$8,$R133<$D$8,$P133>SUM($V133:AG133)),IF(SUM($P133*$U133/12,$V133:AG133)>$P133,$P133-SUM($V133:AG133),$P133*$U133/12),0)","v":{"v":0,"d":"0.00"}},{"v":71.59270833333333,"d":"71.59"},null,null,{"v":243.415625,"d":"243.42"},null,{"v":243.415625,"d":"243.42"}]
[null,null,118,"336111","COMPUT.INTEL CORE 4GB,DD 500 GB",{"$nulls":3},1338.98,{"$nulls":4},1338.98,null,{"v":1338.98,"d":"1,338.98"},"2017-10-24","2017-11-01",null,null,{"v":0.25,"d":"25%"},390.54,{"$f":"IF(AND(W$16*1>=$R134,W$16*1<=$D$8,$R134<$D$8,$P134>SUM($V134:V134)),IF(SUM($P134*$U134/12,$V134:V134)>$P134,$P134-SUM($V134:V134),$P134*$U134/12),0)","v":{"v":27.895416666666666,"d":"27.90"}},{"$f":"IF(AND(X$16*1>=$R134,X$16*1<=$D$8,$R134<$D$8,$P134>SUM($V134:W134)),IF(SUM($P134*$U134/12,$V134:W134)>$P134,$P134-SUM($V134:W134),$P134*$U134/12),0)","v":{"v":27.895416666666666,"d":"27.90"}},{"$f":"IF(AND(Y$16*1>=$R134,Y$16*1<=$D$8,$R134<$D$8,$P134>SUM($V134:X134)),IF(SUM($P134*$U134/12,$V134:X134)>$P134,$P134-SUM($V134:X134),$P134*$U134/12),0)","v":{"v":27.895416666666666,"d":"27.90"}},{"$f":"IF(AND(Z$16*1>=$R134,Z$16*1<=$D$8,$R134<$D$8,$P134>SUM($V134:Y134)),IF(SUM($P134*$U134/12,$V134:Y134)>$P134,$P134-SUM($V134:Y134),$P134*$U134/12),0)","v":{"v":27.895416666666666,"d":"27.90"}},{"$f":"IF(AND(AA$16*1>=$R134,AA$16*1<=$D$8,$R134<$D$8,$P134>SUM($V134:Z134)),IF(SUM($P134*$U134/12,$V134:Z134)>$P134,$P134-SUM($V134:Z134),$P134*$U134/12),0)","v":{"v":27.895416666666666,"d":"27.90"}},{"$f":"IF(AND(AB$16*1>=$R134,AB$16*1<=$D$8,$R134<$D$8,$P134>SUM($V134:AA134)),IF(SUM($P134*$U134/12,$V134:AA134)>$P134,$P134-SUM($V134:AA134),$P134*$U134/12),0)","v":{"v":0,"d":"0.00"}},{"$f":"IF(AND(AC$16*1>=$R134,AC$16*1<=$D$8,$R134<$D$8,$P134>SUM($V134:AB134)),IF(SUM($P134*$U134/12,$V134:AB134)>$P134,$P134-SUM($V134:AB134),$P134*$U134/12),0)","v":{"v":0,"d":"0.00"}},{"$f":"IF(AND(AD$16*1>=$R134,AD$16*1<=$D$8,$R134<$D$8,$P134>SUM($V134:AC134)),IF(SUM($P134*$U134/12,$V134:AC134)>$P134,$P134-SUM($V134:AC134),$P134*$U134/12),0)","v":{"v":0,"d":"0.00"}},{"$f":"IF(AND(AE$16*1>=$R134,AE$16*1<=$D$8,$R134<$D$8,$P134>SUM($V134:AD134)),IF(SUM($P134*$U134/12,$V134:AD134)>$P134,$P134-SUM($V134:AD134),$P134*$U134/12),0)","v":{"v":0,"d":"0.00"}},{"$f":"IF(AND(AF$16*1>=$R134,AF$16*1<=$D$8,$R134<$D$8,$P134>SUM($V134:AE134)),IF(SUM($P134*$U134/12,$V134:AE134)>$P134,$P134-SUM($V134:AE134),$P134*$U134/12),0)","v":{"v":0,"d":"0.00"}},{"$f":"IF(AND(AG$16*1>=$R134,AG$16*1<=$D$8,$R134<$D$8,$P134>SUM($V134:AF134)),IF(SUM($P134*$U134/12,$V134:AF134)>$P134,$P134-SUM($V134:AF134),$P134*$U134/12),0)","v":{"v":0,"d":"0.00"}},{"$f":"IF(AND(AH$16*1>=$R134,AH$16*1<=$D$8,$R134<$D$8,$P134>SUM($V134:AG134)),IF(SUM($P134*$U134/12,$V134:AG134)>$P134,$P134-SUM($V134:AG134),$P134*$U134/12),0)","v":{"v":0,"d":"0.00"}},{"v":139.47708333333333,"d":"139.48"},null,null,{"v":474.22625000000005,"d":"474.23"},null,{"v":474.22625000000005,"d":"474.23"}]
[null,null,119,"336111","COMPUT.INTEL c/MONITOR LG",{"$nulls":3},1586.44,{"$nulls":4},1586.44,null,{"v":1586.44,"d":"1,586.44"},"2017-11-13","2017-12-01",null,null,{"v":0.25,"d":"25%"},429.66,{"$f":"IF(AND(W$16*1>=$R135,W$16*1<=$D$8,$R135<$D$8,$P135>SUM($V135:V135)),IF(SUM($P135*$U135/12,$V135:V135)>$P135,$P135-SUM($V135:V135),$P135*$U135/12),0)","v":{"v":33.05083333333334,"d":"33.05"}},{"$f":"IF(AND(X$16*1>=$R135,X$16*1<=$D$8,$R135<$D$8,$P135>SUM($V135:W135)),IF(SUM($P135*$U135/12,$V135:W135)>$P135,$P135-SUM($V135:W135),$P135*$U135/12),0)","v":{"v":33.05083333333334,"d":"33.05"}},{"$f":"IF(AND(Y$16*1>=$R135,Y$16*1<=$D$8,$R135<$D$8,$P135>SUM($V135:X135)),IF(SUM($P135*$U135/12,$V135:X135)>$P135,$P135-SUM($V135:X135),$P135*$U135/12),0)","v":{"v":33.05083333333334,"d":"33.05"}},{"$f":"IF(AND(Z$16*1>=$R135,Z$16*1<=$D$8,$R135<$D$8,$P135>SUM($V135:Y135)),IF(SUM($P135*$U135/12,$V135:Y135)>$P135,$P135-SUM($V135:Y135),$P135*$U135/12),0)","v":{"v":33.05083333333334,"d":"33.05"}},{"$f":"IF(AND(AA$16*1>=$R135,AA$16*1<=$D$8,$R135<$D$8,$P135>SUM($V135:Z135)),IF(SUM($P135*$U135/12,$V135:Z135)>$P135,$P135-SUM($V135:Z135),$P135*$U135/12),0)","v":{"v":33.05083333333334,"d":"33.05"}},{"$f":"IF(AND(AB$16*1>=$R135,AB$16*1<=$D$8,$R135<$D$8,$P135>SUM($V135:AA135)),IF(SUM($P135*$U135/12,$V135:AA135)>$P135,$P135-SUM($V135:AA135),$P135*$U135/12),0)","v":{"v":0,"d":"0.00"}},{"$f":"IF(AND(AC$16*1>=$R135,AC$16*1<=$D$8,$R135<$D$8,$P135>SUM($V135:AB135)),IF(SUM($P135*$U135/12,$V135:AB135)>$P135,$P135-SUM($V135:AB135),$P135*$U135/12),0)","v":{"v":0,"d":"0.00"}},{"$f":"IF(AND(AD$16*1>=$R135,AD$16*1<=$D$8,$R135<$D$8,$P135>SUM($V135:AC135)),IF(SUM($P135*$U135/12,$V135:AC135)>$P135,$P135-SUM($V135:AC135),$P135*$U135/12),0)","v":{"v":0,"d":"0.00"}},{"$f":"IF(AND(AE$16*1>=$R135,AE$16*1<=$D$8,$R135<$D$8,$P135>SUM($V135:AD135)),IF(SUM($P135*$U135/12,$V135:AD135)>$P135,$P135-SUM($V135:AD135),$P135*$U135/12),0)","v":{"v":0,"d":"0.00"}},{"$f":"IF(AND(AF$16*1>=$R135,AF$16*1<=$D$8,$R135<$D$8,$P135>SUM($V135:AE135)),IF(SUM($P135*$U135/12,$V135:AE135)>$P135,$P135-SUM($V135:AE135),$P135*$U135/12),0)","v":{"v":0,"d":"0.00"}},{"$f":"IF(AND(AG$16*1>=$R135,AG$16*1<=$D$8,$R135<$D$8,$P135>SUM($V135:AF135)),IF(SUM($P135*$U135/12,$V135:AF135)>$P135,$P135-SUM($V135:AF135),$P135*$U135/12),0)","v":{"v":0,"d":"0.00"}},{"$f":"IF(AND(AH$16*1>=$R135,AH$16*1<=$D$8,$R135<$D$8,$P135>SUM($V135:AG135)),IF(SUM($P135*$U135/12,$V135:AG135)>$P135,$P135-SUM($V135:AG135),$P135*$U135/12),0)","v":{"v":0,"d":"0.00"}},{"v":165.2541666666667,"d":"165.25"},null,null,{"v":528.8125,"d":"528.81"},null,{"v":528.8125,"d":"528.81"}]
[null,null,120,"336111","COMPUT. INTEL 4GB , MONITOR 19\" LG",{"$nulls":3},1561.8599999999997,{"$nulls":4},1561.8599999999997,null,{"v":1561.8599999999997,"d":"1,561.86"},"2018-03-06","2018-04-01",null,null,{"v":0.25,"d":"25%"},292.85,{"$f":"IF(AND(W$16*1>=$R136,W$16*1<=$D$8,$R136<$D$8,$P136>SUM($V136:V136)),IF(SUM($P136*$U136/12,$V136:V136)>$P136,$P136-SUM($V136:V136),$P136*$U136/12),0)","v":{"v":32.53874999999999,"d":"32.54"}},{"$f":"IF(AND(X$16*1>=$R136,X$16*1<=$D$8,$R136<$D$8,$P136>SUM($V136:W136)),IF(SUM($P136*$U136/12,$V136:W136)>$P136,$P136-SUM($V136:W136),$P136*$U136/12),0)","v":{"v":32.53874999999999,"d":"32.54"}},{"$f":"IF(AND(Y$16*1>=$R136,Y$16*1<=$D$8,$R136<$D$8,$P136>SUM($V136:X136)),IF(SUM($P136*$U136/12,$V136:X136)>$P136,$P136-SUM($V136:X136),$P136*$U136/12),0)","v":{"v":32.53874999999999,"d":"32.54"}},{"$f":"IF(AND(Z$16*1>=$R136,Z$16*1<=$D$8,$R136<$D$8,$P136>SUM($V136:Y136)),IF(SUM($P136*$U136/12,$V136:Y136)>$P136,$P136-SUM($V136:Y136),$P136*$U136/12),0)","v":{"v":32.53874999999999,"d":"32.54"}},{"$f":"IF(AND(AA$16*1>=$R136,AA$16*1<=$D$8,$R136<$D$8,$P136>SUM($V136:Z136)),IF(SUM($P136*$U136/12,$V136:Z136)>$P136,$P136-SUM($V136:Z136),$P136*$U136/12),0)","v":{"v":32.53874999999999,"d":"32.54"}},{"$f":"IF(AND(AB$16*1>=$R136,AB$16*1<=$D$8,$R136<$D$8,$P136>SUM($V136:AA136)),IF(SUM($P136*$U136/12,$V136:AA136)>$P136,$P136-SUM($V136:AA136),$P136*$U136/12),0)","v":{"v":0,"d":"0.00"}},{"$f":"IF(AND(AC$16*1>=$R136,AC$16*1<=$D$8,$R136<$D$8,$P136>SUM($V136:AB136)),IF(SUM($P136*$U136/12,$V136:AB136)>$P136,$P136-SUM($V136:AB136),$P136*$U136/12),0)","v":{"v":0,"d":"0.00"}},{"$f":"IF(AND(AD$16*1>=$R136,AD$16*1<=$D$8,$R136<$D$8,$P136>SUM($V136:AC136)),IF(SUM($P136*$U136/12,$V136:AC136)>$P136,$P136-SUM($V136:AC136),$P136*$U136/12),0)","v":{"v":0,"d":"0.00"}},{"$f":"IF(AND(AE$16*1>=$R136,AE$16*1<=$D$8,$R136<$D$8,$P136>SUM($V136:AD136)),IF(SUM($P136*$U136/12,$V136:AD136)>$P136,$P136-SUM($V136:AD136),$P136*$U136/12),0)","v":{"v":0,"d":"0.00"}},{"$f":"IF(AND(AF$16*1>=$R136,AF$16*1<=$D$8,$R136<$D$8,$P136>SUM($V136:AE136)),IF(SUM($P136*$U136/12,$V136:AE136)>$P136,$P136-SUM($V136:AE136),$P136*$U136/12),0)","v":{"v":0,"d":"0.00"}},{"$f":"IF(AND(AG$16*1>=$R136,AG$16*1<=$D$8,$R136<$D$8,$P136>SUM($V136:AF136)),IF(SUM($P136*$U136/12,$V136:AF136)>$P136,$P136-SUM($V136:AF136),$P136*$U136/12),0)","v":{"v":0,"d":"0.00"}},{"$f":"IF(AND(AH$16*1>=$R136,AH$16*1<=$D$8,$R136<$D$8,$P136>SUM($V136:AG136)),IF(SUM($P136*$U136/12,$V136:AG136)>$P136,$P136-SUM($V136:AG136),$P136*$U136/12),0)","v":{"v":0,"d":"0.00"}},{"v":162.69374999999997,"d":"162.69"},null,null,{"v":390.46625,"d":"390.47"},null,{"v":390.46625,"d":"390.47"}]
[null,null,121,"336111","COMPUT. INTEL CORE , DD 500GB ",{"$nulls":3},1248.3,{"$nulls":4},1248.3,null,{"v":1248.3,"d":"1,248.30"},"2018-03-06","2018-04-01",null,null,{"v":0.25,"d":"25%"},234.06,{"$f":"IF(AND(W$16*1>=$R137,W$16*1<=$D$8,$R137<$D$8,$P137>SUM($V137:V137)),IF(SUM($P137*$U137/12,$V137:V137)>$P137,$P137-SUM($V137:V137),$P137*$U137/12),0)","v":{"v":26.006249999999998,"d":"26.01"}},{"$f":"IF(AND(X$16*1>=$R137,X$16*1<=$D$8,$R137<$D$8,$P137>SUM($V137:W137)),IF(SUM($P137*$U137/12,$V137:W137)>$P137,$P137-SUM($V137:W137),$P137*$U137/12),0)","v":{"v":26.006249999999998,"d":"26.01"}},{"$f":"IF(AND(Y$16*1>=$R137,Y$16*1<=$D$8,$R137<$D$8,$P137>SUM($V137:X137)),IF(SUM($P137*$U137/12,$V137:X137)>$P137,$P137-SUM($V137:X137),$P137*$U137/12),0)","v":{"v":26.006249999999998,"d":"26.01"}},{"$f":"IF(AND(Z$16*1>=$R137,Z$16*1<=$D$8,$R137<$D$8,$P137>SUM($V137:Y137)),IF(SUM($P137*$U137/12,$V137:Y137)>$P137,$P137-SUM($V137:Y137),$P137*$U137/12),0)","v":{"v":26.006249999999998,"d":"26.01"}},{"$f":"IF(AND(AA$16*1>=$R137,AA$16*1<=$D$8,$R137<$D$8,$P137>SUM($V137:Z137)),IF(SUM($P137*$U137/12,$V137:Z137)>$P137,$P137-SUM($V137:Z137),$P137*$U137/12),0)","v":{"v":26.006249999999998,"d":"26.01"}},{"$f":"IF(AND(AB$16*1>=$R137,AB$16*1<=$D$8,$R137<$D$8,$P137>SUM($V137:AA137)),IF(SUM($P137*$U137/12,$V137:AA137)>$P137,$P137-SUM($V137:AA137),$P137*$U137/12),0)","v":{"v":0,"d":"0.00"}},{"$f":"IF(AND(AC$16*1>=$R137,AC$16*1<=$D$8,$R137<$D$8,$P137>SUM($V137:AB137)),IF(SUM($P137*$U137/12,$V137:AB137)>$P137,$P137-SUM($V137:AB137),$P137*$U137/12),0)","v":{"v":0,"d":"0.00"}},{"$f":"IF(AND(AD$16*1>=$R137,AD$16*1<=$D$8,$R137<$D$8,$P137>SUM($V137:AC137)),IF(SUM($P137*$U137/12,$V137:AC137)>$P137,$P137-SUM($V137:AC137),$P137*$U137/12),0)","v":{"v":0,"d":"0.00"}},{"$f":"IF(AND(AE$16*1>=$R137,AE$16*1<=$D$8,$R137<$D$8,$P137>SUM($V137:AD137)),IF(SUM($P137*$U137/12,$V137:AD137)>$P137,$P137-SUM($V137:AD137),$P137*$U137/12),0)","v":{"v":0,"d":"0.00"}},{"$f":"IF(AND(AF$16*1>=$R137,AF$16*1<=$D$8,$R137<$D$8,$P137>SUM($V137:AE137)),IF(SUM($P137*$U137/12,$V137:AE137)>$P137,$P137-SUM($V137:AE137),$P137*$U137/12),0)","v":{"v":0,"d":"0.00"}},{"$f":"IF(AND(AG$16*1>=$R137,AG$16*1<=$D$8,$R137<$D$8,$P137>SUM($V137:AF137)),IF(SUM($P137*$U137/12,$V137:AF137)>$P137,$P137-SUM($V137:AF137),$P137*$U137/12),0)","v":{"v":0,"d":"0.00"}},{"$f":"IF(AND(AH$16*1>=$R137,AH$16*1<=$D$8,$R137<$D$8,$P137>SUM($V137:AG137)),IF(SUM($P137*$U137/12,$V137:AG137)>$P137,$P137-SUM($V137:AG137),$P137*$U137/12),0)","v":{"v":0,"d":"0.00"}},{"v":130.03125,"d":"130.03"},null,null,{"v":312.07875,"d":"312.08"},null,{"v":312.07875,"d":"312.08"}]
[null,null,122,"336111","PC INTEL CORE 13 4GB/ MONIT.19\"",{"$nulls":3},1561.86,{"$nulls":4},1561.86,null,{"v":1561.86,"d":"1,561.86"},"2018-04-03","2018-05-01",null,null,{"v":0.25,"d":"25%"},260.31,{"$f":"IF(AND(W$16*1>=$R138,W$16*1<=$D$8,$R138<$D$8,$P138>SUM($V138:V138)),IF(SUM($P138*$U138/12,$V138:V138)>$P138,$P138-SUM($V138:V138),$P138*$U138/12),0)","v":{"v":32.53875,"d":"32.54"}},{"$f":"IF(AND(X$16*1>=$R138,X$16*1<=$D$8,$R138<$D$8,$P138>SUM($V138:W138)),IF(SUM($P138*$U138/12,$V138:W138)>$P138,$P138-SUM($V138:W138),$P138*$U138/12),0)","v":{"v":32.53875,"d":"32.54"}},{"$f":"IF(AND(Y$16*1>=$R138,Y$16*1<=$D$8,$R138<$D$8,$P138>SUM($V138:X138)),IF(SUM($P138*$U138/12,$V138:X138)>$P138,$P138-SUM($V138:X138),$P138*$U138/12),0)","v":{"v":32.53875,"d":"32.54"}},{"$f":"IF(AND(Z$16*1>=$R138,Z$16*1<=$D$8,$R138<$D$8,$P138>SUM($V138:Y138)),IF(SUM($P138*$U138/12,$V138:Y138)>$P138,$P138-SUM($V138:Y138),$P138*$U138/12),0)","v":{"v":32.53875,"d":"32.54"}},{"$f":"IF(AND(AA$16*1>=$R138,AA$16*1<=$D$8,$R138<$D$8,$P138>SUM($V138:Z138)),IF(SUM($P138*$U138/12,$V138:Z138)>$P138,$P138-SUM($V138:Z138),$P138*$U138/12),0)","v":{"v":32.53875,"d":"32.54"}},{"$f":"IF(AND(AB$16*1>=$R138,AB$16*1<=$D$8,$R138<$D$8,$P138>SUM($V138:AA138)),IF(SUM($P138*$U138/12,$V138:AA138)>$P138,$P138-SUM($V138:AA138),$P138*$U138/12),0)","v":{"v":0,"d":"0.00"}},{"$f":"IF(AND(AC$16*1>=$R138,AC$16*1<=$D$8,$R138<$D$8,$P138>SUM($V138:AB138)),IF(SUM($P138*$U138/12,$V138:AB138)>$P138,$P138-SUM($V138:AB138),$P138*$U138/12),0)","v":{"v":0,"d":"0.00"}},{"$f":"IF(AND(AD$16*1>=$R138,AD$16*1<=$D$8,$R138<$D$8,$P138>SUM($V138:AC138)),IF(SUM($P138*$U138/12,$V138:AC138)>$P138,$P138-SUM($V138:AC138),$P138*$U138/12),0)","v":{"v":0,"d":"0.00"}},{"$f":"IF(AND(AE$16*1>=$R138,AE$16*1<=$D$8,$R138<$D$8,$P138>SUM($V138:AD138)),IF(SUM($P138*$U138/12,$V138:AD138)>$P138,$P138-SUM($V138:AD138),$P138*$U138/12),0)","v":{"v":0,"d":"0.00"}},{"$f":"IF(AND(AF$16*1>=$R138,AF$16*1<=$D$8,$R138<$D$8,$P138>SUM($V138:AE138)),IF(SUM($P138*$U138/12,$V138:AE138)>$P138,$P138-SUM($V138:AE138),$P138*$U138/12),0)","v":{"v":0,"d":"0.00"}},{"$f":"IF(AND(AG$16*1>=$R138,AG$16*1<=$D$8,$R138<$D$8,$P138>SUM($V138:AF138)),IF(SUM($P138*$U138/12,$V138:AF138)>$P138,$P138-SUM($V138:AF138),$P138*$U138/12),0)","v":{"v":0,"d":"0.00"}},{"$f":"IF(AND(AH$16*1>=$R138,AH$16*1<=$D$8,$R138<$D$8,$P138>SUM($V138:AG138)),IF(SUM($P138*$U138/12,$V138:AG138)>$P138,$P138-SUM($V138:AG138),$P138*$U138/12),0)","v":{"v":0,"d":"0.00"}},{"v":162.69375,"d":"162.69"},null,null,{"v":357.92625,"d":"357.93"},null,{"v":357.92625,"d":"357.93"}]
[null,null,123,"336111","COMPUT.INTEL, 4GB, DD500GB (MARC",{"$nulls":3},1720.68,{"$nulls":4},1720.68,null,{"v":1720.68,"d":"1,720.68"},"2018-09-03","2018-10-01",null,null,{"v":0.25,"d":"25%"},107.54,{"$f":"IF(AND(W$16*1>=$R139,W$16*1<=$D$8,$R139<$D$8,$P139>SUM($V139:V139)),IF(SUM($P139*$U139/12,$V139:V139)>$P139,$P139-SUM($V139:V139),$P139*$U139/12),0)","v":{"v":35.847500000000004,"d":"35.85"}},{"$f":"IF(AND(X$16*1>=$R139,X$16*1<=$D$8,$R139<$D$8,$P139>SUM($V139:W139)),IF(SUM($P139*$U139/12,$V139:W139)>$P139,$P139-SUM($V139:W139),$P139*$U139/12),0)","v":{"v":35.847500000000004,"d":"35.85"}},{"$f":"IF(AND(Y$16*1>=$R139,Y$16*1<=$D$8,$R139<$D$8,$P139>SUM($V139:X139)),IF(SUM($P139*$U139/12,$V139:X139)>$P139,$P139-SUM($V139:X139),$P139*$U139/12),0)","v":{"v":35.847500000000004,"d":"35.85"}},{"$f":"IF(AND(Z$16*1>=$R139,Z$16*1<=$D$8,$R139<$D$8,$P139>SUM($V139:Y139)),IF(SUM($P139*$U139/12,$V139:Y139)>$P139,$P139-SUM($V139:Y139),$P139*$U139/12),0)","v":{"v":35.847500000000004,"d":"35.85"}},{"$f":"IF(AND(AA$16*1>=$R139,AA$16*1<=$D$8,$R139<$D$8,$P139>SUM($V139:Z139)),IF(SUM($P139*$U139/12,$V139:Z139)>$P139,$P139-SUM($V139:Z139),$P139*$U139/12),0)","v":{"v":35.847500000000004,"d":"35.85"}},{"$f":"IF(AND(AB$16*1>=$R139,AB$16*1<=$D$8,$R139<$D$8,$P139>SUM($V139:AA139)),IF(SUM($P139*$U139/12,$V139:AA139)>$P139,$P139-SUM($V139:AA139),$P139*$U139/12),0)","v":{"v":0,"d":"0.00"}},{"$f":"IF(AND(AC$16*1>=$R139,AC$16*1<=$D$8,$R139<$D$8,$P139>SUM($V139:AB139)),IF(SUM($P139*$U139/12,$V139:AB139)>$P139,$P139-SUM($V139:AB139),$P139*$U139/12),0)","v":{"v":0,"d":"0.00"}},{"$f":"IF(AND(AD$16*1>=$R139,AD$16*1<=$D$8,$R139<$D$8,$P139>SUM($V139:AC139)),IF(SUM($P139*$U139/12,$V139:AC139)>$P139,$P139-SUM($V139:AC139),$P139*$U139/12),0)","v":{"v":0,"d":"0.00"}},{"$f":"IF(AND(AE$16*1>=$R139,AE$16*1<=$D$8,$R139<$D$8,$P139>SUM($V139:AD139)),IF(SUM($P139*$U139/12,$V139:AD139)>$P139,$P139-SUM($V139:AD139),$P139*$U139/12),0)","v":{"v":0,"d":"0.00"}},{"$f":"IF(AND(AF$16*1>=$R139,AF$16*1<=$D$8,$R139<$D$8,$P139>SUM($V139:AE139)),IF(SUM($P139*$U139/12,$V139:AE139)>$P139,$P139-SUM($V139:AE139),$P139*$U139/12),0)","v":{"v":0,"d":"0.00"}},{"$f":"IF(AND(AG$16*1>=$R139,AG$16*1<=$D$8,$R139<$D$8,$P139>SUM($V139:AF139)),IF(SUM($P139*$U139/12,$V139:AF139)>$P139,$P139-SUM($V139:AF139),$P139*$U139/12),0)","v":{"v":0,"d":"0.00"}},{"$f":"IF(AND(AH$16*1>=$R139,AH$16*1<=$D$8,$R139<$D$8,$P139>SUM($V139:AG139)),IF(SUM($P139*$U139/12,$V139:AG139)>$P139,$P139-SUM($V139:AG139),$P139*$U139/12),0)","v":{"v":0,"d":"0.00"}},{"v":179.2375,"d":"179.24"},null,null,{"v":215.08250000000004,"d":"215.08"},null,{"v":215.08250000000004,"d":"215.08"}]
[null,null,124,"336111","IMPRESORA HP 4555 (CF)",{"$nulls":3},389.83,{"$nulls":4},389.83,null,389.83,"2018-09-04","2018-10-01",null,null,{"v":0.25,"d":"25%"},24.36,{"$f":"IF(AND(W$16*1>=$R140,W$16*1<=$D$8,$R140<$D$8,$P140>SUM($V140:V140)),IF(SUM($P140*$U140/12,$V140:V140)>$P140,$P140-SUM($V140:V140),$P140*$U140/12),0)","v":{"v":8.121458333333333,"d":"8.12"}},{"$f":"IF(AND(X$16*1>=$R140,X$16*1<=$D$8,$R140<$D$8,$P140>SUM($V140:W140)),IF(SUM($P140*$U140/12,$V140:W140)>$P140,$P140-SUM($V140:W140),$P140*$U140/12),0)","v":{"v":8.121458333333333,"d":"8.12"}},{"$f":"IF(AND(Y$16*1>=$R140,Y$16*1<=$D$8,$R140<$D$8,$P140>SUM($V140:X140)),IF(SUM($P140*$U140/12,$V140:X140)>$P140,$P140-SUM($V140:X140),$P140*$U140/12),0)","v":{"v":8.121458333333333,"d":"8.12"}},{"$f":"IF(AND(Z$16*1>=$R140,Z$16*1<=$D$8,$R140<$D$8,$P140>SUM($V140:Y140)),IF(SUM($P140*$U140/12,$V140:Y140)>$P140,$P140-SUM($V140:Y140),$P140*$U140/12),0)","v":{"v":8.121458333333333,"d":"8.12"}},{"$f":"IF(AND(AA$16*1>=$R140,AA$16*1<=$D$8,$R140<$D$8,$P140>SUM($V140:Z140)),IF(SUM($P140*$U140/12,$V140:Z140)>$P140,$P140-SUM($V140:Z140),$P140*$U140/12),0)","v":{"v":8.121458333333333,"d":"8.12"}},{"$f":"IF(AND(AB$16*1>=$R140,AB$16*1<=$D$8,$R140<$D$8,$P140>SUM($V140:AA140)),IF(SUM($P140*$U140/12,$V140:AA140)>$P140,$P140-SUM($V140:AA140),$P140*$U140/12),0)","v":{"v":0,"d":"0.00"}},{"$f":"IF(AND(AC$16*1>=$R140,AC$16*1<=$D$8,$R140<$D$8,$P140>SUM($V140:AB140)),IF(SUM($P140*$U140/12,$V140:AB140)>$P140,$P140-SUM($V140:AB140),$P140*$U140/12),0)","v":{"v":0,"d":"0.00"}},{"$f":"IF(AND(AD$16*1>=$R140,AD$16*1<=$D$8,$R140<$D$8,$P140>SUM($V140:AC140)),IF(SUM($P140*$U140/12,$V140:AC140)>$P140,$P140-SUM($V140:AC140),$P140*$U140/12),0)","v":{"v":0,"d":"0.00"}},{"$f":"IF(AND(AE$16*1>=$R140,AE$16*1<=$D$8,$R140<$D$8,$P140>SUM($V140:AD140)),IF(SUM($P140*$U140/12,$V140:AD140)>$P140,$P140-SUM($V140:AD140),$P140*$U140/12),0)","v":{"v":0,"d":"0.00"}},{"$f":"IF(AND(AF$16*1>=$R140,AF$16*1<=$D$8,$R140<$D$8,$P140>SUM($V140:AE140)),IF(SUM($P140*$U140/12,$V140:AE140)>$P140,$P140-SUM($V140:AE140),$P140*$U140/12),0)","v":{"v":0,"d":"0.00"}},{"$f":"IF(AND(AG$16*1>=$R140,AG$16*1<=$D$8,$R140<$D$8,$P140>SUM($V140:AF140)),IF(SUM($P140*$U140/12,$V140:AF140)>$P140,$P140-SUM($V140:AF140),$P140*$U140/12),0)","v":{"v":0,"d":"0.00"}},{"$f":"IF(AND(AH$16*1>=$R140,AH$16*1<=$D$8,$R140<$D$8,$P140>SUM($V140:AG140)),IF(SUM($P140*$U140/12,$V140:AG140)>$P140,$P140-SUM($V140:AG140),$P140*$U140/12),0)","v":{"v":0,"d":"0.00"}},{"v":40.60729166666667,"d":"40.61"},null,null,{"v":48.724374999999995,"d":"48.72"},null,{"v":48.724374999999995,"d":"48.72"}]
[null,null,125,"336111","COMPUT.INTEL, 4GB, DD500M(PATEN",{"$nulls":3},1720.68,{"$nulls":4},1720.68,null,{"v":1720.68,"d":"1,720.68"},"2018-09-08","2018-10-01",null,null,{"v":0.25,"d":"25%"},107.54,{"$f":"IF(AND(W$16*1>=$R141,W$16*1<=$D$8,$R141<$D$8,$P141>SUM($V141:V141)),IF(SUM($P141*$U141/12,$V141:V141)>$P141,$P141-SUM($V141:V141),$P141*$U141/12),0)","v":{"v":35.847500000000004,"d":"35.85"}},{"$f":"IF(AND(X$16*1>=$R141,X$16*1<=$D$8,$R141<$D$8,$P141>SUM($V141:W141)),IF(SUM($P141*$U141/12,$V141:W141)>$P141,$P141-SUM($V141:W141),$P141*$U141/12),0)","v":{"v":35.847500000000004,"d":"35.85"}},{"$f":"IF(AND(Y$16*1>=$R141,Y$16*1<=$D$8,$R141<$D$8,$P141>SUM($V141:X141)),IF(SUM($P141*$U141/12,$V141:X141)>$P141,$P141-SUM($V141:X141),$P141*$U141/12),0)","v":{"v":35.847500000000004,"d":"35.85"}},{"$f":"IF(AND(Z$16*1>=$R141,Z$16*1<=$D$8,$R141<$D$8,$P141>SUM($V141:Y141)),IF(SUM($P141*$U141/12,$V141:Y141)>$P141,$P141-SUM($V141:Y141),$P141*$U141/12),0)","v":{"v":35.847500000000004,"d":"35.85"}},{"$f":"IF(AND(AA$16*1>=$R141,AA$16*1<=$D$8,$R141<$D$8,$P141>SUM($V141:Z141)),IF(SUM($P141*$U141/12,$V141:Z141)>$P141,$P141-SUM($V141:Z141),$P141*$U141/12),0)","v":{"v":35.847500000000004,"d":"35.85"}},{"$f":"IF(AND(AB$16*1>=$R141,AB$16*1<=$D$8,$R141<$D$8,$P141>SUM($V141:AA141)),IF(SUM($P141*$U141/12,$V141:AA141)>$P141,$P141-SUM($V141:AA141),$P141*$U141/12),0)","v":{"v":0,"d":"0.00"}},{"$f":"IF(AND(AC$16*1>=$R141,AC$16*1<=$D$8,$R141<$D$8,$P141>SUM($V141:AB141)),IF(SUM($P141*$U141/12,$V141:AB141)>$P141,$P141-SUM($V141:AB141),$P141*$U141/12),0)","v":{"v":0,"d":"0.00"}},{"$f":"IF(AND(AD$16*1>=$R141,AD$16*1<=$D$8,$R141<$D$8,$P141>SUM($V141:AC141)),IF(SUM($P141*$U141/12,$V141:AC141)>$P141,$P141-SUM($V141:AC141),$P141*$U141/12),0)","v":{"v":0,"d":"0.00"}},{"$f":"IF(AND(AE$16*1>=$R141,AE$16*1<=$D$8,$R141<$D$8,$P141>SUM($V141:AD141)),IF(SUM($P141*$U141/12,$V141:AD141)>$P141,$P141-SUM($V141:AD141),$P141*$U141/12),0)","v":{"v":0,"d":"0.00"}},{"$f":"IF(AND(AF$16*1>=$R141,AF$16*1<=$D$8,$R141<$D$8,$P141>SUM($V141:AE141)),IF(SUM($P141*$U141/12,$V141:AE141)>$P141,$P141-SUM($V141:AE141),$P141*$U141/12),0)","v":{"v":0,"d":"0.00"}},{"$f":"IF(AND(AG$16*1>=$R141,AG$16*1<=$D$8,$R141<$D$8,$P141>SUM($V141:AF141)),IF(SUM($P141*$U141/12,$V141:AF141)>$P141,$P141-SUM($V141:AF141),$P141*$U141/12),0)","v":{"v":0,"d":"0.00"}},{"$f":"IF(AND(AH$16*1>=$R141,AH$16*1<=$D$8,$R141<$D$8,$P141>SUM($V141:AG141)),IF(SUM($P141*$U141/12,$V141:AG141)>$P141,$P141-SUM($V141:AG141),$P141*$U141/12),0)","v":{"v":0,"d":"0.00"}},{"v":179.2375,"d":"179.24"},null,null,{"v":215.08250000000004,"d":"215.08"},null,{"v":215.08250000000004,"d":"215.08"}]
[null,null,126,"336111","COMPUT.INTEL, 4GB, DD500M(PAT)",{"$nulls":3},1693.22,{"$nulls":4},1693.22,null,{"v":1693.22,"d":"1,693.22"},"2018-11-03","2018-12-01",null,null,{"v":0.25,"d":"25%"},35.28,{"$f":"IF(AND(W$16*1>=$R142,W$16*1<=$D$8,$R142<$D$8,$P142>SUM($V142:V142)),IF(SUM($P142*$U142/12,$V142:V142)>$P142,$P142-SUM($V142:V142),$P142*$U142/12),0)","v":{"v":35.275416666666665,"d":"35.28"}},{"$f":"IF(AND(X$16*1>=$R142,X$16*1<=$D$8,$R142<$D$8,$P142>SUM($V142:W142)),IF(SUM($P142*$U142/12,$V142:W142)>$P142,$P142-SUM($V142:W142),$P142*$U142/12),0)","v":{"v":35.275416666666665,"d":"35.28"}},{"$f":"IF(AND(Y$16*1>=$R142,Y$16*1<=$D$8,$R142<$D$8,$P142>SUM($V142:X142)),IF(SUM($P142*$U142/12,$V142:X142)>$P142,$P142-SUM($V142:X142),$P142*$U142/12),0)","v":{"v":35.275416666666665,"d":"35.28"}},{"$f":"IF(AND(Z$16*1>=$R142,Z$16*1<=$D$8,$R142<$D$8,$P142>SUM($V142:Y142)),IF(SUM($P142*$U142/12,$V142:Y142)>$P142,$P142-SUM($V142:Y142),$P142*$U142/12),0)","v":{"v":35.275416666666665,"d":"35.28"}},{"$f":"IF(AND(AA$16*1>=$R142,AA$16*1<=$D$8,$R142<$D$8,$P142>SUM($V142:Z142)),IF(SUM($P142*$U142/12,$V142:Z142)>$P142,$P142-SUM($V142:Z142),$P142*$U142/12),0)","v":{"v":35.275416666666665,"d":"35.28"}},{"$f":"IF(AND(AB$16*1>=$R142,AB$16*1<=$D$8,$R142<$D$8,$P142>SUM($V142:AA142)),IF(SUM($P142*$U142/12,$V142:AA142)>$P142,$P142-SUM($V142:AA142),$P142*$U142/12),0)","v":{"v":0,"d":"0.00"}},{"$f":"IF(AND(AC$16*1>=$R142,AC$16*1<=$D$8,$R142<$D$8,$P142>SUM($V142:AB142)),IF(SUM($P142*$U142/12,$V142:AB142)>$P142,$P142-SUM($V142:AB142),$P142*$U142/12),0)","v":{"v":0,"d":"0.00"}},{"$f":"IF(AND(AD$16*1>=$R142,AD$16*1<=$D$8,$R142<$D$8,$P142>SUM($V142:AC142)),IF(SUM($P142*$U142/12,$V142:AC142)>$P142,$P142-SUM($V142:AC142),$P142*$U142/12),0)","v":{"v":0,"d":"0.00"}},{"$f":"IF(AND(AE$16*1>=$R142,AE$16*1<=$D$8,$R142<$D$8,$P142>SUM($V142:AD142)),IF(SUM($P142*$U142/12,$V142:AD142)>$P142,$P142-SUM($V142:AD142),$P142*$U142/12),0)","v":{"v":0,"d":"0.00"}},{"$f":"IF(AND(AF$16*1>=$R142,AF$16*1<=$D$8,$R142<$D$8,$P142>SUM($V142:AE142)),IF(SUM($P142*$U142/12,$V142:AE142)>$P142,$P142-SUM($V142:AE142),$P142*$U142/12),0)","v":{"v":0,"d":"0.00"}},{"$f":"IF(AND(AG$16*1>=$R142,AG$16*1<=$D$8,$R142<$D$8,$P142>SUM($V142:AF142)),IF(SUM($P142*$U142/12,$V142:AF142)>$P142,$P142-SUM($V142:AF142),$P142*$U142/12),0)","v":{"v":0,"d":"0.00"}},{"$f":"IF(AND(AH$16*1>=$R142,AH$16*1<=$D$8,$R142<$D$8,$P142>SUM($V142:AG142)),IF(SUM($P142*$U142/12,$V142:AG142)>$P142,$P142-SUM($V142:AG142),$P142*$U142/12),0)","v":{"v":0,"d":"0.00"}},{"v":176.37708333333333,"d":"176.38"},null,null,{"v":141.10625,"d":"141.11"},null,{"v":141.10625,"d":"141.11"}]
[null,null,127,"336111","COMPUT.INTEL, 4GB, DD500M",{"$nulls":3},1363.56,{"$nulls":4},1363.56,null,{"v":1363.56,"d":"1,363.56"},"2018-11-05","2018-12-01",null,null,{"v":0.25,"d":"25%"},28.41,{"$f":"IF(AND(W$16*1>=$R143,W$16*1<=$D$8,$R143<$D$8,$P143>SUM($V143:V143)),IF(SUM($P143*$U143/12,$V143:V143)>$P143,$P143-SUM($V143:V143),$P143*$U143/12),0)","v":{"v":28.4075,"d":"28.41"}},{"$f":"IF(AND(X$16*1>=$R143,X$16*1<=$D$8,$R143<$D$8,$P143>SUM($V143:W143)),IF(SUM($P143*$U143/12,$V143:W143)>$P143,$P143-SUM($V143:W143),$P143*$U143/12),0)","v":{"v":28.4075,"d":"28.41"}},{"$f":"IF(AND(Y$16*1>=$R143,Y$16*1<=$D$8,$R143<$D$8,$P143>SUM($V143:X143)),IF(SUM($P143*$U143/12,$V143:X143)>$P143,$P143-SUM($V143:X143),$P143*$U143/12),0)","v":{"v":28.4075,"d":"28.41"}},{"$f":"IF(AND(Z$16*1>=$R143,Z$16*1<=$D$8,$R143<$D$8,$P143>SUM($V143:Y143)),IF(SUM($P143*$U143/12,$V143:Y143)>$P143,$P143-SUM($V143:Y143),$P143*$U143/12),0)","v":{"v":28.4075,"d":"28.41"}},{"$f":"IF(AND(AA$16*1>=$R143,AA$16*1<=$D$8,$R143<$D$8,$P143>SUM($V143:Z143)),IF(SUM($P143*$U143/12,$V143:Z143)>$P143,$P143-SUM($V143:Z143),$P143*$U143/12),0)","v":{"v":28.4075,"d":"28.41"}},{"$f":"IF(AND(AB$16*1>=$R143,AB$16*1<=$D$8,$R143<$D$8,$P143>SUM($V143:AA143)),IF(SUM($P143*$U143/12,$V143:AA143)>$P143,$P143-SUM($V143:AA143),$P143*$U143/12),0)","v":{"v":0,"d":"0.00"}},{"$f":"IF(AND(AC$16*1>=$R143,AC$16*1<=$D$8,$R143<$D$8,$P143>SUM($V143:AB143)),IF(SUM($P143*$U143/12,$V143:AB143)>$P143,$P143-SUM($V143:AB143),$P143*$U143/12),0)","v":{"v":0,"d":"0.00"}},{"$f":"IF(AND(AD$16*1>=$R143,AD$16*1<=$D$8,$R143<$D$8,$P143>SUM($V143:AC143)),IF(SUM($P143*$U143/12,$V143:AC143)>$P143,$P143-SUM($V143:AC143),$P143*$U143/12),0)","v":{"v":0,"d":"0.00"}},{"$f":"IF(AND(AE$16*1>=$R143,AE$16*1<=$D$8,$R143<$D$8,$P143>SUM($V143:AD143)),IF(SUM($P143*$U143/12,$V143:AD143)>$P143,$P143-SUM($V143:AD143),$P143*$U143/12),0)","v":{"v":0,"d":"0.00"}},{"$f":"IF(AND(AF$16*1>=$R143,AF$16*1<=$D$8,$R143<$D$8,$P143>SUM($V143:AE143)),IF(SUM($P143*$U143/12,$V143:AE143)>$P143,$P143-SUM($V143:AE143),$P143*$U143/12),0)","v":{"v":0,"d":"0.00"}},{"$f":"IF(AND(AG$16*1>=$R143,AG$16*1<=$D$8,$R143<$D$8,$P143>SUM($V143:AF143)),IF(SUM($P143*$U143/12,$V143:AF143)>$P143,$P143-SUM($V143:AF143),$P143*$U143/12),0)","v":{"v":0,"d":"0.00"}},{"$f":"IF(AND(AH$16*1>=$R143,AH$16*1<=$D$8,$R143<$D$8,$P143>SUM($V143:AG143)),IF(SUM($P143*$U143/12,$V143:AG143)>$P143,$P143-SUM($V143:AG143),$P143*$U143/12),0)","v":{"v":0,"d":"0.00"}},{"v":142.0375,"d":"142.04"},null,null,{"v":113.6325,"d":"113.63"},null,{"v":113.6325,"d":"113.63"}]
[null,null,128,"336211","TELEFONO Y TRANSFORMADOR",{"$nulls":3},787.25,{"$nulls":4},787.25,null,787.25,"1999-12-11","2000-01-01",null,null,{"v":0.1,"d":"10%"},787.25,{"$f":"IF(AND(W$16*1>=$R144,W$16*1<=$D$8,$R144<$D$8,$P144>SUM($V144:V144)),IF(SUM($P144*$U144/12,$V144:V144)>$P144,$P144-SUM($V144:V144),$P144*$U144/12),0)","v":{"v":0,"d":"0.00"}},{"$f":"IF(AND(X$16*1>=$R144,X$16*1<=$D$8,$R144<$D$8,$P144>SUM($V144:W144)),IF(SUM($P144*$U144/12,$V144:W144)>$P144,$P144-SUM($V144:W144),$P144*$U144/12),0)","v":{"v":0,"d":"0.00"}},{"$f":"IF(AND(Y$16*1>=$R144,Y$16*1<=$D$8,$R144<$D$8,$P144>SUM($V144:X144)),IF(SUM($P144*$U144/12,$V144:X144)>$P144,$P144-SUM($V144:X144),$P144*$U144/12),0)","v":{"v":0,"d":"0.00"}},{"$f":"IF(AND(Z$16*1>=$R144,Z$16*1<=$D$8,$R144<$D$8,$P144>SUM($V144:Y144)),IF(SUM($P144*$U144/12,$V144:Y144)>$P144,$P144-SUM($V144:Y144),$P144*$U144/12),0)","v":{"v":0,"d":"0.00"}},{"$f":"IF(AND(AA$16*1>=$R144,AA$16*1<=$D$8,$R144<$D$8,$P144>SUM($V144:Z144)),IF(SUM($P144*$U144/12,$V144:Z144)>$P144,$P144-SUM($V144:Z144),$P144*$U144/12),0)","v":{"v":0,"d":"0.00"}},{"$f":"IF(AND(AB$16*1>=$R144,AB$16*1<=$D$8,$R144<$D$8,$P144>SUM($V144:AA144)),IF(SUM($P144*$U144/12,$V144:AA144)>$P144,$P144-SUM($V144:AA144),$P144*$U144/12),0)","v":{"v":0,"d":"0.00"}},{"$f":"IF(AND(AC$16*1>=$R144,AC$16*1<=$D$8,$R144<$D$8,$P144>SUM($V144:AB144)),IF(SUM($P144*$U144/12,$V144:AB144)>$P144,$P144-SUM($V144:AB144),$P144*$U144/12),0)","v":{"v":0,"d":"0.00"}},{"$f":"IF(AND(AD$16*1>=$R144,AD$16*1<=$D$8,$R144<$D$8,$P144>SUM($V144:AC144)),IF(SUM($P144*$U144/12,$V144:AC144)>$P144,$P144-SUM($V144:AC144),$P144*$U144/12),0)","v":{"v":0,"d":"0.00"}},{"$f":"IF(AND(AE$16*1>=$R144,AE$16*1<=$D$8,$R144<$D$8,$P144>SUM($V144:AD144)),IF(SUM($P144*$U144/12,$V144:AD144)>$P144,$P144-SUM($V144:AD144),$P144*$U144/12),0)","v":{"v":0,"d":"0.00"}},{"$f":"IF(AND(AF$16*1>=$R144,AF$16*1<=$D$8,$R144<$D$8,$P144>SUM($V144:AE144)),IF(SUM($P144*$U144/12,$V144:AE144)>$P144,$P144-SUM($V144:AE144),$P144*$U144/12),0)","v":{"v":0,"d":"0.00"}},{"$f":"IF(AND(AG$16*1>=$R144,AG$16*1<=$D$8,$R144<$D$8,$P144>SUM($V144:AF144)),IF(SUM($P144*$U144/12,$V144:AF144)>$P144,$P144-SUM($V144:AF144),$P144*$U144/12),0)","v":{"v":0,"d":"0.00"}},{"$f":"IF(AND(AH$16*1>=$R144,AH$16*1<=$D$8,$R144<$D$8,$P144>SUM($V144:AG144)),IF(SUM($P144*$U144/12,$V144:AG144)>$P144,$P144-SUM($V144:AG144),$P144*$U144/12),0)","v":{"v":0,"d":"0.00"}},{"v":0,"d":"0.00"},null,null,787.25,null,787.25]
[null,null,137,"336211","FACSIMIL OFX 580 OLIVETTI",{"$nulls":3},951.34,{"$nulls":4},951.34,null,951.34,"2006-03-04","2006-04-01",null,null,{"v":0.1,"d":"10%"},951.34,{"$f":"IF(AND(W$16*1>=$R145,W$16*1<=$D$8,$R145<$D$8,$P145>SUM($V145:V145)),IF(SUM($P145*$U145/12,$V145:V145)>$P145,$P145-SUM($V145:V145),$P145*$U145/12),0)","v":{"v":0,"d":"0.00"}},{"$f":"IF(AND(X$16*1>=$R145,X$16*1<=$D$8,$R145<$D$8,$P145>SUM($V145:W145)),IF(SUM($P145*$U145/12,$V145:W145)>$P145,$P145-SUM($V145:W145),$P145*$U145/12),0)","v":{"v":0,"d":"0.00"}},{"$f":"IF(AND(Y$16*1>=$R145,Y$16*1<=$D$8,$R145<$D$8,$P145>SUM($V145:X145)),IF(SUM($P145*$U145/12,$V145:X145)>$P145,$P145-SUM($V145:X145),$P145*$U145/12),0)","v":{"v":0,"d":"0.00"}},{"$f":"IF(AND(Z$16*1>=$R145,Z$16*1<=$D$8,$R145<$D$8,$P145>SUM($V145:Y145)),IF(SUM($P145*$U145/12,$V145:Y145)>$P145,$P145-SUM($V145:Y145),$P145*$U145/12),0)","v":{"v":0,"d":"0.00"}},{"$f":"IF(AND(AA$16*1>=$R145,AA$16*1<=$D$8,$R145<$D$8,$P145>SUM($V145:Z145)),IF(SUM($P145*$U145/12,$V145:Z145)>$P145,$P145-SUM($V145:Z145),$P145*$U145/12),0)","v":{"v":0,"d":"0.00"}},{"$f":"IF(AND(AB$16*1>=$R145,AB$16*1<=$D$8,$R145<$D$8,$P145>SUM($V145:AA145)),IF(SUM($P145*$U145/12,$V145:AA145)>$P145,$P145-SUM($V145:AA145),$P145*$U145/12),0)","v":{"v":0,"d":"0.00"}},{"$f":"IF(AND(AC$16*1>=$R145,AC$16*1<=$D$8,$R145<$D$8,$P145>SUM($V145:AB145)),IF(SUM($P145*$U145/12,$V145:AB145)>$P145,$P145-SUM($V145:AB145),$P145*$U145/12),0)","v":{"v":0,"d":"0.00"}},{"$f":"IF(AND(AD$16*1>=$R145,AD$16*1<=$D$8,$R145<$D$8,$P145>SUM($V145:AC145)),IF(SUM($P145*$U145/12,$V145:AC145)>$P145,$P145-SUM($V145:AC145),$P145*$U145/12),0)","v":{"v":0,"d":"0.00"}},{"$f":"IF(AND(AE$16*1>=$R145,AE$16*1<=$D$8,$R145<$D$8,$P145>SUM($V145:AD145)),IF(SUM($P145*$U145/12,$V145:AD145)>$P145,$P145-SUM($V145:AD145),$P145*$U145/12),0)","v":{"v":0,"d":"0.00"}},{"$f":"IF(AND(AF$16*1>=$R145,AF$16*1<=$D$8,$R145<$D$8,$P145>SUM($V145:AE145)),IF(SUM($P145*$U145/12,$V145:AE145)>$P145,$P145-SUM($V145:AE145),$P145*$U145/12),0)","v":{"v":0,"d":"0.00"}},{"$f":"IF(AND(AG$16*1>=$R145,AG$16*1<=$D$8,$R145<$D$8,$P145>SUM($V145:AF145)),IF(SUM($P145*$U145/12,$V145:AF145)>$P145,$P145-SUM($V145:AF145),$P145*$U145/12),0)","v":{"v":0,"d":"0.00"}},{"$f":"IF(AND(AH$16*1>=$R145,AH$16*1<=$D$8,$R145<$D$8,$P145>SUM($V145:AG145)),IF(SUM($P145*$U145/12,$V145:AG145)>$P145,$P145-SUM($V145:AG145),$P145*$U145/12),0)","v":{"v":0,"d":"0.00"}},{"$f":"SUM(W145:AH145)","v":{"v":0,"d":"0.00"}},null,null,951.34,null,951.34]
[null,null,138,"336211","TELEFONO MULTILINEA NX1232",{"$nulls":3},347.59,{"$nulls":4},347.59,null,347.59,"2006-03-12","2006-04-01",null,null,{"v":0.1,"d":"10%"},347.59,{"$f":"IF(AND(W$16*1>=$R146,W$16*1<=$D$8,$R146<$D$8,$P146>SUM($V146:V146)),IF(SUM($P146*$U146/12,$V146:V146)>$P146,$P146-SUM($V146:V146),$P146*$U146/12),0)","v":{"v":0,"d":"0.00"}},{"$f":"IF(AND(X$16*1>=$R146,X$16*1<=$D$8,$R146<$D$8,$P146>SUM($V146:W146)),IF(SUM($P146*$U146/12,$V146:W146)>$P146,$P146-SUM($V146:W146),$P146*$U146/12),0)","v":{"v":0,"d":"0.00"}},{"$f":"IF(AND(Y$16*1>=$R146,Y$16*1<=$D$8,$R146<$D$8,$P146>SUM($V146:X146)),IF(SUM($P146*$U146/12,$V146:X146)>$P146,$P146-SUM($V146:X146),$P146*$U146/12),0)","v":{"v":0,"d":"0.00"}},{"$f":"IF(AND(Z$16*1>=$R146,Z$16*1<=$D$8,$R146<$D$8,$P146>SUM($V146:Y146)),IF(SUM($P146*$U146/12,$V146:Y146)>$P146,$P146-SUM($V146:Y146),$P146*$U146/12),0)","v":{"v":0,"d":"0.00"}},{"$f":"IF(AND(AA$16*1>=$R146,AA$16*1<=$D$8,$R146<$D$8,$P146>SUM($V146:Z146)),IF(SUM($P146*$U146/12,$V146:Z146)>$P146,$P146-SUM($V146:Z146),$P146*$U146/12),0)","v":{"v":0,"d":"0.00"}},{"$f":"IF(AND(AB$16*1>=$R146,AB$16*1<=$D$8,$R146<$D$8,$P146>SUM($V146:AA146)),IF(SUM($P146*$U146/12,$V146:AA146)>$P146,$P146-SUM($V146:AA146),$P146*$U146/12),0)","v":{"v":0,"d":"0.00"}},{"$f":"IF(AND(AC$16*1>=$R146,AC$16*1<=$D$8,$R146<$D$8,$P146>SUM($V146:AB146)),IF(SUM($P146*$U146/12,$V146:AB146)>$P146,$P146-SUM($V146:AB146),$P146*$U146/12),0)","v":{"v":0,"d":"0.00"}},{"$f":"IF(AND(AD$16*1>=$R146,AD$16*1<=$D$8,$R146<$D$8,$P146>SUM($V146:AC146)),IF(SUM($P146*$U146/12,$V146:AC146)>$P146,$P146-SUM($V146:AC146),$P146*$U146/12),0)","v":{"v":0,"d":"0.00"}},{"$f":"IF(AND(AE$16*1>=$R146,AE$16*1<=$D$8,$R146<$D$8,$P146>SUM($V146:AD146)),IF(SUM($P146*$U146/12,$V146:AD146)>$P146,$P146-SUM($V146:AD146),$P146*$U146/12),0)","v":{"v":0,"d":"0.00"}},{"$f":"IF(AND(AF$16*1>=$R146,AF$16*1<=$D$8,$R146<$D$8,$P146>SUM($V146:AE146)),IF(SUM($P146*$U146/12,$V146:AE146)>$P146,$P146-SUM($V146:AE146),$P146*$U146/12),0)","v":{"v":0,"d":"0.00"}},{"$f":"IF(AND(AG$16*1>=$R146,AG$16*1<=$D$8,$R146<$D$8,$P146>SUM($V146:AF146)),IF(SUM($P146*$U146/12,$V146:AF146)>$P146,$P146-SUM($V146:AF146),$P146*$U146/12),0)","v":{"v":0,"d":"0.00"}},{"$f":"IF(AND(AH$16*1>=$R146,AH$16*1<=$D$8,$R146<$D$8,$P146>SUM($V146:AG146)),IF(SUM($P146*$U146/12,$V146:AG146)>$P146,$P146-SUM($V146:AG146),$P146*$U146/12),0)","v":{"v":0,"d":"0.00"}},{"v":0,"d":"0.00"},null,null,347.59,null,347.59]
[null,null,139,"336211","EQUIPO INTERNET MILLICOM",{"$nulls":3},529.47,{"$nulls":4},529.47,null,529.47,"2006-03-12","2006-04-01",null,null,{"v":0.1,"d":"10%"},529.47,{"$f":"IF(AND(W$16*1>=$R147,W$16*1<=$D$8,$R147<$D$8,$P147>SUM($V147:V147)),IF(SUM($P147*$U147/12,$V147:V147)>$P147,$P147-SUM($V147:V147),$P147*$U147/12),0)","v":{"v":0,"d":"0.00"}},{"$f":"IF(AND(X$16*1>=$R147,X$16*1<=$D$8,$R147<$D$8,$P147>SUM($V147:W147)),IF(SUM($P147*$U147/12,$V147:W147)>$P147,$P147-SUM($V147:W147),$P147*$U147/12),0)","v":{"v":0,"d":"0.00"}},{"$f":"IF(AND(Y$16*1>=$R147,Y$16*1<=$D$8,$R147<$D$8,$P147>SUM($V147:X147)),IF(SUM($P147*$U147/12,$V147:X147)>$P147,$P147-SUM($V147:X147),$P147*$U147/12),0)","v":{"v":0,"d":"0.00"}},{"$f":"IF(AND(Z$16*1>=$R147,Z$16*1<=$D$8,$R147<$D$8,$P147>SUM($V147:Y147)),IF(SUM($P147*$U147/12,$V147:Y147)>$P147,$P147-SUM($V147:Y147),$P147*$U147/12),0)","v":{"v":0,"d":"0.00"}},{"$f":"IF(AND(AA$16*1>=$R147,AA$16*1<=$D$8,$R147<$D$8,$P147>SUM($V147:Z147)),IF(SUM($P147*$U147/12,$V147:Z147)>$P147,$P147-SUM($V147:Z147),$P147*$U147/12),0)","v":{"v":0,"d":"0.00"}},{"$f":"IF(AND(AB$16*1>=$R147,AB$16*1<=$D$8,$R147<$D$8,$P147>SUM($V147:AA147)),IF(SUM($P147*$U147/12,$V147:AA147)>$P147,$P147-SUM($V147:AA147),$P147*$U147/12),0)","v":{"v":0,"d":"0.00"}},{"$f":"IF(AND(AC$16*1>=$R147,AC$16*1<=$D$8,$R147<$D$8,$P147>SUM($V147:AB147)),IF(SUM($P147*$U147/12,$V147:AB147)>$P147,$P147-SUM($V147:AB147),$P147*$U147/12),0)","v":{"v":0,"d":"0.00"}},{"$f":"IF(AND(AD$16*1>=$R147,AD$16*1<=$D$8,$R147<$D$8,$P147>SUM($V147:AC147)),IF(SUM($P147*$U147/12,$V147:AC147)>$P147,$P147-SUM($V147:AC147),$P147*$U147/12),0)","v":{"v":0,"d":"0.00"}},{"$f":"IF(AND(AE$16*1>=$R147,AE$16*1<=$D$8,$R147<$D$8,$P147>SUM($V147:AD147)),IF(SUM($P147*$U147/12,$V147:AD147)>$P147,$P147-SUM($V147:AD147),$P147*$U147/12),0)","v":{"v":0,"d":"0.00"}},{"$f":"IF(AND(AF$16*1>=$R147,AF$16*1<=$D$8,$R147<$D$8,$P147>SUM($V147:AE147)),IF(SUM($P147*$U147/12,$V147:AE147)>$P147,$P147-SUM($V147:AE147),$P147*$U147/12),0)","v":{"v":0,"d":"0.00"}},{"$f":"IF(AND(AG$16*1>=$R147,AG$16*1<=$D$8,$R147<$D$8,$P147>SUM($V147:AF147)),IF(SUM($P147*$U147/12,$V147:AF147)>$P147,$P147-SUM($V147:AF147),$P147*$U147/12),0)","v":{"v":0,"d":"0.00"}},{"$f":"IF(AND(AH$16*1>=$R147,AH$16*1<=$D$8,$R147<$D$8,$P147>SUM($V147:AG147)),IF(SUM($P147*$U147/12,$V147:AG147)>$P147,$P147-SUM($V147:AG147),$P147*$U147/12),0)","v":{"v":0,"d":"0.00"}},{"v":0,"d":"0.00"},null,null,529.47,null,529.47]
[null,null,140,"336211","FAX MULTIFUNCION OLIVETTI",{"$nulls":3},627.93,{"$nulls":4},627.93,null,627.93,"2006-11-22","2006-12-01",null,null,{"v":0.1,"d":"10%"},627.93,{"$f":"IF(AND(W$16*1>=$R148,W$16*1<=$D$8,$R148<$D$8,$P148>SUM($V148:V148)),IF(SUM($P148*$U148/12,$V148:V148)>$P148,$P148-SUM($V148:V148),$P148*$U148/12),0)","v":{"v":0,"d":"0.00"}},{"$f":"IF(AND(X$16*1>=$R148,X$16*1<=$D$8,$R148<$D$8,$P148>SUM($V148:W148)),IF(SUM($P148*$U148/12,$V148:W148)>$P148,$P148-SUM($V148:W148),$P148*$U148/12),0)","v":{"v":0,"d":"0.00"}},{"$f":"IF(AND(Y$16*1>=$R148,Y$16*1<=$D$8,$R148<$D$8,$P148>SUM($V148:X148)),IF(SUM($P148*$U148/12,$V148:X148)>$P148,$P148-SUM($V148:X148),$P148*$U148/12),0)","v":{"v":0,"d":"0.00"}},{"$f":"IF(AND(Z$16*1>=$R148,Z$16*1<=$D$8,$R148<$D$8,$P148>SUM($V148:Y148)),IF(SUM($P148*$U148/12,$V148:Y148)>$P148,$P148-SUM($V148:Y148),$P148*$U148/12),0)","v":{"v":0,"d":"0.00"}},{"$f":"IF(AND(AA$16*1>=$R148,AA$16*1<=$D$8,$R148<$D$8,$P148>SUM($V148:Z148)),IF(SUM($P148*$U148/12,$V148:Z148)>$P148,$P148-SUM($V148:Z148),$P148*$U148/12),0)","v":{"v":0,"d":"0.00"}},{"$f":"IF(AND(AB$16*1>=$R148,AB$16*1<=$D$8,$R148<$D$8,$P148>SUM($V148:AA148)),IF(SUM($P148*$U148/12,$V148:AA148)>$P148,$P148-SUM($V148:AA148),$P148*$U148/12),0)","v":{"v":0,"d":"0.00"}},{"$f":"IF(AND(AC$16*1>=$R148,AC$16*1<=$D$8,$R148<$D$8,$P148>SUM($V148:AB148)),IF(SUM($P148*$U148/12,$V148:AB148)>$P148,$P148-SUM($V148:AB148),$P148*$U148/12),0)","v":{"v":0,"d":"0.00"}},{"$f":"IF(AND(AD$16*1>=$R148,AD$16*1<=$D$8,$R148<$D$8,$P148>SUM($V148:AC148)),IF(SUM($P148*$U148/12,$V148:AC148)>$P148,$P148-SUM($V148:AC148),$P148*$U148/12),0)","v":{"v":0,"d":"0.00"}},{"$f":"IF(AND(AE$16*1>=$R148,AE$16*1<=$D$8,$R148<$D$8,$P148>SUM($V148:AD148)),IF(SUM($P148*$U148/12,$V148:AD148)>$P148,$P148-SUM($V148:AD148),$P148*$U148/12),0)","v":{"v":0,"d":"0.00"}},{"$f":"IF(AND(AF$16*1>=$R148,AF$16*1<=$D$8,$R148<$D$8,$P148>SUM($V148:AE148)),IF(SUM($P148*$U148/12,$V148:AE148)>$P148,$P148-SUM($V148:AE148),$P148*$U148/12),0)","v":{"v":0,"d":"0.00"}},{"$f":"IF(AND(AG$16*1>=$R148,AG$16*1<=$D$8,$R148<$D$8,$P148>SUM($V148:AF148)),IF(SUM($P148*$U148/12,$V148:AF148)>$P148,$P148-SUM($V148:AF148),$P148*$U148/12),0)","v":{"v":0,"d":"0.00"}},{"$f":"IF(AND(AH$16*1>=$R148,AH$16*1<=$D$8,$R148<$D$8,$P148>SUM($V148:AG148)),IF(SUM($P148*$U148/12,$V148:AG148)>$P148,$P148-SUM($V148:AG148),$P148*$U148/12),0)","v":{"v":0,"d":"0.00"}},{"v":0,"d":"0.00"},null,null,627.93,null,627.93]
[null,null,141,"336211","CONTESTADORA AUTOM.DIGITAL AT&T",{"$nulls":3},164.04,{"$nulls":4},164.04,null,164.04,"2008-12-14","2009-01-01",null,null,{"v":0.1,"d":"10%"},164.04,{"$f":"IF(AND(W$16*1>=$R149,W$16*1<=$D$8,$R149<$D$8,$P149>SUM($V149:V149)),IF(SUM($P149*$U149/12,$V149:V149)>$P149,$P149-SUM($V149:V149),$P149*$U149/12),0)","v":{"v":0,"d":"0.00"}},{"$f":"IF(AND(X$16*1>=$R149,X$16*1<=$D$8,$R149<$D$8,$P149>SUM($V149:W149)),IF(SUM($P149*$U149/12,$V149:W149)>$P149,$P149-SUM($V149:W149),$P149*$U149/12),0)","v":{"v":0,"d":"0.00"}},{"$f":"IF(AND(Y$16*1>=$R149,Y$16*1<=$D$8,$R149<$D$8,$P149>SUM($V149:X149)),IF(SUM($P149*$U149/12,$V149:X149)>$P149,$P149-SUM($V149:X149),$P149*$U149/12),0)","v":{"v":0,"d":"0.00"}},{"$f":"IF(AND(Z$16*1>=$R149,Z$16*1<=$D$8,$R149<$D$8,$P149>SUM($V149:Y149)),IF(SUM($P149*$U149/12,$V149:Y149)>$P149,$P149-SUM($V149:Y149),$P149*$U149/12),0)","v":{"v":0,"d":"0.00"}},{"$f":"IF(AND(AA$16*1>=$R149,AA$16*1<=$D$8,$R149<$D$8,$P149>SUM($V149:Z149)),IF(SUM($P149*$U149/12,$V149:Z149)>$P149,$P149-SUM($V149:Z149),$P149*$U149/12),0)","v":{"v":0,"d":"0.00"}},{"$f":"IF(AND(AB$16*1>=$R149,AB$16*1<=$D$8,$R149<$D$8,$P149>SUM($V149:AA149)),IF(SUM($P149*$U149/12,$V149:AA149)>$P149,$P149-SUM($V149:AA149),$P149*$U149/12),0)","v":{"v":0,"d":"0.00"}},{"$f":"IF(AND(AC$16*1>=$R149,AC$16*1<=$D$8,$R149<$D$8,$P149>SUM($V149:AB149)),IF(SUM($P149*$U149/12,$V149:AB149)>$P149,$P149-SUM($V149:AB149),$P149*$U149/12),0)","v":{"v":0,"d":"0.00"}},{"$f":"IF(AND(AD$16*1>=$R149,AD$16*1<=$D$8,$R149<$D$8,$P149>SUM($V149:AC149)),IF(SUM($P149*$U149/12,$V149:AC149)>$P149,$P149-SUM($V149:AC149),$P149*$U149/12),0)","v":{"v":0,"d":"0.00"}},{"$f":"IF(AND(AE$16*1>=$R149,AE$16*1<=$D$8,$R149<$D$8,$P149>SUM($V149:AD149)),IF(SUM($P149*$U149/12,$V149:AD149)>$P149,$P149-SUM($V149:AD149),$P149*$U149/12),0)","v":{"v":0,"d":"0.00"}},{"$f":"IF(AND(AF$16*1>=$R149,AF$16*1<=$D$8,$R149<$D$8,$P149>SUM($V149:AE149)),IF(SUM($P149*$U149/12,$V149:AE149)>$P149,$P149-SUM($V149:AE149),$P149*$U149/12),0)","v":{"v":0,"d":"0.00"}},{"$f":"IF(AND(AG$16*1>=$R149,AG$16*1<=$D$8,$R149<$D$8,$P149>SUM($V149:AF149)),IF(SUM($P149*$U149/12,$V149:AF149)>$P149,$P149-SUM($V149:AF149),$P149*$U149/12),0)","v":{"v":0,"d":"0.00"}},{"$f":"IF(AND(AH$16*1>=$R149,AH$16*1<=$D$8,$R149<$D$8,$P149>SUM($V149:AG149)),IF(SUM($P149*$U149/12,$V149:AG149)>$P149,$P149-SUM($V149:AG149),$P149*$U149/12),0)","v":{"v":0,"d":"0.00"}},{"v":0,"d":"0.00"},null,null,164.04,null,164.04]
[null,null,142,"336211","TARJ.DISACENTRAL TELEF.MARCA SAMSUNG",{"$nulls":3},794.71,{"$nulls":4},794.71,null,794.71,"2011-05-18","2011-06-01",null,null,{"v":0.1,"d":"10%"},602.65,{"$f":"IF(AND(W$16*1>=$R150,W$16*1<=$D$8,$R150<$D$8,$P150>SUM($V150:V150)),IF(SUM($P150*$U150/12,$V150:V150)>$P150,$P150-SUM($V150:V150),$P150*$U150/12),0)","v":{"v":6.622583333333334,"d":"6.62"}},{"$f":"IF(AND(X$16*1>=$R150,X$16*1<=$D$8,$R150<$D$8,$P150>SUM($V150:W150)),IF(SUM($P150*$U150/12,$V150:W150)>$P150,$P150-SUM($V150:W150),$P150*$U150/12),0)","v":{"v":6.622583333333334,"d":"6.62"}},{"$f":"IF(AND(Y$16*1>=$R150,Y$16*1<=$D$8,$R150<$D$8,$P150>SUM($V150:X150)),IF(SUM($P150*$U150/12,$V150:X150)>$P150,$P150-SUM($V150:X150),$P150*$U150/12),0)","v":{"v":6.622583333333334,"d":"6.62"}},{"$f":"IF(AND(Z$16*1>=$R150,Z$16*1<=$D$8,$R150<$D$8,$P150>SUM($V150:Y150)),IF(SUM($P150*$U150/12,$V150:Y150)>$P150,$P150-SUM($V150:Y150),$P150*$U150/12),0)","v":{"v":6.622583333333334,"d":"6.62"}},{"$f":"IF(AND(AA$16*1>=$R150,AA$16*1<=$D$8,$R150<$D$8,$P150>SUM($V150:Z150)),IF(SUM($P150*$U150/12,$V150:Z150)>$P150,$P150-SUM($V150:Z150),$P150*$U150/12),0)","v":{"v":6.622583333333334,"d":"6.62"}},{"$f":"IF(AND(AB$16*1>=$R150,AB$16*1<=$D$8,$R150<$D$8,$P150>SUM($V150:AA150)),IF(SUM($P150*$U150/12,$V150:AA150)>$P150,$P150-SUM($V150:AA150),$P150*$U150/12),0)","v":{"v":0,"d":"0.00"}},{"$f":"IF(AND(AC$16*1>=$R150,AC$16*1<=$D$8,$R150<$D$8,$P150>SUM($V150:AB150)),IF(SUM($P150*$U150/12,$V150:AB150)>$P150,$P150-SUM($V150:AB150),$P150*$U150/12),0)","v":{"v":0,"d":"0.00"}},{"$f":"IF(AND(AD$16*1>=$R150,AD$16*1<=$D$8,$R150<$D$8,$P150>SUM($V150:AC150)),IF(SUM($P150*$U150/12,$V150:AC150)>$P150,$P150-SUM($V150:AC150),$P150*$U150/12),0)","v":{"v":0,"d":"0.00"}},{"$f":"IF(AND(AE$16*1>=$R150,AE$16*1<=$D$8,$R150<$D$8,$P150>SUM($V150:AD150)),IF(SUM($P150*$U150/12,$V150:AD150)>$P150,$P150-SUM($V150:AD150),$P150*$U150/12),0)","v":{"v":0,"d":"0.00"}},{"$f":"IF(AND(AF$16*1>=$R150,AF$16*1<=$D$8,$R150<$D$8,$P150>SUM($V150:AE150)),IF(SUM($P150*$U150/12,$V150:AE150)>$P150,$P150-SUM($V150:AE150),$P150*$U150/12),0)","v":{"v":0,"d":"0.00"}},{"$f":"IF(AND(AG$16*1>=$R150,AG$16*1<=$D$8,$R150<$D$8,$P150>SUM($V150:AF150)),IF(SUM($P150*$U150/12,$V150:AF150)>$P150,$P150-SUM($V150:AF150),$P150*$U150/12),0)","v":{"v":0,"d":"0.00"}},{"$f":"IF(AND(AH$16*1>=$R150,AH$16*1<=$D$8,$R150<$D$8,$P150>SUM($V150:AG150)),IF(SUM($P150*$U150/12,$V150:AG150)>$P150,$P150-SUM($V150:AG150),$P150*$U150/12),0)","v":{"v":0,"d":"0.00"}},{"v":33.11291666666667,"d":"33.11"},null,null,{"v":622.51775,"d":"622.52"},null,{"v":622.51775,"d":"622.52"}]
[null,null,143,"336211","BLACKBERRY (CF)",{"$nulls":3},765.33,{"$nulls":4},765.33,null,765.33,"2015-05-04","2015-06-01",null,null,{"v":0.1,"d":"10%"},274.23,{"$f":"IF(AND(W$16*1>=$R151,W$16*1<=$D$8,$R151<$D$8,$P151>SUM($V151:V151)),IF(SUM($P151*$U151/12,$V151:V151)>$P151,$P151-SUM($V151:V151),$P151*$U151/12),0)","v":{"v":6.37775,"d":"6.38"}},{"$f":"IF(AND(X$16*1>=$R151,X$16*1<=$D$8,$R151<$D$8,$P151>SUM($V151:W151)),IF(SUM($P151*$U151/12,$V151:W151)>$P151,$P151-SUM($V151:W151),$P151*$U151/12),0)","v":{"v":6.37775,"d":"6.38"}},{"$f":"IF(AND(Y$16*1>=$R151,Y$16*1<=$D$8,$R151<$D$8,$P151>SUM($V151:X151)),IF(SUM($P151*$U151/12,$V151:X151)>$P151,$P151-SUM($V151:X151),$P151*$U151/12),0)","v":{"v":6.37775,"d":"6.38"}},{"$f":"IF(AND(Z$16*1>=$R151,Z$16*1<=$D$8,$R151<$D$8,$P151>SUM($V151:Y151)),IF(SUM($P151*$U151/12,$V151:Y151)>$P151,$P151-SUM($V151:Y151),$P151*$U151/12),0)","v":{"v":6.37775,"d":"6.38"}},{"$f":"IF(AND(AA$16*1>=$R151,AA$16*1<=$D$8,$R151<$D$8,$P151>SUM($V151:Z151)),IF(SUM($P151*$U151/12,$V151:Z151)>$P151,$P151-SUM($V151:Z151),$P151*$U151/12),0)","v":{"v":6.37775,"d":"6.38"}},{"$f":"IF(AND(AB$16*1>=$R151,AB$16*1<=$D$8,$R151<$D$8,$P151>SUM($V151:AA151)),IF(SUM($P151*$U151/12,$V151:AA151)>$P151,$P151-SUM($V151:AA151),$P151*$U151/12),0)","v":{"v":0,"d":"0.00"}},{"$f":"IF(AND(AC$16*1>=$R151,AC$16*1<=$D$8,$R151<$D$8,$P151>SUM($V151:AB151)),IF(SUM($P151*$U151/12,$V151:AB151)>$P151,$P151-SUM($V151:AB151),$P151*$U151/12),0)","v":{"v":0,"d":"0.00"}},{"$f":"IF(AND(AD$16*1>=$R151,AD$16*1<=$D$8,$R151<$D$8,$P151>SUM($V151:AC151)),IF(SUM($P151*$U151/12,$V151:AC151)>$P151,$P151-SUM($V151:AC151),$P151*$U151/12),0)","v":{"v":0,"d":"0.00"}},{"$f":"IF(AND(AE$16*1>=$R151,AE$16*1<=$D$8,$R151<$D$8,$P151>SUM($V151:AD151)),IF(SUM($P151*$U151/12,$V151:AD151)>$P151,$P151-SUM($V151:AD151),$P151*$U151/12),0)","v":{"v":0,"d":"0.00"}},{"$f":"IF(AND(AF$16*1>=$R151,AF$16*1<=$D$8,$R151<$D$8,$P151>SUM($V151:AE151)),IF(SUM($P151*$U151/12,$V151:AE151)>$P151,$P151-SUM($V151:AE151),$P151*$U151/12),0)","v":{"v":0,"d":"0.00"}},{"$f":"IF(AND(AG$16*1>=$R151,AG$16*1<=$D$8,$R151<$D$8,$P151>SUM($V151:AF151)),IF(SUM($P151*$U151/12,$V151:AF151)>$P151,$P151-SUM($V151:AF151),$P151*$U151/12),0)","v":{"v":0,"d":"0.00"}},{"$f":"IF(AND(AH$16*1>=$R151,AH$16*1<=$D$8,$R151<$D$8,$P151>SUM($V151:AG151)),IF(SUM($P151*$U151/12,$V151:AG151)>$P151,$P151-SUM($V151:AG151),$P151*$U151/12),0)","v":{"v":0,"d":"0.00"}},{"v":31.888749999999998,"d":"31.89"},null,null,{"v":293.36325,"d":"293.36"},null,{"v":293.36325,"d":"293.36"}]
[null,null,144,"336211","EQUIP.SEGURIDAD 6 CAM/GARB/DIS",{"$nulls":3},3913.97,{"$nulls":4},3913.97,null,{"v":3913.97,"d":"3,913.97"},"2016-12-31","2017-01-01",null,null,{"v":0.1,"d":"10%"},750.18,{"$f":"IF(AND(W$16*1>=$R152,W$16*1<=$D$8,$R152<$D$8,$P152>SUM($V152:V152)),IF(SUM($P152*$U152/12,$V152:V152)>$P152,$P152-SUM($V152:V152),$P152*$U152/12),0)","v":{"v":32.616416666666666,"d":"32.62"}},{"$f":"IF(AND(X$16*1>=$R152,X$16*1<=$D$8,$R152<$D$8,$P152>SUM($V152:W152)),IF(SUM($P152*$U152/12,$V152:W152)>$P152,$P152-SUM($V152:W152),$P152*$U152/12),0)","v":{"v":32.616416666666666,"d":"32.62"}},{"$f":"IF(AND(Y$16*1>=$R152,Y$16*1<=$D$8,$R152<$D$8,$P152>SUM($V152:X152)),IF(SUM($P152*$U152/12,$V152:X152)>$P152,$P152-SUM($V152:X152),$P152*$U152/12),0)","v":{"v":32.616416666666666,"d":"32.62"}},{"$f":"IF(AND(Z$16*1>=$R152,Z$16*1<=$D$8,$R152<$D$8,$P152>SUM($V152:Y152)),IF(SUM($P152*$U152/12,$V152:Y152)>$P152,$P152-SUM($V152:Y152),$P152*$U152/12),0)","v":{"v":32.616416666666666,"d":"32.62"}},{"$f":"IF(AND(AA$16*1>=$R152,AA$16*1<=$D$8,$R152<$D$8,$P152>SUM($V152:Z152)),IF(SUM($P152*$U152/12,$V152:Z152)>$P152,$P152-SUM($V152:Z152),$P152*$U152/12),0)","v":{"v":32.616416666666666,"d":"32.62"}},{"$f":"IF(AND(AB$16*1>=$R152,AB$16*1<=$D$8,$R152<$D$8,$P152>SUM($V152:AA152)),IF(SUM($P152*$U152/12,$V152:AA152)>$P152,$P152-SUM($V152:AA152),$P152*$U152/12),0)","v":{"v":0,"d":"0.00"}},{"$f":"IF(AND(AC$16*1>=$R152,AC$16*1<=$D$8,$R152<$D$8,$P152>SUM($V152:AB152)),IF(SUM($P152*$U152/12,$V152:AB152)>$P152,$P152-SUM($V152:AB152),$P152*$U152/12),0)","v":{"v":0,"d":"0.00"}},{"$f":"IF(AND(AD$16*1>=$R152,AD$16*1<=$D$8,$R152<$D$8,$P152>SUM($V152:AC152)),IF(SUM($P152*$U152/12,$V152:AC152)>$P152,$P152-SUM($V152:AC152),$P152*$U152/12),0)","v":{"v":0,"d":"0.00"}},{"$f":"IF(AND(AE$16*1>=$R152,AE$16*1<=$D$8,$R152<$D$8,$P152>SUM($V152:AD152)),IF(SUM($P152*$U152/12,$V152:AD152)>$P152,$P152-SUM($V152:AD152),$P152*$U152/12),0)","v":{"v":0,"d":"0.00"}},{"$f":"IF(AND(AF$16*1>=$R152,AF$16*1<=$D$8,$R152<$D$8,$P152>SUM($V152:AE152)),IF(SUM($P152*$U152/12,$V152:AE152)>$P152,$P152-SUM($V152:AE152),$P152*$U152/12),0)","v":{"v":0,"d":"0.00"}},{"$f":"IF(AND(AG$16*1>=$R152,AG$16*1<=$D$8,$R152<$D$8,$P152>SUM($V152:AF152)),IF(SUM($P152*$U152/12,$V152:AF152)>$P152,$P152-SUM($V152:AF152),$P152*$U152/12),0)","v":{"v":0,"d":"0.00"}},{"$f":"IF(AND(AH$16*1>=$R152,AH$16*1<=$D$8,$R152<$D$8,$P152>SUM($V152:AG152)),IF(SUM($P152*$U152/12,$V152:AG152)>$P152,$P152-SUM($V152:AG152),$P152*$U152/12),0)","v":{"v":0,"d":"0.00"}},{"v":163.08208333333334,"d":"163.08"},null,null,{"v":848.0292499999999,"d":"848.03"},null,{"v":848.0292499999999,"d":"848.03"}]
[null,null,145,"336211","TV SAMSUNG 19\" PARA SEGURIDAD",{"$nulls":3},507.63,{"$nulls":4},507.63,null,507.63,"2017-01-10","2017-02-01",null,null,{"v":0.1,"d":"10%"},97.29,{"$f":"IF(AND(W$16*1>=$R153,W$16*1<=$D$8,$R153<$D$8,$P153>SUM($V153:V153)),IF(SUM($P153*$U153/12,$V153:V153)>$P153,$P153-SUM($V153:V153),$P153*$U153/12),0)","v":{"v":4.230250000000001,"d":"4.23"}},{"$f":"IF(AND(X$16*1>=$R153,X$16*1<=$D$8,$R153<$D$8,$P153>SUM($V153:W153)),IF(SUM($P153*$U153/12,$V153:W153)>$P153,$P153-SUM($V153:W153),$P153*$U153/12),0)","v":{"v":4.230250000000001,"d":"4.23"}},{"$f":"IF(AND(Y$16*1>=$R153,Y$16*1<=$D$8,$R153<$D$8,$P153>SUM($V153:X153)),IF(SUM($P153*$U153/12,$V153:X153)>$P153,$P153-SUM($V153:X153),$P153*$U153/12),0)","v":{"v":4.230250000000001,"d":"4.23"}},{"$f":"IF(AND(Z$16*1>=$R153,Z$16*1<=$D$8,$R153<$D$8,$P153>SUM($V153:Y153)),IF(SUM($P153*$U153/12,$V153:Y153)>$P153,$P153-SUM($V153:Y153),$P153*$U153/12),0)","v":{"v":4.230250000000001,"d":"4.23"}},{"$f":"IF(AND(AA$16*1>=$R153,AA$16*1<=$D$8,$R153<$D$8,$P153>SUM($V153:Z153)),IF(SUM($P153*$U153/12,$V153:Z153)>$P153,$P153-SUM($V153:Z153),$P153*$U153/12),0)","v":{"v":4.230250000000001,"d":"4.23"}},{"$f":"IF(AND(AB$16*1>=$R153,AB$16*1<=$D$8,$R153<$D$8,$P153>SUM($V153:AA153)),IF(SUM($P153*$U153/12,$V153:AA153)>$P153,$P153-SUM($V153:AA153),$P153*$U153/12),0)","v":{"v":0,"d":"0.00"}},{"$f":"IF(AND(AC$16*1>=$R153,AC$16*1<=$D$8,$R153<$D$8,$P153>SUM($V153:AB153)),IF(SUM($P153*$U153/12,$V153:AB153)>$P153,$P153-SUM($V153:AB153),$P153*$U153/12),0)","v":{"v":0,"d":"0.00"}},{"$f":"IF(AND(AD$16*1>=$R153,AD$16*1<=$D$8,$R153<$D$8,$P153>SUM($V153:AC153)),IF(SUM($P153*$U153/12,$V153:AC153)>$P153,$P153-SUM($V153:AC153),$P153*$U153/12),0)","v":{"v":0,"d":"0.00"}},{"$f":"IF(AND(AE$16*1>=$R153,AE$16*1<=$D$8,$R153<$D$8,$P153>SUM($V153:AD153)),IF(SUM($P153*$U153/12,$V153:AD153)>$P153,$P153-SUM($V153:AD153),$P153*$U153/12),0)","v":{"v":0,"d":"0.00"}},{"$f":"IF(AND(AF$16*1>=$R153,AF$16*1<=$D$8,$R153<$D$8,$P153>SUM($V153:AE153)),IF(SUM($P153*$U153/12,$V153:AE153)>$P153,$P153-SUM($V153:AE153),$P153*$U153/12),0)","v":{"v":0,"d":"0.00"}},{"$f":"IF(AND(AG$16*1>=$R153,AG$16*1<=$D$8,$R153<$D$8,$P153>SUM($V153:AF153)),IF(SUM($P153*$U153/12,$V153:AF153)>$P153,$P153-SUM($V153:AF153),$P153*$U153/12),0)","v":{"v":0,"d":"0.00"}},{"$f":"IF(AND(AH$16*1>=$R153,AH$16*1<=$D$8,$R153<$D$8,$P153>SUM($V153:AG153)),IF(SUM($P153*$U153/12,$V153:AG153)>$P153,$P153-SUM($V153:AG153),$P153*$U153/12),0)","v":{"v":0,"d":"0.00"}},{"v":21.151250000000005,"d":"21.15"},null,null,{"v":109.98075,"d":"109.98"},null,{"v":109.98075,"d":"109.98"}]
[null,null,146,"336211","EQ.AIRE ACONDICIONADO (SERVIDOR)",{"$nulls":3},703.31,{"$nulls":4},703.31,null,703.31,"2017-01-23","2017-02-01",null,null,{"v":0.1,"d":"10%"},{"v":134.8,"d":"134.80"},{"$f":"IF(AND(W$16*1>=$R154,W$16*1<=$D$8,$R154<$D$8,$P154>SUM($V154:V154)),IF(SUM($P154*$U154/12,$V154:V154)>$P154,$P154-SUM($V154:V154),$P154*$U154/12),0)","v":{"v":5.860916666666667,"d":"5.86"}},{"$f":"IF(AND(X$16*1>=$R154,X$16*1<=$D$8,$R154<$D$8,$P154>SUM($V154:W154)),IF(SUM($P154*$U154/12,$V154:W154)>$P154,$P154-SUM($V154:W154),$P154*$U154/12),0)","v":{"v":5.860916666666667,"d":"5.86"}},{"$f":"IF(AND(Y$16*1>=$R154,Y$16*1<=$D$8,$R154<$D$8,$P154>SUM($V154:X154)),IF(SUM($P154*$U154/12,$V154:X154)>$P154,$P154-SUM($V154:X154),$P154*$U154/12),0)","v":{"v":5.860916666666667,"d":"5.86"}},{"$f":"IF(AND(Z$16*1>=$R154,Z$16*1<=$D$8,$R154<$D$8,$P154>SUM($V154:Y154)),IF(SUM($P154*$U154/12,$V154:Y154)>$P154,$P154-SUM($V154:Y154),$P154*$U154/12),0)","v":{"v":5.860916666666667,"d":"5.86"}},{"$f":"IF(AND(AA$16*1>=$R154,AA$16*1<=$D$8,$R154<$D$8,$P154>SUM($V154:Z154)),IF(SUM($P154*$U154/12,$V154:Z154)>$P154,$P154-SUM($V154:Z154),$P154*$U154/12),0)","v":{"v":5.860916666666667,"d":"5.86"}},{"$f":"IF(AND(AB$16*1>=$R154,AB$16*1<=$D$8,$R154<$D$8,$P154>SUM($V154:AA154)),IF(SUM($P154*$U154/12,$V154:AA154)>$P154,$P154-SUM($V154:AA154),$P154*$U154/12),0)","v":{"v":0,"d":"0.00"}},{"$f":"IF(AND(AC$16*1>=$R154,AC$16*1<=$D$8,$R154<$D$8,$P154>SUM($V154:AB154)),IF(SUM($P154*$U154/12,$V154:AB154)>$P154,$P154-SUM($V154:AB154),$P154*$U154/12),0)","v":{"v":0,"d":"0.00"}},{"$f":"IF(AND(AD$16*1>=$R154,AD$16*1<=$D$8,$R154<$D$8,$P154>SUM($V154:AC154)),IF(SUM($P154*$U154/12,$V154:AC154)>$P154,$P154-SUM($V154:AC154),$P154*$U154/12),0)","v":{"v":0,"d":"0.00"}},{"$f":"IF(AND(AE$16*1>=$R154,AE$16*1<=$D$8,$R154<$D$8,$P154>SUM($V154:AD154)),IF(SUM($P154*$U154/12,$V154:AD154)>$P154,$P154-SUM($V154:AD154),$P154*$U154/12),0)","v":{"v":0,"d":"0.00"}},{"$f":"IF(AND(AF$16*1>=$R154,AF$16*1<=$D$8,$R154<$D$8,$P154>SUM($V154:AE154)),IF(SUM($P154*$U154/12,$V154:AE154)>$P154,$P154-SUM($V154:AE154),$P154*$U154/12),0)","v":{"v":0,"d":"0.00"}},{"$f":"IF(AND(AG$16*1>=$R154,AG$16*1<=$D$8,$R154<$D$8,$P154>SUM($V154:AF154)),IF(SUM($P154*$U154/12,$V154:AF154)>$P154,$P154-SUM($V154:AF154),$P154*$U154/12),0)","v":{"v":0,"d":"0.00"}},{"$f":"IF(AND(AH$16*1>=$R154,AH$16*1<=$D$8,$R154<$D$8,$P154>SUM($V154:AG154)),IF(SUM($P154*$U154/12,$V154:AG154)>$P154,$P154-SUM($V154:AG154),$P154*$U154/12),0)","v":{"v":0,"d":"0.00"}},{"v":29.304583333333337,"d":"29.30"},null,null,{"v":152.38275000000002,"d":"152.38"},null,{"v":152.38275000000002,"d":"152.38"}]
[null,null,147,"336211","PANEL ALARMA (EQUIP.SEG.)",{"$nulls":3},302.8,{"$nulls":4},302.8,null,{"v":302.8,"d":"302.80"},"2017-07-12","2017-08-01",null,null,{"v":0.1,"d":"10%"},{"v":42.9,"d":"42.90"},{"$f":"IF(AND(W$16*1>=$R155,W$16*1<=$D$8,$R155<$D$8,$P155>SUM($V155:V155)),IF(SUM($P155*$U155/12,$V155:V155)>$P155,$P155-SUM($V155:V155),$P155*$U155/12),0)","v":{"v":2.5233333333333334,"d":"2.52"}},{"$f":"IF(AND(X$16*1>=$R155,X$16*1<=$D$8,$R155<$D$8,$P155>SUM($V155:W155)),IF(SUM($P155*$U155/12,$V155:W155)>$P155,$P155-SUM($V155:W155),$P155*$U155/12),0)","v":{"v":2.5233333333333334,"d":"2.52"}},{"$f":"IF(AND(Y$16*1>=$R155,Y$16*1<=$D$8,$R155<$D$8,$P155>SUM($V155:X155)),IF(SUM($P155*$U155/12,$V155:X155)>$P155,$P155-SUM($V155:X155),$P155*$U155/12),0)","v":{"v":2.5233333333333334,"d":"2.52"}},{"$f":"IF(AND(Z$16*1>=$R155,Z$16*1<=$D$8,$R155<$D$8,$P155>SUM($V155:Y155)),IF(SUM($P155*$U155/12,$V155:Y155)>$P155,$P155-SUM($V155:Y155),$P155*$U155/12),0)","v":{"v":2.5233333333333334,"d":"2.52"}},{"$f":"IF(AND(AA$16*1>=$R155,AA$16*1<=$D$8,$R155<$D$8,$P155>SUM($V155:Z155)),IF(SUM($P155*$U155/12,$V155:Z155)>$P155,$P155-SUM($V155:Z155),$P155*$U155/12),0)","v":{"v":2.5233333333333334,"d":"2.52"}},{"$f":"IF(AND(AB$16*1>=$R155,AB$16*1<=$D$8,$R155<$D$8,$P155>SUM($V155:AA155)),IF(SUM($P155*$U155/12,$V155:AA155)>$P155,$P155-SUM($V155:AA155),$P155*$U155/12),0)","v":{"v":0,"d":"0.00"}},{"$f":"IF(AND(AC$16*1>=$R155,AC$16*1<=$D$8,$R155<$D$8,$P155>SUM($V155:AB155)),IF(SUM($P155*$U155/12,$V155:AB155)>$P155,$P155-SUM($V155:AB155),$P155*$U155/12),0)","v":{"v":0,"d":"0.00"}},{"$f":"IF(AND(AD$16*1>=$R155,AD$16*1<=$D$8,$R155<$D$8,$P155>SUM($V155:AC155)),IF(SUM($P155*$U155/12,$V155:AC155)>$P155,$P155-SUM($V155:AC155),$P155*$U155/12),0)","v":{"v":0,"d":"0.00"}},{"$f":"IF(AND(AE$16*1>=$R155,AE$16*1<=$D$8,$R155<$D$8,$P155>SUM($V155:AD155)),IF(SUM($P155*$U155/12,$V155:AD155)>$P155,$P155-SUM($V155:AD155),$P155*$U155/12),0)","v":{"v":0,"d":"0.00"}},{"$f":"IF(AND(AF$16*1>=$R155,AF$16*1<=$D$8,$R155<$D$8,$P155>SUM($V155:AE155)),IF(SUM($P155*$U155/12,$V155:AE155)>$P155,$P155-SUM($V155:AE155),$P155*$U155/12),0)","v":{"v":0,"d":"0.00"}},{"$f":"IF(AND(AG$16*1>=$R155,AG$16*1<=$D$8,$R155<$D$8,$P155>SUM($V155:AF155)),IF(SUM($P155*$U155/12,$V155:AF155)>$P155,$P155-SUM($V155:AF155),$P155*$U155/12),0)","v":{"v":0,"d":"0.00"}},{"$f":"IF(AND(AH$16*1>=$R155,AH$16*1<=$D$8,$R155<$D$8,$P155>SUM($V155:AG155)),IF(SUM($P155*$U155/12,$V155:AG155)>$P155,$P155-SUM($V155:AG155),$P155*$U155/12),0)","v":{"v":0,"d":"0.00"}},{"v":12.616666666666667,"d":"12.62"},null,null,50.47,null,50.47]
[null,null,148,"336211","3 SENSOR MOVIM.INFRAROJO(EQ.SEG.)",{"$nulls":3},217.22,{"$nulls":4},217.22,null,217.22,"2017-07-12","2017-08-01",null,null,{"v":0.1,"d":"10%"},30.77,{"$f":"IF(AND(W$16*1>=$R156,W$16*1<=$D$8,$R156<$D$8,$P156>SUM($V156:V156)),IF(SUM($P156*$U156/12,$V156:V156)>$P156,$P156-SUM($V156:V156),$P156*$U156/12),0)","v":{"v":1.8101666666666667,"d":"1.81"}},{"$f":"IF(AND(X$16*1>=$R156,X$16*1<=$D$8,$R156<$D$8,$P156>SUM($V156:W156)),IF(SUM($P156*$U156/12,$V156:W156)>$P156,$P156-SUM($V156:W156),$P156*$U156/12),0)","v":{"v":1.8101666666666667,"d":"1.81"}},{"$f":"IF(AND(Y$16*1>=$R156,Y$16*1<=$D$8,$R156<$D$8,$P156>SUM($V156:X156)),IF(SUM($P156*$U156/12,$V156:X156)>$P156,$P156-SUM($V156:X156),$P156*$U156/12),0)","v":{"v":1.8101666666666667,"d":"1.81"}},{"$f":"IF(AND(Z$16*1>=$R156,Z$16*1<=$D$8,$R156<$D$8,$P156>SUM($V156:Y156)),IF(SUM($P156*$U156/12,$V156:Y156)>$P156,$P156-SUM($V156:Y156),$P156*$U156/12),0)","v":{"v":1.8101666666666667,"d":"1.81"}},{"$f":"IF(AND(AA$16*1>=$R156,AA$16*1<=$D$8,$R156<$D$8,$P156>SUM($V156:Z156)),IF(SUM($P156*$U156/12,$V156:Z156)>$P156,$P156-SUM($V156:Z156),$P156*$U156/12),0)","v":{"v":1.8101666666666667,"d":"1.81"}},{"$f":"IF(AND(AB$16*1>=$R156,AB$16*1<=$D$8,$R156<$D$8,$P156>SUM($V156:AA156)),IF(SUM($P156*$U156/12,$V156:AA156)>$P156,$P156-SUM($V156:AA156),$P156*$U156/12),0)","v":{"v":0,"d":"0.00"}},{"$f":"IF(AND(AC$16*1>=$R156,AC$16*1<=$D$8,$R156<$D$8,$P156>SUM($V156:AB156)),IF(SUM($P156*$U156/12,$V156:AB156)>$P156,$P156-SUM($V156:AB156),$P156*$U156/12),0)","v":{"v":0,"d":"0.00"}},{"$f":"IF(AND(AD$16*1>=$R156,AD$16*1<=$D$8,$R156<$D$8,$P156>SUM($V156:AC156)),IF(SUM($P156*$U156/12,$V156:AC156)>$P156,$P156-SUM($V156:AC156),$P156*$U156/12),0)","v":{"v":0,"d":"0.00"}},{"$f":"IF(AND(AE$16*1>=$R156,AE$16*1<=$D$8,$R156<$D$8,$P156>SUM($V156:AD156)),IF(SUM($P156*$U156/12,$V156:AD156)>$P156,$P156-SUM($V156:AD156),$P156*$U156/12),0)","v":{"v":0,"d":"0.00"}},{"$f":"IF(AND(AF$16*1>=$R156,AF$16*1<=$D$8,$R156<$D$8,$P156>SUM($V156:AE156)),IF(SUM($P156*$U156/12,$V156:AE156)>$P156,$P156-SUM($V156:AE156),$P156*$U156/12),0)","v":{"v":0,"d":"0.00"}},{"$f":"IF(AND(AG$16*1>=$R156,AG$16*1<=$D$8,$R156<$D$8,$P156>SUM($V156:AF156)),IF(SUM($P156*$U156/12,$V156:AF156)>$P156,$P156-SUM($V156:AF156),$P156*$U156/12),0)","v":{"v":0,"d":"0.00"}},{"$f":"IF(AND(AH$16*1>=$R156,AH$16*1<=$D$8,$R156<$D$8,$P156>SUM($V156:AG156)),IF(SUM($P156*$U156/12,$V156:AG156)>$P156,$P156-SUM($V156:AG156),$P156*$U156/12),0)","v":{"v":0,"d":"0.00"}},{"v":9.050833333333333,"d":"9.05"},null,null,{"v":36.2005,"d":"36.20"},null,{"v":36.2005,"d":"36.20"}]
[null,null,149,"336211","PROYECTOR LED AIGO BLT300 ",{"$nulls":3},629.66,{"$nulls":4},629.66,null,629.66,"2017-10-07","2017-11-01",null,null,{"v":0.1,"d":"10%"},73.46,{"$f":"IF(AND(W$16*1>=$R157,W$16*1<=$D$8,$R157<$D$8,$P157>SUM($V157:V157)),IF(SUM($P157*$U157/12,$V157:V157)>$P157,$P157-SUM($V157:V157),$P157*$U157/12),0)","v":{"v":5.247166666666667,"d":"5.25"}},{"$f":"IF(AND(X$16*1>=$R157,X$16*1<=$D$8,$R157<$D$8,$P157>SUM($V157:W157)),IF(SUM($P157*$U157/12,$V157:W157)>$P157,$P157-SUM($V157:W157),$P157*$U157/12),0)","v":{"v":5.247166666666667,"d":"5.25"}},{"$f":"IF(AND(Y$16*1>=$R157,Y$16*1<=$D$8,$R157<$D$8,$P157>SUM($V157:X157)),IF(SUM($P157*$U157/12,$V157:X157)>$P157,$P157-SUM($V157:X157),$P157*$U157/12),0)","v":{"v":5.247166666666667,"d":"5.25"}},{"$f":"IF(AND(Z$16*1>=$R157,Z$16*1<=$D$8,$R157<$D$8,$P157>SUM($V157:Y157)),IF(SUM($P157*$U157/12,$V157:Y157)>$P157,$P157-SUM($V157:Y157),$P157*$U157/12),0)","v":{"v":5.247166666666667,"d":"5.25"}},{"$f":"IF(AND(AA$16*1>=$R157,AA$16*1<=$D$8,$R157<$D$8,$P157>SUM($V157:Z157)),IF(SUM($P157*$U157/12,$V157:Z157)>$P157,$P157-SUM($V157:Z157),$P157*$U157/12),0)","v":{"v":5.247166666666667,"d":"5.25"}},{"$f":"IF(AND(AB$16*1>=$R157,AB$16*1<=$D$8,$R157<$D$8,$P157>SUM($V157:AA157)),IF(SUM($P157*$U157/12,$V157:AA157)>$P157,$P157-SUM($V157:AA157),$P157*$U157/12),0)","v":{"v":0,"d":"0.00"}},{"$f":"IF(AND(AC$16*1>=$R157,AC$16*1<=$D$8,$R157<$D$8,$P157>SUM($V157:AB157)),IF(SUM($P157*$U157/12,$V157:AB157)>$P157,$P157-SUM($V157:AB157),$P157*$U157/12),0)","v":{"v":0,"d":"0.00"}},{"$f":"IF(AND(AD$16*1>=$R157,AD$16*1<=$D$8,$R157<$D$8,$P157>SUM($V157:AC157)),IF(SUM($P157*$U157/12,$V157:AC157)>$P157,$P157-SUM($V157:AC157),$P157*$U157/12),0)","v":{"v":0,"d":"0.00"}},{"$f":"IF(AND(AE$16*1>=$R157,AE$16*1<=$D$8,$R157<$D$8,$P157>SUM($V157:AD157)),IF(SUM($P157*$U157/12,$V157:AD157)>$P157,$P157-SUM($V157:AD157),$P157*$U157/12),0)","v":{"v":0,"d":"0.00"}},{"$f":"IF(AND(AF$16*1>=$R157,AF$16*1<=$D$8,$R157<$D$8,$P157>SUM($V157:AE157)),IF(SUM($P157*$U157/12,$V157:AE157)>$P157,$P157-SUM($V157:AE157),$P157*$U157/12),0)","v":{"v":0,"d":"0.00"}},{"$f":"IF(AND(AG$16*1>=$R157,AG$16*1<=$D$8,$R157<$D$8,$P157>SUM($V157:AF157)),IF(SUM($P157*$U157/12,$V157:AF157)>$P157,$P157-SUM($V157:AF157),$P157*$U157/12),0)","v":{"v":0,"d":"0.00"}},{"$f":"IF(AND(AH$16*1>=$R157,AH$16*1<=$D$8,$R157<$D$8,$P157>SUM($V157:AG157)),IF(SUM($P157*$U157/12,$V157:AG157)>$P157,$P157-SUM($V157:AG157),$P157*$U157/12),0)","v":{"v":0,"d":"0.00"}},{"v":26.235833333333332,"d":"26.24"},null,null,{"v":89.2015,"d":"89.20"},null,{"v":89.2015,"d":"89.20"}]
[null,null,150,"336211","EQ.CELULAR BLACKBERRY 9790",{"$nulls":3},1135.59,{"$nulls":4},1135.59,null,{"v":1135.59,"d":"1,135.59"},"2017-12-16","2018-01-01",null,null,{"v":0.1,"d":"10%"},113.56,{"$f":"IF(AND(W$16*1>=$R158,W$16*1<=$D$8,$R158<$D$8,$P158>SUM($V158:V158)),IF(SUM($P158*$U158/12,$V158:V158)>$P158,$P158-SUM($V158:V158),$P158*$U158/12),0)","v":{"v":9.46325,"d":"9.46"}},{"$f":"IF(AND(X$16*1>=$R158,X$16*1<=$D$8,$R158<$D$8,$P158>SUM($V158:W158)),IF(SUM($P158*$U158/12,$V158:W158)>$P158,$P158-SUM($V158:W158),$P158*$U158/12),0)","v":{"v":9.46325,"d":"9.46"}},{"$f":"IF(AND(Y$16*1>=$R158,Y$16*1<=$D$8,$R158<$D$8,$P158>SUM($V158:X158)),IF(SUM($P158*$U158/12,$V158:X158)>$P158,$P158-SUM($V158:X158),$P158*$U158/12),0)","v":{"v":9.46325,"d":"9.46"}},{"$f":"IF(AND(Z$16*1>=$R158,Z$16*1<=$D$8,$R158<$D$8,$P158>SUM($V158:Y158)),IF(SUM($P158*$U158/12,$V158:Y158)>$P158,$P158-SUM($V158:Y158),$P158*$U158/12),0)","v":{"v":9.46325,"d":"9.46"}},{"$f":"IF(AND(AA$16*1>=$R158,AA$16*1<=$D$8,$R158<$D$8,$P158>SUM($V158:Z158)),IF(SUM($P158*$U158/12,$V158:Z158)>$P158,$P158-SUM($V158:Z158),$P158*$U158/12),0)","v":{"v":9.46325,"d":"9.46"}},{"$f":"IF(AND(AB$16*1>=$R158,AB$16*1<=$D$8,$R158<$D$8,$P158>SUM($V158:AA158)),IF(SUM($P158*$U158/12,$V158:AA158)>$P158,$P158-SUM($V158:AA158),$P158*$U158/12),0)","v":{"v":0,"d":"0.00"}},{"$f":"IF(AND(AC$16*1>=$R158,AC$16*1<=$D$8,$R158<$D$8,$P158>SUM($V158:AB158)),IF(SUM($P158*$U158/12,$V158:AB158)>$P158,$P158-SUM($V158:AB158),$P158*$U158/12),0)","v":{"v":0,"d":"0.00"}},{"$f":"IF(AND(AD$16*1>=$R158,AD$16*1<=$D$8,$R158<$D$8,$P158>SUM($V158:AC158)),IF(SUM($P158*$U158/12,$V158:AC158)>$P158,$P158-SUM($V158:AC158),$P158*$U158/12),0)","v":{"v":0,"d":"0.00"}},{"$f":"IF(AND(AE$16*1>=$R158,AE$16*1<=$D$8,$R158<$D$8,$P158>SUM($V158:AD158)),IF(SUM($P158*$U158/12,$V158:AD158)>$P158,$P158-SUM($V158:AD158),$P158*$U158/12),0)","v":{"v":0,"d":"0.00"}},{"$f":"IF(AND(AF$16*1>=$R158,AF$16*1<=$D$8,$R158<$D$8,$P158>SUM($V158:AE158)),IF(SUM($P158*$U158/12,$V158:AE158)>$P158,$P158-SUM($V158:AE158),$P158*$U158/12),0)","v":{"v":0,"d":"0.00"}},{"$f":"IF(AND(AG$16*1>=$R158,AG$16*1<=$D$8,$R158<$D$8,$P158>SUM($V158:AF158)),IF(SUM($P158*$U158/12,$V158:AF158)>$P158,$P158-SUM($V158:AF158),$P158*$U158/12),0)","v":{"v":0,"d":"0.00"}},{"$f":"IF(AND(AH$16*1>=$R158,AH$16*1<=$D$8,$R158<$D$8,$P158>SUM($V158:AG158)),IF(SUM($P158*$U158/12,$V158:AG158)>$P158,$P158-SUM($V158:AG158),$P158*$U158/12),0)","v":{"v":0,"d":"0.00"}},{"v":47.316250000000004,"d":"47.32"},null,null,{"v":141.94975,"d":"141.95"},null,{"v":141.94975,"d":"141.95"}]
[null,null,151,"336311","EQUIPO DE ALARMA",{"$nulls":3},5660.01,{"$nulls":4},5660.01,null,{"v":5660.01,"d":"5,660.01"},"2004-12-21","2005-01-01",null,null,{"v":0.1,"d":"10%"},{"v":5660.01,"d":"5,660.01"},{"$f":"IF(AND(W$16*1>=$R159,W$16*1<=$D$8,$R159<$D$8,$P159>SUM($V159:V159)),IF(SUM($P159*$U159/12,$V159:V159)>$P159,$P159-SUM($V159:V159),$P159*$U159/12),0)","v":{"v":0,"d":"0.00"}},{"$f":"IF(AND(X$16*1>=$R159,X$16*1<=$D$8,$R159<$D$8,$P159>SUM($V159:W159)),IF(SUM($P159*$U159/12,$V159:W159)>$P159,$P159-SUM($V159:W159),$P159*$U159/12),0)","v":{"v":0,"d":"0.00"}},{"$f":"IF(AND(Y$16*1>=$R159,Y$16*1<=$D$8,$R159<$D$8,$P159>SUM($V159:X159)),IF(SUM($P159*$U159/12,$V159:X159)>$P159,$P159-SUM($V159:X159),$P159*$U159/12),0)","v":{"v":0,"d":"0.00"}},{"$f":"IF(AND(Z$16*1>=$R159,Z$16*1<=$D$8,$R159<$D$8,$P159>SUM($V159:Y159)),IF(SUM($P159*$U159/12,$V159:Y159)>$P159,$P159-SUM($V159:Y159),$P159*$U159/12),0)","v":{"v":0,"d":"0.00"}},{"$f":"IF(AND(AA$16*1>=$R159,AA$16*1<=$D$8,$R159<$D$8,$P159>SUM($V159:Z159)),IF(SUM($P159*$U159/12,$V159:Z159)>$P159,$P159-SUM($V159:Z159),$P159*$U159/12),0)","v":{"v":0,"d":"0.00"}},{"$f":"IF(AND(AB$16*1>=$R159,AB$16*1<=$D$8,$R159<$D$8,$P159>SUM($V159:AA159)),IF(SUM($P159*$U159/12,$V159:AA159)>$P159,$P159-SUM($V159:AA159),$P159*$U159/12),0)","v":{"v":0,"d":"0.00"}},{"$f":"IF(AND(AC$16*1>=$R159,AC$16*1<=$D$8,$R159<$D$8,$P159>SUM($V159:AB159)),IF(SUM($P159*$U159/12,$V159:AB159)>$P159,$P159-SUM($V159:AB159),$P159*$U159/12),0)","v":{"v":0,"d":"0.00"}},{"$f":"IF(AND(AD$16*1>=$R159,AD$16*1<=$D$8,$R159<$D$8,$P159>SUM($V159:AC159)),IF(SUM($P159*$U159/12,$V159:AC159)>$P159,$P159-SUM($V159:AC159),$P159*$U159/12),0)","v":{"v":0,"d":"0.00"}},{"$f":"IF(AND(AE$16*1>=$R159,AE$16*1<=$D$8,$R159<$D$8,$P159>SUM($V159:AD159)),IF(SUM($P159*$U159/12,$V159:AD159)>$P159,$P159-SUM($V159:AD159),$P159*$U159/12),0)","v":{"v":0,"d":"0.00"}},{"$f":"IF(AND(AF$16*1>=$R159,AF$16*1<=$D$8,$R159<$D$8,$P159>SUM($V159:AE159)),IF(SUM($P159*$U159/12,$V159:AE159)>$P159,$P159-SUM($V159:AE159),$P159*$U159/12),0)","v":{"v":0,"d":"0.00"}},{"$f":"IF(AND(AG$16*1>=$R159,AG$16*1<=$D$8,$R159<$D$8,$P159>SUM($V159:AF159)),IF(SUM($P159*$U159/12,$V159:AF159)>$P159,$P159-SUM($V159:AF159),$P159*$U159/12),0)","v":{"v":0,"d":"0.00"}},{"$f":"IF(AND(AH$16*1>=$R159,AH$16*1<=$D$8,$R159<$D$8,$P159>SUM($V159:AG159)),IF(SUM($P159*$U159/12,$V159:AG159)>$P159,$P159-SUM($V159:AG159),$P159*$U159/12),0)","v":{"v":0,"d":"0.00"}},{"v":0,"d":"0.00"},null,null,{"v":5660.01,"d":"5,660.01"},null,{"v":5660.01,"d":"5,660.01"}]
[null,null,152,"336311","CAMARA C/ALARMA Y MONITOR(INC.INST.",{"$nulls":3},846.84,{"$nulls":4},846.84,null,846.84,"2007-06-25","2007-07-01",null,null,{"v":0.1,"d":"10%"},846.84,{"$f":"IF(AND(W$16*1>=$R160,W$16*1<=$D$8,$R160<$D$8,$P160>SUM($V160:V160)),IF(SUM($P160*$U160/12,$V160:V160)>$P160,$P160-SUM($V160:V160),$P160*$U160/12),0)","v":{"v":0,"d":"0.00"}},{"$f":"IF(AND(X$16*1>=$R160,X$16*1<=$D$8,$R160<$D$8,$P160>SUM($V160:W160)),IF(SUM($P160*$U160/12,$V160:W160)>$P160,$P160-SUM($V160:W160),$P160*$U160/12),0)","v":{"v":0,"d":"0.00"}},{"$f":"IF(AND(Y$16*1>=$R160,Y$16*1<=$D$8,$R160<$D$8,$P160>SUM($V160:X160)),IF(SUM($P160*$U160/12,$V160:X160)>$P160,$P160-SUM($V160:X160),$P160*$U160/12),0)","v":{"v":0,"d":"0.00"}},{"$f":"IF(AND(Z$16*1>=$R160,Z$16*1<=$D$8,$R160<$D$8,$P160>SUM($V160:Y160)),IF(SUM($P160*$U160/12,$V160:Y160)>$P160,$P160-SUM($V160:Y160),$P160*$U160/12),0)","v":{"v":0,"d":"0.00"}},{"$f":"IF(AND(AA$16*1>=$R160,AA$16*1<=$D$8,$R160<$D$8,$P160>SUM($V160:Z160)),IF(SUM($P160*$U160/12,$V160:Z160)>$P160,$P160-SUM($V160:Z160),$P160*$U160/12),0)","v":{"v":0,"d":"0.00"}},{"$f":"IF(AND(AB$16*1>=$R160,AB$16*1<=$D$8,$R160<$D$8,$P160>SUM($V160:AA160)),IF(SUM($P160*$U160/12,$V160:AA160)>$P160,$P160-SUM($V160:AA160),$P160*$U160/12),0)","v":{"v":0,"d":"0.00"}},{"$f":"IF(AND(AC$16*1>=$R160,AC$16*1<=$D$8,$R160<$D$8,$P160>SUM($V160:AB160)),IF(SUM($P160*$U160/12,$V160:AB160)>$P160,$P160-SUM($V160:AB160),$P160*$U160/12),0)","v":{"v":0,"d":"0.00"}},{"$f":"IF(AND(AD$16*1>=$R160,AD$16*1<=$D$8,$R160<$D$8,$P160>SUM($V160:AC160)),IF(SUM($P160*$U160/12,$V160:AC160)>$P160,$P160-SUM($V160:AC160),$P160*$U160/12),0)","v":{"v":0,"d":"0.00"}},{"$f":"IF(AND(AE$16*1>=$R160,AE$16*1<=$D$8,$R160<$D$8,$P160>SUM($V160:AD160)),IF(SUM($P160*$U160/12,$V160:AD160)>$P160,$P160-SUM($V160:AD160),$P160*$U160/12),0)","v":{"v":0,"d":"0.00"}},{"$f":"IF(AND(AF$16*1>=$R160,AF$16*1<=$D$8,$R160<$D$8,$P160>SUM($V160:AE160)),IF(SUM($P160*$U160/12,$V160:AE160)>$P160,$P160-SUM($V160:AE160),$P160*$U160/12),0)","v":{"v":0,"d":"0.00"}},{"$f":"IF(AND(AG$16*1>=$R160,AG$16*1<=$D$8,$R160<$D$8,$P160>SUM($V160:AF160)),IF(SUM($P160*$U160/12,$V160:AF160)>$P160,$P160-SUM($V160:AF160),$P160*$U160/12),0)","v":{"v":0,"d":"0.00"}},{"$f":"IF(AND(AH$16*1>=$R160,AH$16*1<=$D$8,$R160<$D$8,$P160>SUM($V160:AG160)),IF(SUM($P160*$U160/12,$V160:AG160)>$P160,$P160-SUM($V160:AG160),$P160*$U160/12),0)","v":{"v":0,"d":"0.00"}},{"v":0,"d":"0.00"},null,null,846.84,null,846.84]
[null,null,153,"336911","AUTO TRANSFORMADOR 800 W ALPHA MOD.SUBM.",{"$nulls":3},155.62,{"$nulls":4},155.62,null,155.62,"2000-01-05","2000-02-01",null,null,{"v":0.1,"d":"10%"},155.62,{"$f":"IF(AND(W$16*1>=$R161,W$16*1<=$D$8,$R161<$D$8,$P161>SUM($V161:V161)),IF(SUM($P161*$U161/12,$V161:V161)>$P161,$P161-SUM($V161:V161),$P161*$U161/12),0)","v":{"v":0,"d":"0.00"}},{"$f":"IF(AND(X$16*1>=$R161,X$16*1<=$D$8,$R161<$D$8,$P161>SUM($V161:W161)),IF(SUM($P161*$U161/12,$V161:W161)>$P161,$P161-SUM($V161:W161),$P161*$U161/12),0)","v":{"v":0,"d":"0.00"}},{"$f":"IF(AND(Y$16*1>=$R161,Y$16*1<=$D$8,$R161<$D$8,$P161>SUM($V161:X161)),IF(SUM($P161*$U161/12,$V161:X161)>$P161,$P161-SUM($V161:X161),$P161*$U161/12),0)","v":{"v":0,"d":"0.00"}},{"$f":"IF(AND(Z$16*1>=$R161,Z$16*1<=$D$8,$R161<$D$8,$P161>SUM($V161:Y161)),IF(SUM($P161*$U161/12,$V161:Y161)>$P161,$P161-SUM($V161:Y161),$P161*$U161/12),0)","v":{"v":0,"d":"0.00"}},{"$f":"IF(AND(AA$16*1>=$R161,AA$16*1<=$D$8,$R161<$D$8,$P161>SUM($V161:Z161)),IF(SUM($P161*$U161/12,$V161:Z161)>$P161,$P161-SUM($V161:Z161),$P161*$U161/12),0)","v":{"v":0,"d":"0.00"}},{"$f":"IF(AND(AB$16*1>=$R161,AB$16*1<=$D$8,$R161<$D$8,$P161>SUM($V161:AA161)),IF(SUM($P161*$U161/12,$V161:AA161)>$P161,$P161-SUM($V161:AA161),$P161*$U161/12),0)","v":{"v":0,"d":"0.00"}},{"$f":"IF(AND(AC$16*1>=$R161,AC$16*1<=$D$8,$R161<$D$8,$P161>SUM($V161:AB161)),IF(SUM($P161*$U161/12,$V161:AB161)>$P161,$P161-SUM($V161:AB161),$P161*$U161/12),0)","v":{"v":0,"d":"0.00"}},{"$f":"IF(AND(AD$16*1>=$R161,AD$16*1<=$D$8,$R161<$D$8,$P161>SUM($V161:AC161)),IF(SUM($P161*$U161/12,$V161:AC161)>$P161,$P161-SUM($V161:AC161),$P161*$U161/12),0)","v":{"v":0,"d":"0.00"}},{"$f":"IF(AND(AE$16*1>=$R161,AE$16*1<=$D$8,$R161<$D$8,$P161>SUM($V161:AD161)),IF(SUM($P161*$U161/12,$V161:AD161)>$P161,$P161-SUM($V161:AD161),$P161*$U161/12),0)","v":{"v":0,"d":"0.00"}},{"$f":"IF(AND(AF$16*1>=$R161,AF$16*1<=$D$8,$R161<$D$8,$P161>SUM($V161:AE161)),IF(SUM($P161*$U161/12,$V161:AE161)>$P161,$P161-SUM($V161:AE161),$P161*$U161/12),0)","v":{"v":0,"d":"0.00"}},{"$f":"IF(AND(AG$16*1>=$R161,AG$16*1<=$D$8,$R161<$D$8,$P161>SUM($V161:AF161)),IF(SUM($P161*$U161/12,$V161:AF161)>$P161,$P161-SUM($V161:AF161),$P161*$U161/12),0)","v":{"v":0,"d":"0.00"}},{"$f":"IF(AND(AH$16*1>=$R161,AH$16*1<=$D$8,$R161<$D$8,$P161>SUM($V161:AG161)),IF(SUM($P161*$U161/12,$V161:AG161)>$P161,$P161-SUM($V161:AG161),$P161*$U161/12),0)","v":{"v":0,"d":"0.00"}},{"v":0,"d":"0.00"},null,null,155.62,null,155.62]
[null,null,154,"336911","MICROONDAS SAMSUNG W 5720W",{"$nulls":3},716.99,{"$nulls":4},716.99,null,716.99,"2000-06-04","2000-07-01",null,null,{"v":0.1,"d":"10%"},716.99,{"$f":"IF(AND(W$16*1>=$R162,W$16*1<=$D$8,$R162<$D$8,$P162>SUM($V162:V162)),IF(SUM($P162*$U162/12,$V162:V162)>$P162,$P162-SUM($V162:V162),$P162*$U162/12),0)","v":{"v":0,"d":"0.00"}},{"$f":"IF(AND(X$16*1>=$R162,X$16*1<=$D$8,$R162<$D$8,$P162>SUM($V162:W162)),IF(SUM($P162*$U162/12,$V162:W162)>$P162,$P162-SUM($V162:W162),$P162*$U162/12),0)","v":{"v":0,"d":"0.00"}},{"$f":"IF(AND(Y$16*1>=$R162,Y$16*1<=$D$8,$R162<$D$8,$P162>SUM($V162:X162)),IF(SUM($P162*$U162/12,$V162:X162)>$P162,$P162-SUM($V162:X162),$P162*$U162/12),0)","v":{"v":0,"d":"0.00"}},{"$f":"IF(AND(Z$16*1>=$R162,Z$16*1<=$D$8,$R162<$D$8,$P162>SUM($V162:Y162)),IF(SUM($P162*$U162/12,$V162:Y162)>$P162,$P162-SUM($V162:Y162),$P162*$U162/12),0)","v":{"v":0,"d":"0.00"}},{"$f":"IF(AND(AA$16*1>=$R162,AA$16*1<=$D$8,$R162<$D$8,$P162>SUM($V162:Z162)),IF(SUM($P162*$U162/12,$V162:Z162)>$P162,$P162-SUM($V162:Z162),$P162*$U162/12),0)","v":{"v":0,"d":"0.00"}},{"$f":"IF(AND(AB$16*1>=$R162,AB$16*1<=$D$8,$R162<$D$8,$P162>SUM($V162:AA162)),IF(SUM($P162*$U162/12,$V162:AA162)>$P162,$P162-SUM($V162:AA162),$P162*$U162/12),0)","v":{"v":0,"d":"0.00"}},{"$f":"IF(AND(AC$16*1>=$R162,AC$16*1<=$D$8,$R162<$D$8,$P162>SUM($V162:AB162)),IF(SUM($P162*$U162/12,$V162:AB162)>$P162,$P162-SUM($V162:AB162),$P162*$U162/12),0)","v":{"v":0,"d":"0.00"}},{"$f":"IF(AND(AD$16*1>=$R162,AD$16*1<=$D$8,$R162<$D$8,$P162>SUM($V162:AC162)),IF(SUM($P162*$U162/12,$V162:AC162)>$P162,$P162-SUM($V162:AC162),$P162*$U162/12),0)","v":{"v":0,"d":"0.00"}},{"$f":"IF(AND(AE$16*1>=$R162,AE$16*1<=$D$8,$R162<$D$8,$P162>SUM($V162:AD162)),IF(SUM($P162*$U162/12,$V162:AD162)>$P162,$P162-SUM($V162:AD162),$P162*$U162/12),0)","v":{"v":0,"d":"0.00"}},{"$f":"IF(AND(AF$16*1>=$R162,AF$16*1<=$D$8,$R162<$D$8,$P162>SUM($V162:AE162)),IF(SUM($P162*$U162/12,$V162:AE162)>$P162,$P162-SUM($V162:AE162),$P162*$U162/12),0)","v":{"v":0,"d":"0.00"}},{"$f":"IF(AND(AG$16*1>=$R162,AG$16*1<=$D$8,$R162<$D$8,$P162>SUM($V162:AF162)),IF(SUM($P162*$U162/12,$V162:AF162)>$P162,$P162-SUM($V162:AF162),$P162*$U162/12),0)","v":{"v":0,"d":"0.00"}},{"$f":"IF(AND(AH$16*1>=$R162,AH$16*1<=$D$8,$R162<$D$8,$P162>SUM($V162:AG162)),IF(SUM($P162*$U162/12,$V162:AG162)>$P162,$P162-SUM($V162:AG162),$P162*$U162/12),0)","v":{"v":0,"d":"0.00"}},{"v":0,"d":"0.00"},null,null,716.99,null,716.99]
[null,null,155,"336911","MINICOOLER ELECTROLUX RE 1400 ",{"$nulls":3},1101.72,{"$nulls":4},1101.72,null,{"v":1101.72,"d":"1,101.72"},"2001-07-15","2001-08-01",null,null,{"v":0.1,"d":"10%"},{"v":1101.72,"d":"1,101.72"},{"$f":"IF(AND(W$16*1>=$R163,W$16*1<=$D$8,$R163<$D$8,$P163>SUM($V163:V163)),IF(SUM($P163*$U163/12,$V163:V163)>$P163,$P163-SUM($V163:V163),$P163*$U163/12),0)","v":{"v":0,"d":"0.00"}},{"$f":"IF(AND(X$16*1>=$R163,X$16*1<=$D$8,$R163<$D$8,$P163>SUM($V163:W163)),IF(SUM($P163*$U163/12,$V163:W163)>$P163,$P163-SUM($V163:W163),$P163*$U163/12),0)","v":{"v":0,"d":"0.00"}},{"$f":"IF(AND(Y$16*1>=$R163,Y$16*1<=$D$8,$R163<$D$8,$P163>SUM($V163:X163)),IF(SUM($P163*$U163/12,$V163:X163)>$P163,$P163-SUM($V163:X163),$P163*$U163/12),0)","v":{"v":0,"d":"0.00"}},{"$f":"IF(AND(Z$16*1>=$R163,Z$16*1<=$D$8,$R163<$D$8,$P163>SUM($V163:Y163)),IF(SUM($P163*$U163/12,$V163:Y163)>$P163,$P163-SUM($V163:Y163),$P163*$U163/12),0)","v":{"v":0,"d":"0.00"}},{"$f":"IF(AND(AA$16*1>=$R163,AA$16*1<=$D$8,$R163<$D$8,$P163>SUM($V163:Z163)),IF(SUM($P163*$U163/12,$V163:Z163)>$P163,$P163-SUM($V163:Z163),$P163*$U163/12),0)","v":{"v":0,"d":"0.00"}},{"$f":"IF(AND(AB$16*1>=$R163,AB$16*1<=$D$8,$R163<$D$8,$P163>SUM($V163:AA163)),IF(SUM($P163*$U163/12,$V163:AA163)>$P163,$P163-SUM($V163:AA163),$P163*$U163/12),0)","v":{"v":0,"d":"0.00"}},{"$f":"IF(AND(AC$16*1>=$R163,AC$16*1<=$D$8,$R163<$D$8,$P163>SUM($V163:AB163)),IF(SUM($P163*$U163/12,$V163:AB163)>$P163,$P163-SUM($V163:AB163),$P163*$U163/12),0)","v":{"v":0,"d":"0.00"}},{"$f":"IF(AND(AD$16*1>=$R163,AD$16*1<=$D$8,$R163<$D$8,$P163>SUM($V163:AC163)),IF(SUM($P163*$U163/12,$V163:AC163)>$P163,$P163-SUM($V163:AC163),$P163*$U163/12),0)","v":{"v":0,"d":"0.00"}},{"$f":"IF(AND(AE$16*1>=$R163,AE$16*1<=$D$8,$R163<$D$8,$P163>SUM($V163:AD163)),IF(SUM($P163*$U163/12,$V163:AD163)>$P163,$P163-SUM($V163:AD163),$P163*$U163/12),0)","v":{"v":0,"d":"0.00"}},{"$f":"IF(AND(AF$16*1>=$R163,AF$16*1<=$D$8,$R163<$D$8,$P163>SUM($V163:AE163)),IF(SUM($P163*$U163/12,$V163:AE163)>$P163,$P163-SUM($V163:AE163),$P163*$U163/12),0)","v":{"v":0,"d":"0.00"}},{"$f":"IF(AND(AG$16*1>=$R163,AG$16*1<=$D$8,$R163<$D$8,$P163>SUM($V163:AF163)),IF(SUM($P163*$U163/12,$V163:AF163)>$P163,$P163-SUM($V163:AF163),$P163*$U163/12),0)","v":{"v":0,"d":"0.00"}},{"$f":"IF(AND(AH$16*1>=$R163,AH$16*1<=$D$8,$R163<$D$8,$P163>SUM($V163:AG163)),IF(SUM($P163*$U163/12,$V163:AG163)>$P163,$P163-SUM($V163:AG163),$P163*$U163/12),0)","v":{"v":0,"d":"0.00"}},{"v":0,"d":"0.00"},null,null,{"v":1101.72,"d":"1,101.72"},null,{"v":1101.72,"d":"1,101.72"}]
[null,null,156,"336911","COMPUTADORA IBM APTIVA P100 PENTIUM",{"$nulls":3},7827.22,{"$nulls":4},7827.22,null,{"v":7827.22,"d":"7,827.22"},"2001-11-30","2001-12-01",null,null,{"v":0.1,"d":"10%"},{"v":7827.22,"d":"7,827.22"},{"$f":"IF(AND(W$16*1>=$R164,W$16*1<=$D$8,$R164<$D$8,$P164>SUM($V164:V164)),IF(SUM($P164*$U164/12,$V164:V164)>$P164,$P164-SUM($V164:V164),$P164*$U164/12),0)","v":{"v":0,"d":"0.00"}},{"$f":"IF(AND(X$16*1>=$R164,X$16*1<=$D$8,$R164<$D$8,$P164>SUM($V164:W164)),IF(SUM($P164*$U164/12,$V164:W164)>$P164,$P164-SUM($V164:W164),$P164*$U164/12),0)","v":{"v":0,"d":"0.00"}},{"$f":"IF(AND(Y$16*1>=$R164,Y$16*1<=$D$8,$R164<$D$8,$P164>SUM($V164:X164)),IF(SUM($P164*$U164/12,$V164:X164)>$P164,$P164-SUM($V164:X164),$P164*$U164/12),0)","v":{"v":0,"d":"0.00"}},{"$f":"IF(AND(Z$16*1>=$R164,Z$16*1<=$D$8,$R164<$D$8,$P164>SUM($V164:Y164)),IF(SUM($P164*$U164/12,$V164:Y164)>$P164,$P164-SUM($V164:Y164),$P164*$U164/12),0)","v":{"v":0,"d":"0.00"}},{"$f":"IF(AND(AA$16*1>=$R164,AA$16*1<=$D$8,$R164<$D$8,$P164>SUM($V164:Z164)),IF(SUM($P164*$U164/12,$V164:Z164)>$P164,$P164-SUM($V164:Z164),$P164*$U164/12),0)","v":{"v":0,"d":"0.00"}},{"$f":"IF(AND(AB$16*1>=$R164,AB$16*1<=$D$8,$R164<$D$8,$P164>SUM($V164:AA164)),IF(SUM($P164*$U164/12,$V164:AA164)>$P164,$P164-SUM($V164:AA164),$P164*$U164/12),0)","v":{"v":0,"d":"0.00"}},{"$f":"IF(AND(AC$16*1>=$R164,AC$16*1<=$D$8,$R164<$D$8,$P164>SUM($V164:AB164)),IF(SUM($P164*$U164/12,$V164:AB164)>$P164,$P164-SUM($V164:AB164),$P164*$U164/12),0)","v":{"v":0,"d":"0.00"}},{"$f":"IF(AND(AD$16*1>=$R164,AD$16*1<=$D$8,$R164<$D$8,$P164>SUM($V164:AC164)),IF(SUM($P164*$U164/12,$V164:AC164)>$P164,$P164-SUM($V164:AC164),$P164*$U164/12),0)","v":{"v":0,"d":"0.00"}},{"$f":"IF(AND(AE$16*1>=$R164,AE$16*1<=$D$8,$R164<$D$8,$P164>SUM($V164:AD164)),IF(SUM($P164*$U164/12,$V164:AD164)>$P164,$P164-SUM($V164:AD164),$P164*$U164/12),0)","v":{"v":0,"d":"0.00"}},{"$f":"IF(AND(AF$16*1>=$R164,AF$16*1<=$D$8,$R164<$D$8,$P164>SUM($V164:AE164)),IF(SUM($P164*$U164/12,$V164:AE164)>$P164,$P164-SUM($V164:AE164),$P164*$U164/12),0)","v":{"v":0,"d":"0.00"}},{"$f":"IF(AND(AG$16*1>=$R164,AG$16*1<=$D$8,$R164<$D$8,$P164>SUM($V164:AF164)),IF(SUM($P164*$U164/12,$V164:AF164)>$P164,$P164-SUM($V164:AF164),$P164*$U164/12),0)","v":{"v":0,"d":"0.00"}},{"$f":"IF(AND(AH$16*1>=$R164,AH$16*1<=$D$8,$R164<$D$8,$P164>SUM($V164:AG164)),IF(SUM($P164*$U164/12,$V164:AG164)>$P164,$P164-SUM($V164:AG164),$P164*$U164/12),0)","v":{"v":0,"d":"0.00"}},{"v":0,"d":"0.00"},null,null,{"v":7827.22,"d":"7,827.22"},null,{"v":7827.22,"d":"7,827.22"}]
[null,null,157,"336911","CORTINAS VERTICALES GRABER",{"$nulls":3},850.17,{"$nulls":4},850.17,null,850.17,"2001-11-30","2001-12-01",null,null,{"v":0.1,"d":"10%"},850.17,{"$f":"IF(AND(W$16*1>=$R165,W$16*1<=$D$8,$R165<$D$8,$P165>SUM($V165:V165)),IF(SUM($P165*$U165/12,$V165:V165)>$P165,$P165-SUM($V165:V165),$P165*$U165/12),0)","v":{"v":0,"d":"0.00"}},{"$f":"IF(AND(X$16*1>=$R165,X$16*1<=$D$8,$R165<$D$8,$P165>SUM($V165:W165)),IF(SUM($P165*$U165/12,$V165:W165)>$P165,$P165-SUM($V165:W165),$P165*$U165/12),0)","v":{"v":0,"d":"0.00"}},{"$f":"IF(AND(Y$16*1>=$R165,Y$16*1<=$D$8,$R165<$D$8,$P165>SUM($V165:X165)),IF(SUM($P165*$U165/12,$V165:X165)>$P165,$P165-SUM($V165:X165),$P165*$U165/12),0)","v":{"v":0,"d":"0.00"}},{"$f":"IF(AND(Z$16*1>=$R165,Z$16*1<=$D$8,$R165<$D$8,$P165>SUM($V165:Y165)),IF(SUM($P165*$U165/12,$V165:Y165)>$P165,$P165-SUM($V165:Y165),$P165*$U165/12),0)","v":{"v":0,"d":"0.00"}},{"$f":"IF(AND(AA$16*1>=$R165,AA$16*1<=$D$8,$R165<$D$8,$P165>SUM($V165:Z165)),IF(SUM($P165*$U165/12,$V165:Z165)>$P165,$P165-SUM($V165:Z165),$P165*$U165/12),0)","v":{"v":0,"d":"0.00"}},{"$f":"IF(AND(AB$16*1>=$R165,AB$16*1<=$D$8,$R165<$D$8,$P165>SUM($V165:AA165)),IF(SUM($P165*$U165/12,$V165:AA165)>$P165,$P165-SUM($V165:AA165),$P165*$U165/12),0)","v":{"v":0,"d":"0.00"}},{"$f":"IF(AND(AC$16*1>=$R165,AC$16*1<=$D$8,$R165<$D$8,$P165>SUM($V165:AB165)),IF(SUM($P165*$U165/12,$V165:AB165)>$P165,$P165-SUM($V165:AB165),$P165*$U165/12),0)","v":{"v":0,"d":"0.00"}},{"$f":"IF(AND(AD$16*1>=$R165,AD$16*1<=$D$8,$R165<$D$8,$P165>SUM($V165:AC165)),IF(SUM($P165*$U165/12,$V165:AC165)>$P165,$P165-SUM($V165:AC165),$P165*$U165/12),0)","v":{"v":0,"d":"0.00"}},{"$f":"IF(AND(AE$16*1>=$R165,AE$16*1<=$D$8,$R165<$D$8,$P165>SUM($V165:AD165)),IF(SUM($P165*$U165/12,$V165:AD165)>$P165,$P165-SUM($V165:AD165),$P165*$U165/12),0)","v":{"v":0,"d":"0.00"}},{"$f":"IF(AND(AF$16*1>=$R165,AF$16*1<=$D$8,$R165<$D$8,$P165>SUM($V165:AE165)),IF(SUM($P165*$U165/12,$V165:AE165)>$P165,$P165-SUM($V165:AE165),$P165*$U165/12),0)","v":{"v":0,"d":"0.00"}},{"$f":"IF(AND(AG$16*1>=$R165,AG$16*1<=$D$8,$R165<$D$8,$P165>SUM($V165:AF165)),IF(SUM($P165*$U165/12,$V165:AF165)>$P165,$P165-SUM($V165:AF165),$P165*$U165/12),0)","v":{"v":0,"d":"0.00"}},{"$f":"IF(AND(AH$16*1>=$R165,AH$16*1<=$D$8,$R165<$D$8,$P165>SUM($V165:AG165)),IF(SUM($P165*$U165/12,$V165:AG165)>$P165,$P165-SUM($V165:AG165),$P165*$U165/12),0)","v":{"v":0,"d":"0.00"}},{"v":0,"d":"0.00"},null,null,850.17,null,850.17]
[null,null,158,"336911","ESTABILIZADOR HP DE 2000 W",{"$nulls":3},606.7,{"$nulls":4},606.7,null,{"v":606.7,"d":"606.70"},"2002-10-30","2002-11-01",null,null,{"v":0.1,"d":"10%"},{"v":606.7,"d":"606.70"},{"$f":"IF(AND(W$16*1>=$R166,W$16*1<=$D$8,$R166<$D$8,$P166>SUM($V166:V166)),IF(SUM($P166*$U166/12,$V166:V166)>$P166,$P166-SUM($V166:V166),$P166*$U166/12),0)","v":{"v":0,"d":"0.00"}},{"$f":"IF(AND(X$16*1>=$R166,X$16*1<=$D$8,$R166<$D$8,$P166>SUM($V166:W166)),IF(SUM($P166*$U166/12,$V166:W166)>$P166,$P166-SUM($V166:W166),$P166*$U166/12),0)","v":{"v":0,"d":"0.00"}},{"$f":"IF(AND(Y$16*1>=$R166,Y$16*1<=$D$8,$R166<$D$8,$P166>SUM($V166:X166)),IF(SUM($P166*$U166/12,$V166:X166)>$P166,$P166-SUM($V166:X166),$P166*$U166/12),0)","v":{"v":0,"d":"0.00"}},{"$f":"IF(AND(Z$16*1>=$R166,Z$16*1<=$D$8,$R166<$D$8,$P166>SUM($V166:Y166)),IF(SUM($P166*$U166/12,$V166:Y166)>$P166,$P166-SUM($V166:Y166),$P166*$U166/12),0)","v":{"v":0,"d":"0.00"}},{"$f":"IF(AND(AA$16*1>=$R166,AA$16*1<=$D$8,$R166<$D$8,$P166>SUM($V166:Z166)),IF(SUM($P166*$U166/12,$V166:Z166)>$P166,$P166-SUM($V166:Z166),$P166*$U166/12),0)","v":{"v":0,"d":"0.00"}},{"$f":"IF(AND(AB$16*1>=$R166,AB$16*1<=$D$8,$R166<$D$8,$P166>SUM($V166:AA166)),IF(SUM($P166*$U166/12,$V166:AA166)>$P166,$P166-SUM($V166:AA166),$P166*$U166/12),0)","v":{"v":0,"d":"0.00"}},{"$f":"IF(AND(AC$16*1>=$R166,AC$16*1<=$D$8,$R166<$D$8,$P166>SUM($V166:AB166)),IF(SUM($P166*$U166/12,$V166:AB166)>$P166,$P166-SUM($V166:AB166),$P166*$U166/12),0)","v":{"v":0,"d":"0.00"}},{"$f":"IF(AND(AD$16*1>=$R166,AD$16*1<=$D$8,$R166<$D$8,$P166>SUM($V166:AC166)),IF(SUM($P166*$U166/12,$V166:AC166)>$P166,$P166-SUM($V166:AC166),$P166*$U166/12),0)","v":{"v":0,"d":"0.00"}},{"$f":"IF(AND(AE$16*1>=$R166,AE$16*1<=$D$8,$R166<$D$8,$P166>SUM($V166:AD166)),IF(SUM($P166*$U166/12,$V166:AD166)>$P166,$P166-SUM($V166:AD166),$P166*$U166/12),0)","v":{"v":0,"d":"0.00"}},{"$f":"IF(AND(AF$16*1>=$R166,AF$16*1<=$D$8,$R166<$D$8,$P166>SUM($V166:AE166)),IF(SUM($P166*$U166/12,$V166:AE166)>$P166,$P166-SUM($V166:AE166),$P166*$U166/12),0)","v":{"v":0,"d":"0.00"}},{"$f":"IF(AND(AG$16*1>=$R166,AG$16*1<=$D$8,$R166<$D$8,$P166>SUM($V166:AF166)),IF(SUM($P166*$U166/12,$V166:AF166)>$P166,$P166-SUM($V166:AF166),$P166*$U166/12),0)","v":{"v":0,"d":"0.00"}},{"$f":"IF(AND(AH$16*1>=$R166,AH$16*1<=$D$8,$R166<$D$8,$P166>SUM($V166:AG166)),IF(SUM($P166*$U166/12,$V166:AG166)>$P166,$P166-SUM($V166:AG166),$P166*$U166/12),0)","v":{"v":0,"d":"0.00"}},{"v":0,"d":"0.00"},null,null,{"v":606.7,"d":"606.70"},null,{"v":606.7,"d":"606.70"}]
[null,null,159,"336911","3 EQUIPOS DE AIRE ACONDICIONADO",{"$nulls":3},34604.45,{"$nulls":4},34604.45,null,{"v":34604.45,"d":"34,604.45"},"2004-10-27","2004-11-01",null,null,{"v":0.1,"d":"10%"},{"v":34604.45,"d":"34,604.45"},{"$f":"IF(AND(W$16*1>=$R167,W$16*1<=$D$8,$R167<$D$8,$P167>SUM($V167:V167)),IF(SUM($P167*$U167/12,$V167:V167)>$P167,$P167-SUM($V167:V167),$P167*$U167/12),0)","v":{"v":0,"d":"0.00"}},{"$f":"IF(AND(X$16*1>=$R167,X$16*1<=$D$8,$R167<$D$8,$P167>SUM($V167:W167)),IF(SUM($P167*$U167/12,$V167:W167)>$P167,$P167-SUM($V167:W167),$P167*$U167/12),0)","v":{"v":0,"d":"0.00"}},{"$f":"IF(AND(Y$16*1>=$R167,Y$16*1<=$D$8,$R167<$D$8,$P167>SUM($V167:X167)),IF(SUM($P167*$U167/12,$V167:X167)>$P167,$P167-SUM($V167:X167),$P167*$U167/12),0)","v":{"v":0,"d":"0.00"}},{"$f":"IF(AND(Z$16*1>=$R167,Z$16*1<=$D$8,$R167<$D$8,$P167>SUM($V167:Y167)),IF(SUM($P167*$U167/12,$V167:Y167)>$P167,$P167-SUM($V167:Y167),$P167*$U167/12),0)","v":{"v":0,"d":"0.00"}},{"$f":"IF(AND(AA$16*1>=$R167,AA$16*1<=$D$8,$R167<$D$8,$P167>SUM($V167:Z167)),IF(SUM($P167*$U167/12,$V167:Z167)>$P167,$P167-SUM($V167:Z167),$P167*$U167/12),0)","v":{"v":0,"d":"0.00"}},{"$f":"IF(AND(AB$16*1>=$R167,AB$16*1<=$D$8,$R167<$D$8,$P167>SUM($V167:AA167)),IF(SUM($P167*$U167/12,$V167:AA167)>$P167,$P167-SUM($V167:AA167),$P167*$U167/12),0)","v":{"v":0,"d":"0.00"}},{"$f":"IF(AND(AC$16*1>=$R167,AC$16*1<=$D$8,$R167<$D$8,$P167>SUM($V167:AB167)),IF(SUM($P167*$U167/12,$V167:AB167)>$P167,$P167-SUM($V167:AB167),$P167*$U167/12),0)","v":{"v":0,"d":"0.00"}},{"$f":"IF(AND(AD$16*1>=$R167,AD$16*1<=$D$8,$R167<$D$8,$P167>SUM($V167:AC167)),IF(SUM($P167*$U167/12,$V167:AC167)>$P167,$P167-SUM($V167:AC167),$P167*$U167/12),0)","v":{"v":0,"d":"0.00"}},{"$f":"IF(AND(AE$16*1>=$R167,AE$16*1<=$D$8,$R167<$D$8,$P167>SUM($V167:AD167)),IF(SUM($P167*$U167/12,$V167:AD167)>$P167,$P167-SUM($V167:AD167),$P167*$U167/12),0)","v":{"v":0,"d":"0.00"}},{"$f":"IF(AND(AF$16*1>=$R167,AF$16*1<=$D$8,$R167<$D$8,$P167>SUM($V167:AE167)),IF(SUM($P167*$U167/12,$V167:AE167)>$P167,$P167-SUM($V167:AE167),$P167*$U167/12),0)","v":{"v":0,"d":"0.00"}},{"$f":"IF(AND(AG$16*1>=$R167,AG$16*1<=$D$8,$R167<$D$8,$P167>SUM($V167:AF167)),IF(SUM($P167*$U167/12,$V167:AF167)>$P167,$P167-SUM($V167:AF167),$P167*$U167/12),0)","v":{"v":0,"d":"0.00"}},{"$f":"IF(AND(AH$16*1>=$R167,AH$16*1<=$D$8,$R167<$D$8,$P167>SUM($V167:AG167)),IF(SUM($P167*$U167/12,$V167:AG167)>$P167,$P167-SUM($V167:AG167),$P167*$U167/12),0)","v":{"v":0,"d":"0.00"}},{"v":0,"d":"0.00"},null,null,{"v":34604.45,"d":"34,604.45"},null,{"v":34604.45,"d":"34,604.45"}]
[null,null,160,"336911","2 EQUIPOS DE AIRE ACONDICIONADO",{"$nulls":3},18602.02,{"$nulls":4},18602.02,null,{"v":18602.02,"d":"18,602.02"},"2004-11-28","2004-12-01",null,null,{"v":0.1,"d":"10%"},{"v":18602.02,"d":"18,602.02"},{"$f":"IF(AND(W$16*1>=$R168,W$16*1<=$D$8,$R168<$D$8,$P168>SUM($V168:V168)),IF(SUM($P168*$U168/12,$V168:V168)>$P168,$P168-SUM($V168:V168),$P168*$U168/12),0)","v":{"v":0,"d":"0.00"}},{"$f":"IF(AND(X$16*1>=$R168,X$16*1<=$D$8,$R168<$D$8,$P168>SUM($V168:W168)),IF(SUM($P168*$U168/12,$V168:W168)>$P168,$P168-SUM($V168:W168),$P168*$U168/12),0)","v":{"v":0,"d":"0.00"}},{"$f":"IF(AND(Y$16*1>=$R168,Y$16*1<=$D$8,$R168<$D$8,$P168>SUM($V168:X168)),IF(SUM($P168*$U168/12,$V168:X168)>$P168,$P168-SUM($V168:X168),$P168*$U168/12),0)","v":{"v":0,"d":"0.00"}},{"$f":"IF(AND(Z$16*1>=$R168,Z$16*1<=$D$8,$R168<$D$8,$P168>SUM($V168:Y168)),IF(SUM($P168*$U168/12,$V168:Y168)>$P168,$P168-SUM($V168:Y168),$P168*$U168/12),0)","v":{"v":0,"d":"0.00"}},{"$f":"IF(AND(AA$16*1>=$R168,AA$16*1<=$D$8,$R168<$D$8,$P168>SUM($V168:Z168)),IF(SUM($P168*$U168/12,$V168:Z168)>$P168,$P168-SUM($V168:Z168),$P168*$U168/12),0)","v":{"v":0,"d":"0.00"}},{"$f":"IF(AND(AB$16*1>=$R168,AB$16*1<=$D$8,$R168<$D$8,$P168>SUM($V168:AA168)),IF(SUM($P168*$U168/12,$V168:AA168)>$P168,$P168-SUM($V168:AA168),$P168*$U168/12),0)","v":{"v":0,"d":"0.00"}},{"$f":"IF(AND(AC$16*1>=$R168,AC$16*1<=$D$8,$R168<$D$8,$P168>SUM($V168:AB168)),IF(SUM($P168*$U168/12,$V168:AB168)>$P168,$P168-SUM($V168:AB168),$P168*$U168/12),0)","v":{"v":0,"d":"0.00"}},{"$f":"IF(AND(AD$16*1>=$R168,AD$16*1<=$D$8,$R168<$D$8,$P168>SUM($V168:AC168)),IF(SUM($P168*$U168/12,$V168:AC168)>$P168,$P168-SUM($V168:AC168),$P168*$U168/12),0)","v":{"v":0,"d":"0.00"}},{"$f":"IF(AND(AE$16*1>=$R168,AE$16*1<=$D$8,$R168<$D$8,$P168>SUM($V168:AD168)),IF(SUM($P168*$U168/12,$V168:AD168)>$P168,$P168-SUM($V168:AD168),$P168*$U168/12),0)","v":{"v":0,"d":"0.00"}},{"$f":"IF(AND(AF$16*1>=$R168,AF$16*1<=$D$8,$R168<$D$8,$P168>SUM($V168:AE168)),IF(SUM($P168*$U168/12,$V168:AE168)>$P168,$P168-SUM($V168:AE168),$P168*$U168/12),0)","v":{"v":0,"d":"0.00"}},{"$f":"IF(AND(AG$16*1>=$R168,AG$16*1<=$D$8,$R168<$D$8,$P168>SUM($V168:AF168)),IF(SUM($P168*$U168/12,$V168:AF168)>$P168,$P168-SUM($V168:AF168),$P168*$U168/12),0)","v":{"v":0,"d":"0.00"}},{"$f":"IF(AND(AH$16*1>=$R168,AH$16*1<=$D$8,$R168<$D$8,$P168>SUM($V168:AG168)),IF(SUM($P168*$U168/12,$V168:AG168)>$P168,$P168-SUM($V168:AG168),$P168*$U168/12),0)","v":{"v":0,"d":"0.00"}},{"v":0,"d":"0.00"},null,null,{"v":18602.02,"d":"18,602.02"},null,{"v":18602.02,"d":"18,602.02"}]
[null,null,161,"336911","EQUIPO DE ILUMINACION",{"$nulls":3},9235.95,{"$nulls":4},9235.95,null,{"v":9235.95,"d":"9,235.95"},"2004-12-08","2005-01-01",null,null,{"v":0.1,"d":"10%"},{"v":9235.95,"d":"9,235.95"},{"$f":"IF(AND(W$16*1>=$R169,W$16*1<=$D$8,$R169<$D$8,$P169>SUM($V169:V169)),IF(SUM($P169*$U169/12,$V169:V169)>$P169,$P169-SUM($V169:V169),$P169*$U169/12),0)","v":{"v":0,"d":"0.00"}},{"$f":"IF(AND(X$16*1>=$R169,X$16*1<=$D$8,$R169<$D$8,$P169>SUM($V169:W169)),IF(SUM($P169*$U169/12,$V169:W169)>$P169,$P169-SUM($V169:W169),$P169*$U169/12),0)","v":{"v":0,"d":"0.00"}},{"$f":"IF(AND(Y$16*1>=$R169,Y$16*1<=$D$8,$R169<$D$8,$P169>SUM($V169:X169)),IF(SUM($P169*$U169/12,$V169:X169)>$P169,$P169-SUM($V169:X169),$P169*$U169/12),0)","v":{"v":0,"d":"0.00"}},{"$f":"IF(AND(Z$16*1>=$R169,Z$16*1<=$D$8,$R169<$D$8,$P169>SUM($V169:Y169)),IF(SUM($P169*$U169/12,$V169:Y169)>$P169,$P169-SUM($V169:Y169),$P169*$U169/12),0)","v":{"v":0,"d":"0.00"}},{"$f":"IF(AND(AA$16*1>=$R169,AA$16*1<=$D$8,$R169<$D$8,$P169>SUM($V169:Z169)),IF(SUM($P169*$U169/12,$V169:Z169)>$P169,$P169-SUM($V169:Z169),$P169*$U169/12),0)","v":{"v":0,"d":"0.00"}},{"$f":"IF(AND(AB$16*1>=$R169,AB$16*1<=$D$8,$R169<$D$8,$P169>SUM($V169:AA169)),IF(SUM($P169*$U169/12,$V169:AA169)>$P169,$P169-SUM($V169:AA169),$P169*$U169/12),0)","v":{"v":0,"d":"0.00"}},{"$f":"IF(AND(AC$16*1>=$R169,AC$16*1<=$D$8,$R169<$D$8,$P169>SUM($V169:AB169)),IF(SUM($P169*$U169/12,$V169:AB169)>$P169,$P169-SUM($V169:AB169),$P169*$U169/12),0)","v":{"v":0,"d":"0.00"}},{"$f":"IF(AND(AD$16*1>=$R169,AD$16*1<=$D$8,$R169<$D$8,$P169>SUM($V169:AC169)),IF(SUM($P169*$U169/12,$V169:AC169)>$P169,$P169-SUM($V169:AC169),$P169*$U169/12),0)","v":{"v":0,"d":"0.00"}},{"$f":"IF(AND(AE$16*1>=$R169,AE$16*1<=$D$8,$R169<$D$8,$P169>SUM($V169:AD169)),IF(SUM($P169*$U169/12,$V169:AD169)>$P169,$P169-SUM($V169:AD169),$P169*$U169/12),0)","v":{"v":0,"d":"0.00"}},{"$f":"IF(AND(AF$16*1>=$R169,AF$16*1<=$D$8,$R169<$D$8,$P169>SUM($V169:AE169)),IF(SUM($P169*$U169/12,$V169:AE169)>$P169,$P169-SUM($V169:AE169),$P169*$U169/12),0)","v":{"v":0,"d":"0.00"}},{"$f":"IF(AND(AG$16*1>=$R169,AG$16*1<=$D$8,$R169<$D$8,$P169>SUM($V169:AF169)),IF(SUM($P169*$U169/12,$V169:AF169)>$P169,$P169-SUM($V169:AF169),$P169*$U169/12),0)","v":{"v":0,"d":"0.00"}},{"$f":"IF(AND(AH$16*1>=$R169,AH$16*1<=$D$8,$R169<$D$8,$P169>SUM($V169:AG169)),IF(SUM($P169*$U169/12,$V169:AG169)>$P169,$P169-SUM($V169:AG169),$P169*$U169/12),0)","v":{"v":0,"d":"0.00"}},{"v":0,"d":"0.00"},null,null,{"v":9235.95,"d":"9,235.95"},null,{"v":9235.95,"d":"9,235.95"}]
[null,null,162,"336911","PROYECTOR DELL",{"$nulls":3},8114.05,{"$nulls":4},8114.05,null,{"v":8114.05,"d":"8,114.05"},"2008-11-23","2008-12-01",null,null,{"v":0.1,"d":"10%"},{"v":8114.05,"d":"8,114.05"},{"$f":"IF(AND(W$16*1>=$R170,W$16*1<=$D$8,$R170<$D$8,$P170>SUM($V170:V170)),IF(SUM($P170*$U170/12,$V170:V170)>$P170,$P170-SUM($V170:V170),$P170*$U170/12),0)","v":{"v":0,"d":"0.00"}},{"$f":"IF(AND(X$16*1>=$R170,X$16*1<=$D$8,$R170<$D$8,$P170>SUM($V170:W170)),IF(SUM($P170*$U170/12,$V170:W170)>$P170,$P170-SUM($V170:W170),$P170*$U170/12),0)","v":{"v":0,"d":"0.00"}},{"$f":"IF(AND(Y$16*1>=$R170,Y$16*1<=$D$8,$R170<$D$8,$P170>SUM($V170:X170)),IF(SUM($P170*$U170/12,$V170:X170)>$P170,$P170-SUM($V170:X170),$P170*$U170/12),0)","v":{"v":0,"d":"0.00"}},{"$f":"IF(AND(Z$16*1>=$R170,Z$16*1<=$D$8,$R170<$D$8,$P170>SUM($V170:Y170)),IF(SUM($P170*$U170/12,$V170:Y170)>$P170,$P170-SUM($V170:Y170),$P170*$U170/12),0)","v":{"v":0,"d":"0.00"}},{"$f":"IF(AND(AA$16*1>=$R170,AA$16*1<=$D$8,$R170<$D$8,$P170>SUM($V170:Z170)),IF(SUM($P170*$U170/12,$V170:Z170)>$P170,$P170-SUM($V170:Z170),$P170*$U170/12),0)","v":{"v":0,"d":"0.00"}},{"$f":"IF(AND(AB$16*1>=$R170,AB$16*1<=$D$8,$R170<$D$8,$P170>SUM($V170:AA170)),IF(SUM($P170*$U170/12,$V170:AA170)>$P170,$P170-SUM($V170:AA170),$P170*$U170/12),0)","v":{"v":0,"d":"0.00"}},{"$f":"IF(AND(AC$16*1>=$R170,AC$16*1<=$D$8,$R170<$D$8,$P170>SUM($V170:AB170)),IF(SUM($P170*$U170/12,$V170:AB170)>$P170,$P170-SUM($V170:AB170),$P170*$U170/12),0)","v":{"v":0,"d":"0.00"}},{"$f":"IF(AND(AD$16*1>=$R170,AD$16*1<=$D$8,$R170<$D$8,$P170>SUM($V170:AC170)),IF(SUM($P170*$U170/12,$V170:AC170)>$P170,$P170-SUM($V170:AC170),$P170*$U170/12),0)","v":{"v":0,"d":"0.00"}},{"$f":"IF(AND(AE$16*1>=$R170,AE$16*1<=$D$8,$R170<$D$8,$P170>SUM($V170:AD170)),IF(SUM($P170*$U170/12,$V170:AD170)>$P170,$P170-SUM($V170:AD170),$P170*$U170/12),0)","v":{"v":0,"d":"0.00"}},{"$f":"IF(AND(AF$16*1>=$R170,AF$16*1<=$D$8,$R170<$D$8,$P170>SUM($V170:AE170)),IF(SUM($P170*$U170/12,$V170:AE170)>$P170,$P170-SUM($V170:AE170),$P170*$U170/12),0)","v":{"v":0,"d":"0.00"}},{"$f":"IF(AND(AG$16*1>=$R170,AG$16*1<=$D$8,$R170<$D$8,$P170>SUM($V170:AF170)),IF(SUM($P170*$U170/12,$V170:AF170)>$P170,$P170-SUM($V170:AF170),$P170*$U170/12),0)","v":{"v":0,"d":"0.00"}},{"$f":"IF(AND(AH$16*1>=$R170,AH$16*1<=$D$8,$R170<$D$8,$P170>SUM($V170:AG170)),IF(SUM($P170*$U170/12,$V170:AG170)>$P170,$P170-SUM($V170:AG170),$P170*$U170/12),0)","v":{"v":0,"d":"0.00"}},{"v":0,"d":"0.00"},null,null,{"v":8114.05,"d":"8,114.05"},null,{"v":8114.05,"d":"8,114.05"}]
[null,null,163,"336911","FOTOCOPIADORA XEROX",{"$nulls":3},3064.67,{"$nulls":4},3064.67,null,{"v":3064.67,"d":"3,064.67"},"2008-12-01","2009-01-01",null,null,{"v":0.1,"d":"10%"},{"v":3064.67,"d":"3,064.67"},{"$f":"IF(AND(W$16*1>=$R171,W$16*1<=$D$8,$R171<$D$8,$P171>SUM($V171:V171)),IF(SUM($P171*$U171/12,$V171:V171)>$P171,$P171-SUM($V171:V171),$P171*$U171/12),0)","v":{"v":0,"d":"0.00"}},{"$f":"IF(AND(X$16*1>=$R171,X$16*1<=$D$8,$R171<$D$8,$P171>SUM($V171:W171)),IF(SUM($P171*$U171/12,$V171:W171)>$P171,$P171-SUM($V171:W171),$P171*$U171/12),0)","v":{"v":0,"d":"0.00"}},{"$f":"IF(AND(Y$16*1>=$R171,Y$16*1<=$D$8,$R171<$D$8,$P171>SUM($V171:X171)),IF(SUM($P171*$U171/12,$V171:X171)>$P171,$P171-SUM($V171:X171),$P171*$U171/12),0)","v":{"v":0,"d":"0.00"}},{"$f":"IF(AND(Z$16*1>=$R171,Z$16*1<=$D$8,$R171<$D$8,$P171>SUM($V171:Y171)),IF(SUM($P171*$U171/12,$V171:Y171)>$P171,$P171-SUM($V171:Y171),$P171*$U171/12),0)","v":{"v":0,"d":"0.00"}},{"$f":"IF(AND(AA$16*1>=$R171,AA$16*1<=$D$8,$R171<$D$8,$P171>SUM($V171:Z171)),IF(SUM($P171*$U171/12,$V171:Z171)>$P171,$P171-SUM($V171:Z171),$P171*$U171/12),0)","v":{"v":0,"d":"0.00"}},{"$f":"IF(AND(AB$16*1>=$R171,AB$16*1<=$D$8,$R171<$D$8,$P171>SUM($V171:AA171)),IF(SUM($P171*$U171/12,$V171:AA171)>$P171,$P171-SUM($V171:AA171),$P171*$U171/12),0)","v":{"v":0,"d":"0.00"}},{"$f":"IF(AND(AC$16*1>=$R171,AC$16*1<=$D$8,$R171<$D$8,$P171>SUM($V171:AB171)),IF(SUM($P171*$U171/12,$V171:AB171)>$P171,$P171-SUM($V171:AB171),$P171*$U171/12),0)","v":{"v":0,"d":"0.00"}},{"$f":"IF(AND(AD$16*1>=$R171,AD$16*1<=$D$8,$R171<$D$8,$P171>SUM($V171:AC171)),IF(SUM($P171*$U171/12,$V171:AC171)>$P171,$P171-SUM($V171:AC171),$P171*$U171/12),0)","v":{"v":0,"d":"0.00"}},{"$f":"IF(AND(AE$16*1>=$R171,AE$16*1<=$D$8,$R171<$D$8,$P171>SUM($V171:AD171)),IF(SUM($P171*$U171/12,$V171:AD171)>$P171,$P171-SUM($V171:AD171),$P171*$U171/12),0)","v":{"v":0,"d":"0.00"}},{"$f":"IF(AND(AF$16*1>=$R171,AF$16*1<=$D$8,$R171<$D$8,$P171>SUM($V171:AE171)),IF(SUM($P171*$U171/12,$V171:AE171)>$P171,$P171-SUM($V171:AE171),$P171*$U171/12),0)","v":{"v":0,"d":"0.00"}},{"$f":"IF(AND(AG$16*1>=$R171,AG$16*1<=$D$8,$R171<$D$8,$P171>SUM($V171:AF171)),IF(SUM($P171*$U171/12,$V171:AF171)>$P171,$P171-SUM($V171:AF171),$P171*$U171/12),0)","v":{"v":0,"d":"0.00"}},{"$f":"IF(AND(AH$16*1>=$R171,AH$16*1<=$D$8,$R171<$D$8,$P171>SUM($V171:AG171)),IF(SUM($P171*$U171/12,$V171:AG171)>$P171,$P171-SUM($V171:AG171),$P171*$U171/12),0)","v":{"v":0,"d":"0.00"}},{"v":0,"d":"0.00"},null,null,{"v":3064.67,"d":"3,064.67"},null,{"v":3064.67,"d":"3,064.67"}]
[null,null,164,"336911","REFRIGERADORA 8 P. INRESA (INC.FLETE)",{"$nulls":3},817.56,{"$nulls":4},817.56,null,817.56,"2006-12-13","2007-01-01",null,null,{"v":0.1,"d":"10%"},817.56,{"$f":"IF(AND(W$16*1>=$R172,W$16*1<=$D$8,$R172<$D$8,$P172>SUM($V172:V172)),IF(SUM($P172*$U172/12,$V172:V172)>$P172,$P172-SUM($V172:V172),$P172*$U172/12),0)","v":{"v":0,"d":"0.00"}},{"$f":"IF(AND(X$16*1>=$R172,X$16*1<=$D$8,$R172<$D$8,$P172>SUM($V172:W172)),IF(SUM($P172*$U172/12,$V172:W172)>$P172,$P172-SUM($V172:W172),$P172*$U172/12),0)","v":{"v":0,"d":"0.00"}},{"$f":"IF(AND(Y$16*1>=$R172,Y$16*1<=$D$8,$R172<$D$8,$P172>SUM($V172:X172)),IF(SUM($P172*$U172/12,$V172:X172)>$P172,$P172-SUM($V172:X172),$P172*$U172/12),0)","v":{"v":0,"d":"0.00"}},{"$f":"IF(AND(Z$16*1>=$R172,Z$16*1<=$D$8,$R172<$D$8,$P172>SUM($V172:Y172)),IF(SUM($P172*$U172/12,$V172:Y172)>$P172,$P172-SUM($V172:Y172),$P172*$U172/12),0)","v":{"v":0,"d":"0.00"}},{"$f":"IF(AND(AA$16*1>=$R172,AA$16*1<=$D$8,$R172<$D$8,$P172>SUM($V172:Z172)),IF(SUM($P172*$U172/12,$V172:Z172)>$P172,$P172-SUM($V172:Z172),$P172*$U172/12),0)","v":{"v":0,"d":"0.00"}},{"$f":"IF(AND(AB$16*1>=$R172,AB$16*1<=$D$8,$R172<$D$8,$P172>SUM($V172:AA172)),IF(SUM($P172*$U172/12,$V172:AA172)>$P172,$P172-SUM($V172:AA172),$P172*$U172/12),0)","v":{"v":0,"d":"0.00"}},{"$f":"IF(AND(AC$16*1>=$R172,AC$16*1<=$D$8,$R172<$D$8,$P172>SUM($V172:AB172)),IF(SUM($P172*$U172/12,$V172:AB172)>$P172,$P172-SUM($V172:AB172),$P172*$U172/12),0)","v":{"v":0,"d":"0.00"}},{"$f":"IF(AND(AD$16*1>=$R172,AD$16*1<=$D$8,$R172<$D$8,$P172>SUM($V172:AC172)),IF(SUM($P172*$U172/12,$V172:AC172)>$P172,$P172-SUM($V172:AC172),$P172*$U172/12),0)","v":{"v":0,"d":"0.00"}},{"$f":"IF(AND(AE$16*1>=$R172,AE$16*1<=$D$8,$R172<$D$8,$P172>SUM($V172:AD172)),IF(SUM($P172*$U172/12,$V172:AD172)>$P172,$P172-SUM($V172:AD172),$P172*$U172/12),0)","v":{"v":0,"d":"0.00"}},{"$f":"IF(AND(AF$16*1>=$R172,AF$16*1<=$D$8,$R172<$D$8,$P172>SUM($V172:AE172)),IF(SUM($P172*$U172/12,$V172:AE172)>$P172,$P172-SUM($V172:AE172),$P172*$U172/12),0)","v":{"v":0,"d":"0.00"}},{"$f":"IF(AND(AG$16*1>=$R172,AG$16*1<=$D$8,$R172<$D$8,$P172>SUM($V172:AF172)),IF(SUM($P172*$U172/12,$V172:AF172)>$P172,$P172-SUM($V172:AF172),$P172*$U172/12),0)","v":{"v":0,"d":"0.00"}},{"$f":"IF(AND(AH$16*1>=$R172,AH$16*1<=$D$8,$R172<$D$8,$P172>SUM($V172:AG172)),IF(SUM($P172*$U172/12,$V172:AG172)>$P172,$P172-SUM($V172:AG172),$P172*$U172/12),0)","v":{"v":0,"d":"0.00"}},{"v":0,"d":"0.00"},null,null,817.56,null,817.56]
[null,null,165,"336911","MICROGRABADORA SHACK",{"$nulls":3},122.75,{"$nulls":4},122.75,null,122.75,"2008-12-04","2009-01-01",null,null,{"v":0.1,"d":"10%"},122.75,{"$f":"IF(AND(W$16*1>=$R173,W$16*1<=$D$8,$R173<$D$8,$P173>SUM($V173:V173)),IF(SUM($P173*$U173/12,$V173:V173)>$P173,$P173-SUM($V173:V173),$P173*$U173/12),0)","v":{"v":0,"d":"0.00"}},{"$f":"IF(AND(X$16*1>=$R173,X$16*1<=$D$8,$R173<$D$8,$P173>SUM($V173:W173)),IF(SUM($P173*$U173/12,$V173:W173)>$P173,$P173-SUM($V173:W173),$P173*$U173/12),0)","v":{"v":0,"d":"0.00"}},{"$f":"IF(AND(Y$16*1>=$R173,Y$16*1<=$D$8,$R173<$D$8,$P173>SUM($V173:X173)),IF(SUM($P173*$U173/12,$V173:X173)>$P173,$P173-SUM($V173:X173),$P173*$U173/12),0)","v":{"v":0,"d":"0.00"}},{"$f":"IF(AND(Z$16*1>=$R173,Z$16*1<=$D$8,$R173<$D$8,$P173>SUM($V173:Y173)),IF(SUM($P173*$U173/12,$V173:Y173)>$P173,$P173-SUM($V173:Y173),$P173*$U173/12),0)","v":{"v":0,"d":"0.00"}},{"$f":"IF(AND(AA$16*1>=$R173,AA$16*1<=$D$8,$R173<$D$8,$P173>SUM($V173:Z173)),IF(SUM($P173*$U173/12,$V173:Z173)>$P173,$P173-SUM($V173:Z173),$P173*$U173/12),0)","v":{"v":0,"d":"0.00"}},{"$f":"IF(AND(AB$16*1>=$R173,AB$16*1<=$D$8,$R173<$D$8,$P173>SUM($V173:AA173)),IF(SUM($P173*$U173/12,$V173:AA173)>$P173,$P173-SUM($V173:AA173),$P173*$U173/12),0)","v":{"v":0,"d":"0.00"}},{"$f":"IF(AND(AC$16*1>=$R173,AC$16*1<=$D$8,$R173<$D$8,$P173>SUM($V173:AB173)),IF(SUM($P173*$U173/12,$V173:AB173)>$P173,$P173-SUM($V173:AB173),$P173*$U173/12),0)","v":{"v":0,"d":"0.00"}},{"$f":"IF(AND(AD$16*1>=$R173,AD$16*1<=$D$8,$R173<$D$8,$P173>SUM($V173:AC173)),IF(SUM($P173*$U173/12,$V173:AC173)>$P173,$P173-SUM($V173:AC173),$P173*$U173/12),0)","v":{"v":0,"d":"0.00"}},{"$f":"IF(AND(AE$16*1>=$R173,AE$16*1<=$D$8,$R173<$D$8,$P173>SUM($V173:AD173)),IF(SUM($P173*$U173/12,$V173:AD173)>$P173,$P173-SUM($V173:AD173),$P173*$U173/12),0)","v":{"v":0,"d":"0.00"}},{"$f":"IF(AND(AF$16*1>=$R173,AF$16*1<=$D$8,$R173<$D$8,$P173>SUM($V173:AE173)),IF(SUM($P173*$U173/12,$V173:AE173)>$P173,$P173-SUM($V173:AE173),$P173*$U173/12),0)","v":{"v":0,"d":"0.00"}},{"$f":"IF(AND(AG$16*1>=$R173,AG$16*1<=$D$8,$R173<$D$8,$P173>SUM($V173:AF173)),IF(SUM($P173*$U173/12,$V173:AF173)>$P173,$P173-SUM($V173:AF173),$P173*$U173/12),0)","v":{"v":0,"d":"0.00"}},{"$f":"IF(AND(AH$16*1>=$R173,AH$16*1<=$D$8,$R173<$D$8,$P173>SUM($V173:AG173)),IF(SUM($P173*$U173/12,$V173:AG173)>$P173,$P173-SUM($V173:AG173),$P173*$U173/12),0)","v":{"v":0,"d":"0.00"}},{"v":0,"d":"0.00"},null,null,122.75,null,122.75]
[null,null,166,"336911","CAMARA DIGITAL SONY",{"$nulls":3},1025.99,{"$nulls":4},1025.99,null,{"v":1025.99,"d":"1,025.99"},"2009-05-19","2009-06-01",null,null,{"v":0.1,"d":"10%"},980.28,{"$f":"IF(AND(W$16*1>=$R174,W$16*1<=$D$8,$R174<$D$8,$P174>SUM($V174:V174)),IF(SUM($P174*$U174/12,$V174:V174)>$P174,$P174-SUM($V174:V174),$P174*$U174/12),0)","v":{"v":8.549916666666666,"d":"8.55"}},{"$f":"IF(AND(X$16*1>=$R174,X$16*1<=$D$8,$R174<$D$8,$P174>SUM($V174:W174)),IF(SUM($P174*$U174/12,$V174:W174)>$P174,$P174-SUM($V174:W174),$P174*$U174/12),0)","v":{"v":8.549916666666666,"d":"8.55"}},{"$f":"IF(AND(Y$16*1>=$R174,Y$16*1<=$D$8,$R174<$D$8,$P174>SUM($V174:X174)),IF(SUM($P174*$U174/12,$V174:X174)>$P174,$P174-SUM($V174:X174),$P174*$U174/12),0)","v":{"v":8.549916666666666,"d":"8.55"}},{"$f":"IF(AND(Z$16*1>=$R174,Z$16*1<=$D$8,$R174<$D$8,$P174>SUM($V174:Y174)),IF(SUM($P174*$U174/12,$V174:Y174)>$P174,$P174-SUM($V174:Y174),$P174*$U174/12),0)","v":{"v":8.549916666666666,"d":"8.55"}},{"$f":"IF(AND(AA$16*1>=$R174,AA$16*1<=$D$8,$R174<$D$8,$P174>SUM($V174:Z174)),IF(SUM($P174*$U174/12,$V174:Z174)>$P174,$P174-SUM($V174:Z174),$P174*$U174/12),0)","v":{"v":8.549916666666666,"d":"8.55"}},{"$f":"IF(AND(AB$16*1>=$R174,AB$16*1<=$D$8,$R174<$D$8,$P174>SUM($V174:AA174)),IF(SUM($P174*$U174/12,$V174:AA174)>$P174,$P174-SUM($V174:AA174),$P174*$U174/12),0)","v":{"v":0,"d":"0.00"}},{"$f":"IF(AND(AC$16*1>=$R174,AC$16*1<=$D$8,$R174<$D$8,$P174>SUM($V174:AB174)),IF(SUM($P174*$U174/12,$V174:AB174)>$P174,$P174-SUM($V174:AB174),$P174*$U174/12),0)","v":{"v":0,"d":"0.00"}},{"$f":"IF(AND(AD$16*1>=$R174,AD$16*1<=$D$8,$R174<$D$8,$P174>SUM($V174:AC174)),IF(SUM($P174*$U174/12,$V174:AC174)>$P174,$P174-SUM($V174:AC174),$P174*$U174/12),0)","v":{"v":0,"d":"0.00"}},{"$f":"IF(AND(AE$16*1>=$R174,AE$16*1<=$D$8,$R174<$D$8,$P174>SUM($V174:AD174)),IF(SUM($P174*$U174/12,$V174:AD174)>$P174,$P174-SUM($V174:AD174),$P174*$U174/12),0)","v":{"v":0,"d":"0.00"}},{"$f":"IF(AND(AF$16*1>=$R174,AF$16*1<=$D$8,$R174<$D$8,$P174>SUM($V174:AE174)),IF(SUM($P174*$U174/12,$V174:AE174)>$P174,$P174-SUM($V174:AE174),$P174*$U174/12),0)","v":{"v":0,"d":"0.00"}},{"$f":"IF(AND(AG$16*1>=$R174,AG$16*1<=$D$8,$R174<$D$8,$P174>SUM($V174:AF174)),IF(SUM($P174*$U174/12,$V174:AF174)>$P174,$P174-SUM($V174:AF174),$P174*$U174/12),0)","v":{"v":0,"d":"0.00"}},{"$f":"IF(AND(AH$16*1>=$R174,AH$16*1<=$D$8,$R174<$D$8,$P174>SUM($V174:AG174)),IF(SUM($P174*$U174/12,$V174:AG174)>$P174,$P174-SUM($V174:AG174),$P174*$U174/12),0)","v":{"v":0,"d":"0.00"}},{"v":42.749583333333334,"d":"42.75"},null,null,{"v":1005.92975,"d":"1,005.93"},null,{"v":1005.92975,"d":"1,005.93"}]
[null,null,167,"336911","MINIGRABADORA PANASONIC",{"$nulls":3},376.64,{"$nulls":4},376.64,null,376.64,"2009-06-29","2009-07-01",null,null,{"v":0.1,"d":"10%"},357.77,{"$f":"IF(AND(W$16*1>=$R175,W$16*1<=$D$8,$R175<$D$8,$P175>SUM($V175:V175)),IF(SUM($P175*$U175/12,$V175:V175)>$P175,$P175-SUM($V175:V175),$P175*$U175/12),0)","v":{"v":3.138666666666667,"d":"3.14"}},{"$f":"IF(AND(X$16*1>=$R175,X$16*1<=$D$8,$R175<$D$8,$P175>SUM($V175:W175)),IF(SUM($P175*$U175/12,$V175:W175)>$P175,$P175-SUM($V175:W175),$P175*$U175/12),0)","v":{"v":3.138666666666667,"d":"3.14"}},{"$f":"IF(AND(Y$16*1>=$R175,Y$16*1<=$D$8,$R175<$D$8,$P175>SUM($V175:X175)),IF(SUM($P175*$U175/12,$V175:X175)>$P175,$P175-SUM($V175:X175),$P175*$U175/12),0)","v":{"v":3.138666666666667,"d":"3.14"}},{"$f":"IF(AND(Z$16*1>=$R175,Z$16*1<=$D$8,$R175<$D$8,$P175>SUM($V175:Y175)),IF(SUM($P175*$U175/12,$V175:Y175)>$P175,$P175-SUM($V175:Y175),$P175*$U175/12),0)","v":{"v":3.138666666666667,"d":"3.14"}},{"$f":"IF(AND(AA$16*1>=$R175,AA$16*1<=$D$8,$R175<$D$8,$P175>SUM($V175:Z175)),IF(SUM($P175*$U175/12,$V175:Z175)>$P175,$P175-SUM($V175:Z175),$P175*$U175/12),0)","v":{"v":3.138666666666667,"d":"3.14"}},{"$f":"IF(AND(AB$16*1>=$R175,AB$16*1<=$D$8,$R175<$D$8,$P175>SUM($V175:AA175)),IF(SUM($P175*$U175/12,$V175:AA175)>$P175,$P175-SUM($V175:AA175),$P175*$U175/12),0)","v":{"v":0,"d":"0.00"}},{"$f":"IF(AND(AC$16*1>=$R175,AC$16*1<=$D$8,$R175<$D$8,$P175>SUM($V175:AB175)),IF(SUM($P175*$U175/12,$V175:AB175)>$P175,$P175-SUM($V175:AB175),$P175*$U175/12),0)","v":{"v":0,"d":"0.00"}},{"$f":"IF(AND(AD$16*1>=$R175,AD$16*1<=$D$8,$R175<$D$8,$P175>SUM($V175:AC175)),IF(SUM($P175*$U175/12,$V175:AC175)>$P175,$P175-SUM($V175:AC175),$P175*$U175/12),0)","v":{"v":0,"d":"0.00"}},{"$f":"IF(AND(AE$16*1>=$R175,AE$16*1<=$D$8,$R175<$D$8,$P175>SUM($V175:AD175)),IF(SUM($P175*$U175/12,$V175:AD175)>$P175,$P175-SUM($V175:AD175),$P175*$U175/12),0)","v":{"v":0,"d":"0.00"}},{"$f":"IF(AND(AF$16*1>=$R175,AF$16*1<=$D$8,$R175<$D$8,$P175>SUM($V175:AE175)),IF(SUM($P175*$U175/12,$V175:AE175)>$P175,$P175-SUM($V175:AE175),$P175*$U175/12),0)","v":{"v":0,"d":"0.00"}},{"$f":"IF(AND(AG$16*1>=$R175,AG$16*1<=$D$8,$R175<$D$8,$P175>SUM($V175:AF175)),IF(SUM($P175*$U175/12,$V175:AF175)>$P175,$P175-SUM($V175:AF175),$P175*$U175/12),0)","v":{"v":0,"d":"0.00"}},{"$f":"IF(AND(AH$16*1>=$R175,AH$16*1<=$D$8,$R175<$D$8,$P175>SUM($V175:AG175)),IF(SUM($P175*$U175/12,$V175:AG175)>$P175,$P175-SUM($V175:AG175),$P175*$U175/12),0)","v":{"v":0,"d":"0.00"}},{"v":15.693333333333335,"d":"15.69"},null,null,{"v":367.186,"d":"367.19"},null,{"v":367.186,"d":"367.19"}]
[null,null,168,"336911","ASPIRADORA ELECTROLUX",{"$nulls":3},171.85,{"$nulls":4},171.85,null,171.85,"2014-02-15","2014-03-01",null,null,{"v":0.1,"d":"10%"},83.08,{"$f":"IF(AND(W$16*1>=$R176,W$16*1<=$D$8,$R176<$D$8,$P176>SUM($V176:V176)),IF(SUM($P176*$U176/12,$V176:V176)>$P176,$P176-SUM($V176:V176),$P176*$U176/12),0)","v":{"v":1.4320833333333332,"d":"1.43"}},{"$f":"IF(AND(X$16*1>=$R176,X$16*1<=$D$8,$R176<$D$8,$P176>SUM($V176:W176)),IF(SUM($P176*$U176/12,$V176:W176)>$P176,$P176-SUM($V176:W176),$P176*$U176/12),0)","v":{"v":1.4320833333333332,"d":"1.43"}},{"$f":"IF(AND(Y$16*1>=$R176,Y$16*1<=$D$8,$R176<$D$8,$P176>SUM($V176:X176)),IF(SUM($P176*$U176/12,$V176:X176)>$P176,$P176-SUM($V176:X176),$P176*$U176/12),0)","v":{"v":1.4320833333333332,"d":"1.43"}},{"$f":"IF(AND(Z$16*1>=$R176,Z$16*1<=$D$8,$R176<$D$8,$P176>SUM($V176:Y176)),IF(SUM($P176*$U176/12,$V176:Y176)>$P176,$P176-SUM($V176:Y176),$P176*$U176/12),0)","v":{"v":1.4320833333333332,"d":"1.43"}},{"$f":"IF(AND(AA$16*1>=$R176,AA$16*1<=$D$8,$R176<$D$8,$P176>SUM($V176:Z176)),IF(SUM($P176*$U176/12,$V176:Z176)>$P176,$P176-SUM($V176:Z176),$P176*$U176/12),0)","v":{"v":1.4320833333333332,"d":"1.43"}},{"$f":"IF(AND(AB$16*1>=$R176,AB$16*1<=$D$8,$R176<$D$8,$P176>SUM($V176:AA176)),IF(SUM($P176*$U176/12,$V176:AA176)>$P176,$P176-SUM($V176:AA176),$P176*$U176/12),0)","v":{"v":0,"d":"0.00"}},{"$f":"IF(AND(AC$16*1>=$R176,AC$16*1<=$D$8,$R176<$D$8,$P176>SUM($V176:AB176)),IF(SUM($P176*$U176/12,$V176:AB176)>$P176,$P176-SUM($V176:AB176),$P176*$U176/12),0)","v":{"v":0,"d":"0.00"}},{"$f":"IF(AND(AD$16*1>=$R176,AD$16*1<=$D$8,$R176<$D$8,$P176>SUM($V176:AC176)),IF(SUM($P176*$U176/12,$V176:AC176)>$P176,$P176-SUM($V176:AC176),$P176*$U176/12),0)","v":{"v":0,"d":"0.00"}},{"$f":"IF(AND(AE$16*1>=$R176,AE$16*1<=$D$8,$R176<$D$8,$P176>SUM($V176:AD176)),IF(SUM($P176*$U176/12,$V176:AD176)>$P176,$P176-SUM($V176:AD176),$P176*$U176/12),0)","v":{"v":0,"d":"0.00"}},{"$f":"IF(AND(AF$16*1>=$R176,AF$16*1<=$D$8,$R176<$D$8,$P176>SUM($V176:AE176)),IF(SUM($P176*$U176/12,$V176:AE176)>$P176,$P176-SUM($V176:AE176),$P176*$U176/12),0)","v":{"v":0,"d":"0.00"}},{"$f":"IF(AND(AG$16*1>=$R176,AG$16*1<=$D$8,$R176<$D$8,$P176>SUM($V176:AF176)),IF(SUM($P176*$U176/12,$V176:AF176)>$P176,$P176-SUM($V176:AF176),$P176*$U176/12),0)","v":{"v":0,"d":"0.00"}},{"$f":"IF(AND(AH$16*1>=$R176,AH$16*1<=$D$8,$R176<$D$8,$P176>SUM($V176:AG176)),IF(SUM($P176*$U176/12,$V176:AG176)>$P176,$P176-SUM($V176:AG176),$P176*$U176/12),0)","v":{"v":0,"d":"0.00"}},{"v":7.1604166666666655,"d":"7.16"},null,null,{"v":87.37625,"d":"87.38"},null,{"v":87.37625,"d":"87.38"}]
[null,null,169,"341211","SOFTWARE",{"$nulls":3},2255.44,{"$nulls":4},2255.44,null,{"v":2255.44,"d":"2,255.44"},"2003-01-08","2003-02-01",null,null,{"v":0.25,"d":"25%"},{"v":2255.44,"d":"2,255.44"},{"$f":"IF(AND(W$16*1>=$R177,W$16*1<=$D$8,$R177<$D$8,$P177>SUM($V177:V177)),IF(SUM($P177*$U177/12,$V177:V177)>$P177,$P177-SUM($V177:V177),$P177*$U177/12),0)","v":{"v":0,"d":"0.00"}},{"$f":"IF(AND(X$16*1>=$R177,X$16*1<=$D$8,$R177<$D$8,$P177>SUM($V177:W177)),IF(SUM($P177*$U177/12,$V177:W177)>$P177,$P177-SUM($V177:W177),$P177*$U177/12),0)","v":{"v":0,"d":"0.00"}},{"$f":"IF(AND(Y$16*1>=$R177,Y$16*1<=$D$8,$R177<$D$8,$P177>SUM($V177:X177)),IF(SUM($P177*$U177/12,$V177:X177)>$P177,$P177-SUM($V177:X177),$P177*$U177/12),0)","v":{"v":0,"d":"0.00"}},{"$f":"IF(AND(Z$16*1>=$R177,Z$16*1<=$D$8,$R177<$D$8,$P177>SUM($V177:Y177)),IF(SUM($P177*$U177/12,$V177:Y177)>$P177,$P177-SUM($V177:Y177),$P177*$U177/12),0)","v":{"v":0,"d":"0.00"}},{"$f":"IF(AND(AA$16*1>=$R177,AA$16*1<=$D$8,$R177<$D$8,$P177>SUM($V177:Z177)),IF(SUM($P177*$U177/12,$V177:Z177)>$P177,$P177-SUM($V177:Z177),$P177*$U177/12),0)","v":{"v":0,"d":"0.00"}},{"$f":"IF(AND(AB$16*1>=$R177,AB$16*1<=$D$8,$R177<$D$8,$P177>SUM($V177:AA177)),IF(SUM($P177*$U177/12,$V177:AA177)>$P177,$P177-SUM($V177:AA177),$P177*$U177/12),0)","v":{"v":0,"d":"0.00"}},{"$f":"IF(AND(AC$16*1>=$R177,AC$16*1<=$D$8,$R177<$D$8,$P177>SUM($V177:AB177)),IF(SUM($P177*$U177/12,$V177:AB177)>$P177,$P177-SUM($V177:AB177),$P177*$U177/12),0)","v":{"v":0,"d":"0.00"}},{"$f":"IF(AND(AD$16*1>=$R177,AD$16*1<=$D$8,$R177<$D$8,$P177>SUM($V177:AC177)),IF(SUM($P177*$U177/12,$V177:AC177)>$P177,$P177-SUM($V177:AC177),$P177*$U177/12),0)","v":{"v":0,"d":"0.00"}},{"$f":"IF(AND(AE$16*1>=$R177,AE$16*1<=$D$8,$R177<$D$8,$P177>SUM($V177:AD177)),IF(SUM($P177*$U177/12,$V177:AD177)>$P177,$P177-SUM($V177:AD177),$P177*$U177/12),0)","v":{"v":0,"d":"0.00"}},{"$f":"IF(AND(AF$16*1>=$R177,AF$16*1<=$D$8,$R177<$D$8,$P177>SUM($V177:AE177)),IF(SUM($P177*$U177/12,$V177:AE177)>$P177,$P177-SUM($V177:AE177),$P177*$U177/12),0)","v":{"v":0,"d":"0.00"}},{"$f":"IF(AND(AG$16*1>=$R177,AG$16*1<=$D$8,$R177<$D$8,$P177>SUM($V177:AF177)),IF(SUM($P177*$U177/12,$V177:AF177)>$P177,$P177-SUM($V177:AF177),$P177*$U177/12),0)","v":{"v":0,"d":"0.00"}},{"$f":"IF(AND(AH$16*1>=$R177,AH$16*1<=$D$8,$R177<$D$8,$P177>SUM($V177:AG177)),IF(SUM($P177*$U177/12,$V177:AG177)>$P177,$P177-SUM($V177:AG177),$P177*$U177/12),0)","v":{"v":0,"d":"0.00"}},{"v":0,"d":"0.00"},null,null,{"v":2255.44,"d":"2,255.44"},null,{"v":2255.44,"d":"2,255.44"}]
[null,null,170,"341211","2 VIDEOS BLASTER WEB",{"$nulls":3},1127.43,{"$nulls":4},1127.43,null,{"v":1127.43,"d":"1,127.43"},"2004-01-05","2004-02-01",null,null,{"v":0.25,"d":"25%"},{"v":1127.43,"d":"1,127.43"},{"$f":"IF(AND(W$16*1>=$R178,W$16*1<=$D$8,$R178<$D$8,$P178>SUM($V178:V178)),IF(SUM($P178*$U178/12,$V178:V178)>$P178,$P178-SUM($V178:V178),$P178*$U178/12),0)","v":{"v":0,"d":"0.00"}},{"$f":"IF(AND(X$16*1>=$R178,X$16*1<=$D$8,$R178<$D$8,$P178>SUM($V178:W178)),IF(SUM($P178*$U178/12,$V178:W178)>$P178,$P178-SUM($V178:W178),$P178*$U178/12),0)","v":{"v":0,"d":"0.00"}},{"$f":"IF(AND(Y$16*1>=$R178,Y$16*1<=$D$8,$R178<$D$8,$P178>SUM($V178:X178)),IF(SUM($P178*$U178/12,$V178:X178)>$P178,$P178-SUM($V178:X178),$P178*$U178/12),0)","v":{"v":0,"d":"0.00"}},{"$f":"IF(AND(Z$16*1>=$R178,Z$16*1<=$D$8,$R178<$D$8,$P178>SUM($V178:Y178)),IF(SUM($P178*$U178/12,$V178:Y178)>$P178,$P178-SUM($V178:Y178),$P178*$U178/12),0)","v":{"v":0,"d":"0.00"}},{"$f":"IF(AND(AA$16*1>=$R178,AA$16*1<=$D$8,$R178<$D$8,$P178>SUM($V178:Z178)),IF(SUM($P178*$U178/12,$V178:Z178)>$P178,$P178-SUM($V178:Z178),$P178*$U178/12),0)","v":{"v":0,"d":"0.00"}},{"$f":"IF(AND(AB$16*1>=$R178,AB$16*1<=$D$8,$R178<$D$8,$P178>SUM($V178:AA178)),IF(SUM($P178*$U178/12,$V178:AA178)>$P178,$P178-SUM($V178:AA178),$P178*$U178/12),0)","v":{"v":0,"d":"0.00"}},{"$f":"IF(AND(AC$16*1>=$R178,AC$16*1<=$D$8,$R178<$D$8,$P178>SUM($V178:AB178)),IF(SUM($P178*$U178/12,$V178:AB178)>$P178,$P178-SUM($V178:AB178),$P178*$U178/12),0)","v":{"v":0,"d":"0.00"}},{"$f":"IF(AND(AD$16*1>=$R178,AD$16*1<=$D$8,$R178<$D$8,$P178>SUM($V178:AC178)),IF(SUM($P178*$U178/12,$V178:AC178)>$P178,$P178-SUM($V178:AC178),$P178*$U178/12),0)","v":{"v":0,"d":"0.00"}},{"$f":"IF(AND(AE$16*1>=$R178,AE$16*1<=$D$8,$R178<$D$8,$P178>SUM($V178:AD178)),IF(SUM($P178*$U178/12,$V178:AD178)>$P178,$P178-SUM($V178:AD178),$P178*$U178/12),0)","v":{"v":0,"d":"0.00"}},{"$f":"IF(AND(AF$16*1>=$R178,AF$16*1<=$D$8,$R178<$D$8,$P178>SUM($V178:AE178)),IF(SUM($P178*$U178/12,$V178:AE178)>$P178,$P178-SUM($V178:AE178),$P178*$U178/12),0)","v":{"v":0,"d":"0.00"}},{"$f":"IF(AND(AG$16*1>=$R178,AG$16*1<=$D$8,$R178<$D$8,$P178>SUM($V178:AF178)),IF(SUM($P178*$U178/12,$V178:AF178)>$P178,$P178-SUM($V178:AF178),$P178*$U178/12),0)","v":{"v":0,"d":"0.00"}},{"$f":"IF(AND(AH$16*1>=$R178,AH$16*1<=$D$8,$R178<$D$8,$P178>SUM($V178:AG178)),IF(SUM($P178*$U178/12,$V178:AG178)>$P178,$P178-SUM($V178:AG178),$P178*$U178/12),0)","v":{"v":0,"d":"0.00"}},{"v":0,"d":"0.00"},null,null,{"v":1127.43,"d":"1,127.43"},null,{"v":1127.43,"d":"1,127.43"}]
[null,null,171,"341211","MS OFFICE 97 PROFESIONAL",{"$nulls":3},2253.33,{"$nulls":4},2253.33,null,{"v":2253.33,"d":"2,253.33"},"2004-03-10","2004-04-01",null,null,{"v":0.25,"d":"25%"},{"v":2253.33,"d":"2,253.33"},{"$f":"IF(AND(W$16*1>=$R179,W$16*1<=$D$8,$R179<$D$8,$P179>SUM($V179:V179)),IF(SUM($P179*$U179/12,$V179:V179)>$P179,$P179-SUM($V179:V179),$P179*$U179/12),0)","v":{"v":0,"d":"0.00"}},{"$f":"IF(AND(X$16*1>=$R179,X$16*1<=$D$8,$R179<$D$8,$P179>SUM($V179:W179)),IF(SUM($P179*$U179/12,$V179:W179)>$P179,$P179-SUM($V179:W179),$P179*$U179/12),0)","v":{"v":0,"d":"0.00"}},{"$f":"IF(AND(Y$16*1>=$R179,Y$16*1<=$D$8,$R179<$D$8,$P179>SUM($V179:X179)),IF(SUM($P179*$U179/12,$V179:X179)>$P179,$P179-SUM($V179:X179),$P179*$U179/12),0)","v":{"v":0,"d":"0.00"}},{"$f":"IF(AND(Z$16*1>=$R179,Z$16*1<=$D$8,$R179<$D$8,$P179>SUM($V179:Y179)),IF(SUM($P179*$U179/12,$V179:Y179)>$P179,$P179-SUM($V179:Y179),$P179*$U179/12),0)","v":{"v":0,"d":"0.00"}},{"$f":"IF(AND(AA$16*1>=$R179,AA$16*1<=$D$8,$R179<$D$8,$P179>SUM($V179:Z179)),IF(SUM($P179*$U179/12,$V179:Z179)>$P179,$P179-SUM($V179:Z179),$P179*$U179/12),0)","v":{"v":0,"d":"0.00"}},{"$f":"IF(AND(AB$16*1>=$R179,AB$16*1<=$D$8,$R179<$D$8,$P179>SUM($V179:AA179)),IF(SUM($P179*$U179/12,$V179:AA179)>$P179,$P179-SUM($V179:AA179),$P179*$U179/12),0)","v":{"v":0,"d":"0.00"}},{"$f":"IF(AND(AC$16*1>=$R179,AC$16*1<=$D$8,$R179<$D$8,$P179>SUM($V179:AB179)),IF(SUM($P179*$U179/12,$V179:AB179)>$P179,$P179-SUM($V179:AB179),$P179*$U179/12),0)","v":{"v":0,"d":"0.00"}},{"$f":"IF(AND(AD$16*1>=$R179,AD$16*1<=$D$8,$R179<$D$8,$P179>SUM($V179:AC179)),IF(SUM($P179*$U179/12,$V179:AC179)>$P179,$P179-SUM($V179:AC179),$P179*$U179/12),0)","v":{"v":0,"d":"0.00"}},{"$f":"IF(AND(AE$16*1>=$R179,AE$16*1<=$D$8,$R179<$D$8,$P179>SUM($V179:AD179)),IF(SUM($P179*$U179/12,$V179:AD179)>$P179,$P179-SUM($V179:AD179),$P179*$U179/12),0)","v":{"v":0,"d":"0.00"}},{"$f":"IF(AND(AF$16*1>=$R179,AF$16*1<=$D$8,$R179<$D$8,$P179>SUM($V179:AE179)),IF(SUM($P179*$U179/12,$V179:AE179)>$P179,$P179-SUM($V179:AE179),$P179*$U179/12),0)","v":{"v":0,"d":"0.00"}},{"$f":"IF(AND(AG$16*1>=$R179,AG$16*1<=$D$8,$R179<$D$8,$P179>SUM($V179:AF179)),IF(SUM($P179*$U179/12,$V179:AF179)>$P179,$P179-SUM($V179:AF179),$P179*$U179/12),0)","v":{"v":0,"d":"0.00"}},{"$f":"IF(AND(AH$16*1>=$R179,AH$16*1<=$D$8,$R179<$D$8,$P179>SUM($V179:AG179)),IF(SUM($P179*$U179/12,$V179:AG179)>$P179,$P179-SUM($V179:AG179),$P179*$U179/12),0)","v":{"v":0,"d":"0.00"}},{"v":0,"d":"0.00"},null,null,{"v":2253.33,"d":"2,253.33"},null,{"v":2253.33,"d":"2,253.33"}]
[null,null,172,"341211","5 LICENCIAS MS.OFFICE",{"$nulls":3},6912.12,{"$nulls":4},6912.12,null,{"v":6912.12,"d":"6,912.12"},"2004-03-10","2004-04-01",null,null,{"v":0.25,"d":"25%"},{"v":6912.12,"d":"6,912.12"},{"$f":"IF(AND(W$16*1>=$R180,W$16*1<=$D$8,$R180<$D$8,$P180>SUM($V180:V180)),IF(SUM($P180*$U180/12,$V180:V180)>$P180,$P180-SUM($V180:V180),$P180*$U180/12),0)","v":{"v":0,"d":"0.00"}},{"$f":"IF(AND(X$16*1>=$R180,X$16*1<=$D$8,$R180<$D$8,$P180>SUM($V180:W180)),IF(SUM($P180*$U180/12,$V180:W180)>$P180,$P180-SUM($V180:W180),$P180*$U180/12),0)","v":{"v":0,"d":"0.00"}},{"$f":"IF(AND(Y$16*1>=$R180,Y$16*1<=$D$8,$R180<$D$8,$P180>SUM($V180:X180)),IF(SUM($P180*$U180/12,$V180:X180)>$P180,$P180-SUM($V180:X180),$P180*$U180/12),0)","v":{"v":0,"d":"0.00"}},{"$f":"IF(AND(Z$16*1>=$R180,Z$16*1<=$D$8,$R180<$D$8,$P180>SUM($V180:Y180)),IF(SUM($P180*$U180/12,$V180:Y180)>$P180,$P180-SUM($V180:Y180),$P180*$U180/12),0)","v":{"v":0,"d":"0.00"}},{"$f":"IF(AND(AA$16*1>=$R180,AA$16*1<=$D$8,$R180<$D$8,$P180>SUM($V180:Z180)),IF(SUM($P180*$U180/12,$V180:Z180)>$P180,$P180-SUM($V180:Z180),$P180*$U180/12),0)","v":{"v":0,"d":"0.00"}},{"$f":"IF(AND(AB$16*1>=$R180,AB$16*1<=$D$8,$R180<$D$8,$P180>SUM($V180:AA180)),IF(SUM($P180*$U180/12,$V180:AA180)>$P180,$P180-SUM($V180:AA180),$P180*$U180/12),0)","v":{"v":0,"d":"0.00"}},{"$f":"IF(AND(AC$16*1>=$R180,AC$16*1<=$D$8,$R180<$D$8,$P180>SUM($V180:AB180)),IF(SUM($P180*$U180/12,$V180:AB180)>$P180,$P180-SUM($V180:AB180),$P180*$U180/12),0)","v":{"v":0,"d":"0.00"}},{"$f":"IF(AND(AD$16*1>=$R180,AD$16*1<=$D$8,$R180<$D$8,$P180>SUM($V180:AC180)),IF(SUM($P180*$U180/12,$V180:AC180)>$P180,$P180-SUM($V180:AC180),$P180*$U180/12),0)","v":{"v":0,"d":"0.00"}},{"$f":"IF(AND(AE$16*1>=$R180,AE$16*1<=$D$8,$R180<$D$8,$P180>SUM($V180:AD180)),IF(SUM($P180*$U180/12,$V180:AD180)>$P180,$P180-SUM($V180:AD180),$P180*$U180/12),0)","v":{"v":0,"d":"0.00"}},{"$f":"IF(AND(AF$16*1>=$R180,AF$16*1<=$D$8,$R180<$D$8,$P180>SUM($V180:AE180)),IF(SUM($P180*$U180/12,$V180:AE180)>$P180,$P180-SUM($V180:AE180),$P180*$U180/12),0)","v":{"v":0,"d":"0.00"}},{"$f":"IF(AND(AG$16*1>=$R180,AG$16*1<=$D$8,$R180<$D$8,$P180>SUM($V180:AF180)),IF(SUM($P180*$U180/12,$V180:AF180)>$P180,$P180-SUM($V180:AF180),$P180*$U180/12),0)","v":{"v":0,"d":"0.00"}},{"$f":"IF(AND(AH$16*1>=$R180,AH$16*1<=$D$8,$R180<$D$8,$P180>SUM($V180:AG180)),IF(SUM($P180*$U180/12,$V180:AG180)>$P180,$P180-SUM($V180:AG180),$P180*$U180/12),0)","v":{"v":0,"d":"0.00"}},{"v":0,"d":"0.00"},null,null,{"v":6912.12,"d":"6,912.12"},null,{"v":6912.12,"d":"6,912.12"}]
[null,null,173,"341211","6 LICENCIAS LOTUS NOTES Y DOMINIO",{"$nulls":3},3806.92,{"$nulls":4},3806.92,null,{"v":3806.92,"d":"3,806.92"},"2008-12-22","2009-01-01",null,null,{"v":0.25,"d":"25%"},{"v":3806.92,"d":"3,806.92"},{"$f":"IF(AND(W$16*1>=$R181,W$16*1<=$D$8,$R181<$D$8,$P181>SUM($V181:V181)),IF(SUM($P181*$U181/12,$V181:V181)>$P181,$P181-SUM($V181:V181),$P181*$U181/12),0)","v":{"v":0,"d":"0.00"}},{"$f":"IF(AND(X$16*1>=$R181,X$16*1<=$D$8,$R181<$D$8,$P181>SUM($V181:W181)),IF(SUM($P181*$U181/12,$V181:W181)>$P181,$P181-SUM($V181:W181),$P181*$U181/12),0)","v":{"v":0,"d":"0.00"}},{"$f":"IF(AND(Y$16*1>=$R181,Y$16*1<=$D$8,$R181<$D$8,$P181>SUM($V181:X181)),IF(SUM($P181*$U181/12,$V181:X181)>$P181,$P181-SUM($V181:X181),$P181*$U181/12),0)","v":{"v":0,"d":"0.00"}},{"$f":"IF(AND(Z$16*1>=$R181,Z$16*1<=$D$8,$R181<$D$8,$P181>SUM($V181:Y181)),IF(SUM($P181*$U181/12,$V181:Y181)>$P181,$P181-SUM($V181:Y181),$P181*$U181/12),0)","v":{"v":0,"d":"0.00"}},{"$f":"IF(AND(AA$16*1>=$R181,AA$16*1<=$D$8,$R181<$D$8,$P181>SUM($V181:Z181)),IF(SUM($P181*$U181/12,$V181:Z181)>$P181,$P181-SUM($V181:Z181),$P181*$U181/12),0)","v":{"v":0,"d":"0.00"}},{"$f":"IF(AND(AB$16*1>=$R181,AB$16*1<=$D$8,$R181<$D$8,$P181>SUM($V181:AA181)),IF(SUM($P181*$U181/12,$V181:AA181)>$P181,$P181-SUM($V181:AA181),$P181*$U181/12),0)","v":{"v":0,"d":"0.00"}},{"$f":"IF(AND(AC$16*1>=$R181,AC$16*1<=$D$8,$R181<$D$8,$P181>SUM($V181:AB181)),IF(SUM($P181*$U181/12,$V181:AB181)>$P181,$P181-SUM($V181:AB181),$P181*$U181/12),0)","v":{"v":0,"d":"0.00"}},{"$f":"IF(AND(AD$16*1>=$R181,AD$16*1<=$D$8,$R181<$D$8,$P181>SUM($V181:AC181)),IF(SUM($P181*$U181/12,$V181:AC181)>$P181,$P181-SUM($V181:AC181),$P181*$U181/12),0)","v":{"v":0,"d":"0.00"}},{"$f":"IF(AND(AE$16*1>=$R181,AE$16*1<=$D$8,$R181<$D$8,$P181>SUM($V181:AD181)),IF(SUM($P181*$U181/12,$V181:AD181)>$P181,$P181-SUM($V181:AD181),$P181*$U181/12),0)","v":{"v":0,"d":"0.00"}},{"$f":"IF(AND(AF$16*1>=$R181,AF$16*1<=$D$8,$R181<$D$8,$P181>SUM($V181:AE181)),IF(SUM($P181*$U181/12,$V181:AE181)>$P181,$P181-SUM($V181:AE181),$P181*$U181/12),0)","v":{"v":0,"d":"0.00"}},{"$f":"IF(AND(AG$16*1>=$R181,AG$16*1<=$D$8,$R181<$D$8,$P181>SUM($V181:AF181)),IF(SUM($P181*$U181/12,$V181:AF181)>$P181,$P181-SUM($V181:AF181),$P181*$U181/12),0)","v":{"v":0,"d":"0.00"}},{"$f":"IF(AND(AH$16*1>=$R181,AH$16*1<=$D$8,$R181<$D$8,$P181>SUM($V181:AG181)),IF(SUM($P181*$U181/12,$V181:AG181)>$P181,$P181-SUM($V181:AG181),$P181*$U181/12),0)","v":{"v":0,"d":"0.00"}},{"v":0,"d":"0.00"},null,null,{"v":3806.92,"d":"3,806.92"},null,{"v":3806.92,"d":"3,806.92"}]
[null,null,174,"341211","ACTUALIZAC.SOFTWARE/PROG.OPERLOTUS NOTES Y DOMINIO",{"$nulls":3},22701.96,{"$nulls":4},22701.96,null,{"v":22701.96,"d":"22,701.96"},"2010-12-22","2011-01-01",null,null,{"v":0.25,"d":"25%"},{"v":22701.96,"d":"22,701.96"},{"$f":"IF(AND(W$16*1>=$R182,W$16*1<=$D$8,$R182<$D$8,$P182>SUM($V182:V182)),IF(SUM($P182*$U182/12,$V182:V182)>$P182,$P182-SUM($V182:V182),$P182*$U182/12),0)","v":{"v":0,"d":"0.00"}},{"$f":"IF(AND(X$16*1>=$R182,X$16*1<=$D$8,$R182<$D$8,$P182>SUM($V182:W182)),IF(SUM($P182*$U182/12,$V182:W182)>$P182,$P182-SUM($V182:W182),$P182*$U182/12),0)","v":{"v":0,"d":"0.00"}},{"$f":"IF(AND(Y$16*1>=$R182,Y$16*1<=$D$8,$R182<$D$8,$P182>SUM($V182:X182)),IF(SUM($P182*$U182/12,$V182:X182)>$P182,$P182-SUM($V182:X182),$P182*$U182/12),0)","v":{"v":0,"d":"0.00"}},{"$f":"IF(AND(Z$16*1>=$R182,Z$16*1<=$D$8,$R182<$D$8,$P182>SUM($V182:Y182)),IF(SUM($P182*$U182/12,$V182:Y182)>$P182,$P182-SUM($V182:Y182),$P182*$U182/12),0)","v":{"v":0,"d":"0.00"}},{"$f":"IF(AND(AA$16*1>=$R182,AA$16*1<=$D$8,$R182<$D$8,$P182>SUM($V182:Z182)),IF(SUM($P182*$U182/12,$V182:Z182)>$P182,$P182-SUM($V182:Z182),$P182*$U182/12),0)","v":{"v":0,"d":"0.00"}},{"$f":"IF(AND(AB$16*1>=$R182,AB$16*1<=$D$8,$R182<$D$8,$P182>SUM($V182:AA182)),IF(SUM($P182*$U182/12,$V182:AA182)>$P182,$P182-SUM($V182:AA182),$P182*$U182/12),0)","v":{"v":0,"d":"0.00"}},{"$f":"IF(AND(AC$16*1>=$R182,AC$16*1<=$D$8,$R182<$D$8,$P182>SUM($V182:AB182)),IF(SUM($P182*$U182/12,$V182:AB182)>$P182,$P182-SUM($V182:AB182),$P182*$U182/12),0)","v":{"v":0,"d":"0.00"}},{"$f":"IF(AND(AD$16*1>=$R182,AD$16*1<=$D$8,$R182<$D$8,$P182>SUM($V182:AC182)),IF(SUM($P182*$U182/12,$V182:AC182)>$P182,$P182-SUM($V182:AC182),$P182*$U182/12),0)","v":{"v":0,"d":"0.00"}},{"$f":"IF(AND(AE$16*1>=$R182,AE$16*1<=$D$8,$R182<$D$8,$P182>SUM($V182:AD182)),IF(SUM($P182*$U182/12,$V182:AD182)>$P182,$P182-SUM($V182:AD182),$P182*$U182/12),0)","v":{"v":0,"d":"0.00"}},{"$f":"IF(AND(AF$16*1>=$R182,AF$16*1<=$D$8,$R182<$D$8,$P182>SUM($V182:AE182)),IF(SUM($P182*$U182/12,$V182:AE182)>$P182,$P182-SUM($V182:AE182),$P182*$U182/12),0)","v":{"v":0,"d":"0.00"}},{"$f":"IF(AND(AG$16*1>=$R182,AG$16*1<=$D$8,$R182<$D$8,$P182>SUM($V182:AF182)),IF(SUM($P182*$U182/12,$V182:AF182)>$P182,$P182-SUM($V182:AF182),$P182*$U182/12),0)","v":{"v":0,"d":"0.00"}},{"$f":"IF(AND(AH$16*1>=$R182,AH$16*1<=$D$8,$R182<$D$8,$P182>SUM($V182:AG182)),IF(SUM($P182*$U182/12,$V182:AG182)>$P182,$P182-SUM($V182:AG182),$P182*$U182/12),0)","v":{"v":0,"d":"0.00"}},{"v":0,"d":"0.00"},null,null,{"v":22701.96,"d":"22,701.96"},null,{"v":22701.96,"d":"22,701.96"}]
[null,null,175,"341211","ACTUALIZAC.SOFTWARE/PROG.OPERLOTUS NOTES Y DOMINIO",{"$nulls":3},22881.11,{"$nulls":4},22881.11,null,{"v":22881.11,"d":"22,881.11"},"2011-01-04","2011-02-01",null,null,{"v":0.25,"d":"25%"},{"v":22881.11,"d":"22,881.11"},{"$f":"IF(AND(W$16*1>=$R183,W$16*1<=$D$8,$R183<$D$8,$P183>SUM($V183:V183)),IF(SUM($P183*$U183/12,$V183:V183)>$P183,$P183-SUM($V183:V183),$P183*$U183/12),0)","v":{"v":0,"d":"0.00"}},{"$f":"IF(AND(X$16*1>=$R183,X$16*1<=$D$8,$R183<$D$8,$P183>SUM($V183:W183)),IF(SUM($P183*$U183/12,$V183:W183)>$P183,$P183-SUM($V183:W183),$P183*$U183/12),0)","v":{"v":0,"d":"0.00"}},{"$f":"IF(AND(Y$16*1>=$R183,Y$16*1<=$D$8,$R183<$D$8,$P183>SUM($V183:X183)),IF(SUM($P183*$U183/12,$V183:X183)>$P183,$P183-SUM($V183:X183),$P183*$U183/12),0)","v":{"v":0,"d":"0.00"}},{"$f":"IF(AND(Z$16*1>=$R183,Z$16*1<=$D$8,$R183<$D$8,$P183>SUM($V183:Y183)),IF(SUM($P183*$U183/12,$V183:Y183)>$P183,$P183-SUM($V183:Y183),$P183*$U183/12),0)","v":{"v":0,"d":"0.00"}},{"$f":"IF(AND(AA$16*1>=$R183,AA$16*1<=$D$8,$R183<$D$8,$P183>SUM($V183:Z183)),IF(SUM($P183*$U183/12,$V183:Z183)>$P183,$P183-SUM($V183:Z183),$P183*$U183/12),0)","v":{"v":0,"d":"0.00"}},{"$f":"IF(AND(AB$16*1>=$R183,AB$16*1<=$D$8,$R183<$D$8,$P183>SUM($V183:AA183)),IF(SUM($P183*$U183/12,$V183:AA183)>$P183,$P183-SUM($V183:AA183),$P183*$U183/12),0)","v":{"v":0,"d":"0.00"}},{"$f":"IF(AND(AC$16*1>=$R183,AC$16*1<=$D$8,$R183<$D$8,$P183>SUM($V183:AB183)),IF(SUM($P183*$U183/12,$V183:AB183)>$P183,$P183-SUM($V183:AB183),$P183*$U183/12),0)","v":{"v":0,"d":"0.00"}},{"$f":"IF(AND(AD$16*1>=$R183,AD$16*1<=$D$8,$R183<$D$8,$P183>SUM($V183:AC183)),IF(SUM($P183*$U183/12,$V183:AC183)>$P183,$P183-SUM($V183:AC183),$P183*$U183/12),0)","v":{"v":0,"d":"0.00"}},{"$f":"IF(AND(AE$16*1>=$R183,AE$16*1<=$D$8,$R183<$D$8,$P183>SUM($V183:AD183)),IF(SUM($P183*$U183/12,$V183:AD183)>$P183,$P183-SUM($V183:AD183),$P183*$U183/12),0)","v":{"v":0,"d":"0.00"}},{"$f":"IF(AND(AF$16*1>=$R183,AF$16*1<=$D$8,$R183<$D$8,$P183>SUM($V183:AE183)),IF(SUM($P183*$U183/12,$V183:AE183)>$P183,$P183-SUM($V183:AE183),$P183*$U183/12),0)","v":{"v":0,"d":"0.00"}},{"$f":"IF(AND(AG$16*1>=$R183,AG$16*1<=$D$8,$R183<$D$8,$P183>SUM($V183:AF183)),IF(SUM($P183*$U183/12,$V183:AF183)>$P183,$P183-SUM($V183:AF183),$P183*$U183/12),0)","v":{"v":0,"d":"0.00"}},{"$f":"IF(AND(AH$16*1>=$R183,AH$16*1<=$D$8,$R183<$D$8,$P183>SUM($V183:AG183)),IF(SUM($P183*$U183/12,$V183:AG183)>$P183,$P183-SUM($V183:AG183),$P183*$U183/12),0)","v":{"v":0,"d":"0.00"}},{"v":0,"d":"0.00"},null,null,{"v":22881.11,"d":"22,881.11"},null,{"v":22881.11,"d":"22,881.11"}]
[null,null,176,"341211","ACTUALIZAC.SOFTWARE/PROG.OPERLOTUS NOTES Y DOMINIO",{"$nulls":3},1957.82,{"$nulls":4},1957.82,null,{"v":1957.82,"d":"1,957.82"},"2011-01-09","2011-02-01",null,null,{"v":0.25,"d":"25%"},{"v":1957.82,"d":"1,957.82"},{"$f":"IF(AND(W$16*1>=$R184,W$16*1<=$D$8,$R184<$D$8,$P184>SUM($V184:V184)),IF(SUM($P184*$U184/12,$V184:V184)>$P184,$P184-SUM($V184:V184),$P184*$U184/12),0)","v":{"v":0,"d":"0.00"}},{"$f":"IF(AND(X$16*1>=$R184,X$16*1<=$D$8,$R184<$D$8,$P184>SUM($V184:W184)),IF(SUM($P184*$U184/12,$V184:W184)>$P184,$P184-SUM($V184:W184),$P184*$U184/12),0)","v":{"v":0,"d":"0.00"}},{"$f":"IF(AND(Y$16*1>=$R184,Y$16*1<=$D$8,$R184<$D$8,$P184>SUM($V184:X184)),IF(SUM($P184*$U184/12,$V184:X184)>$P184,$P184-SUM($V184:X184),$P184*$U184/12),0)","v":{"v":0,"d":"0.00"}},{"$f":"IF(AND(Z$16*1>=$R184,Z$16*1<=$D$8,$R184<$D$8,$P184>SUM($V184:Y184)),IF(SUM($P184*$U184/12,$V184:Y184)>$P184,$P184-SUM($V184:Y184),$P184*$U184/12),0)","v":{"v":0,"d":"0.00"}},{"$f":"IF(AND(AA$16*1>=$R184,AA$16*1<=$D$8,$R184<$D$8,$P184>SUM($V184:Z184)),IF(SUM($P184*$U184/12,$V184:Z184)>$P184,$P184-SUM($V184:Z184),$P184*$U184/12),0)","v":{"v":0,"d":"0.00"}},{"$f":"IF(AND(AB$16*1>=$R184,AB$16*1<=$D$8,$R184<$D$8,$P184>SUM($V184:AA184)),IF(SUM($P184*$U184/12,$V184:AA184)>$P184,$P184-SUM($V184:AA184),$P184*$U184/12),0)","v":{"v":0,"d":"0.00"}},{"$f":"IF(AND(AC$16*1>=$R184,AC$16*1<=$D$8,$R184<$D$8,$P184>SUM($V184:AB184)),IF(SUM($P184*$U184/12,$V184:AB184)>$P184,$P184-SUM($V184:AB184),$P184*$U184/12),0)","v":{"v":0,"d":"0.00"}},{"$f":"IF(AND(AD$16*1>=$R184,AD$16*1<=$D$8,$R184<$D$8,$P184>SUM($V184:AC184)),IF(SUM($P184*$U184/12,$V184:AC184)>$P184,$P184-SUM($V184:AC184),$P184*$U184/12),0)","v":{"v":0,"d":"0.00"}},{"$f":"IF(AND(AE$16*1>=$R184,AE$16*1<=$D$8,$R184<$D$8,$P184>SUM($V184:AD184)),IF(SUM($P184*$U184/12,$V184:AD184)>$P184,$P184-SUM($V184:AD184),$P184*$U184/12),0)","v":{"v":0,"d":"0.00"}},{"$f":"IF(AND(AF$16*1>=$R184,AF$16*1<=$D$8,$R184<$D$8,$P184>SUM($V184:AE184)),IF(SUM($P184*$U184/12,$V184:AE184)>$P184,$P184-SUM($V184:AE184),$P184*$U184/12),0)","v":{"v":0,"d":"0.00"}},{"$f":"IF(AND(AG$16*1>=$R184,AG$16*1<=$D$8,$R184<$D$8,$P184>SUM($V184:AF184)),IF(SUM($P184*$U184/12,$V184:AF184)>$P184,$P184-SUM($V184:AF184),$P184*$U184/12),0)","v":{"v":0,"d":"0.00"}},{"$f":"IF(AND(AH$16*1>=$R184,AH$16*1<=$D$8,$R184<$D$8,$P184>SUM($V184:AG184)),IF(SUM($P184*$U184/12,$V184:AG184)>$P184,$P184-SUM($V184:AG184),$P184*$U184/12),0)","v":{"v":0,"d":"0.00"}},{"v":0,"d":"0.00"},null,null,{"v":1957.82,"d":"1,957.82"},null,{"v":1957.82,"d":"1,957.82"}]
[null,null,177,"341211","ACTUALIZAC.DESKTP PRO LIC.",{"$nulls":3},11060.62,{"$nulls":4},11060.62,null,{"v":11060.62,"d":"11,060.62"},"2012-10-06","2012-11-01",null,null,{"v":0.25,"d":"25%"},{"v":11060.62,"d":"11,060.62"},{"$f":"IF(AND(W$16*1>=$R185,W$16*1<=$D$8,$R185<$D$8,$P185>SUM($V185:V185)),IF(SUM($P185*$U185/12,$V185:V185)>$P185,$P185-SUM($V185:V185),$P185*$U185/12),0)","v":{"v":0,"d":"0.00"}},{"$f":"IF(AND(X$16*1>=$R185,X$16*1<=$D$8,$R185<$D$8,$P185>SUM($V185:W185)),IF(SUM($P185*$U185/12,$V185:W185)>$P185,$P185-SUM($V185:W185),$P185*$U185/12),0)","v":{"v":0,"d":"0.00"}},{"$f":"IF(AND(Y$16*1>=$R185,Y$16*1<=$D$8,$R185<$D$8,$P185>SUM($V185:X185)),IF(SUM($P185*$U185/12,$V185:X185)>$P185,$P185-SUM($V185:X185),$P185*$U185/12),0)","v":{"v":0,"d":"0.00"}},{"$f":"IF(AND(Z$16*1>=$R185,Z$16*1<=$D$8,$R185<$D$8,$P185>SUM($V185:Y185)),IF(SUM($P185*$U185/12,$V185:Y185)>$P185,$P185-SUM($V185:Y185),$P185*$U185/12),0)","v":{"v":0,"d":"0.00"}},{"$f":"IF(AND(AA$16*1>=$R185,AA$16*1<=$D$8,$R185<$D$8,$P185>SUM($V185:Z185)),IF(SUM($P185*$U185/12,$V185:Z185)>$P185,$P185-SUM($V185:Z185),$P185*$U185/12),0)","v":{"v":0,"d":"0.00"}},{"$f":"IF(AND(AB$16*1>=$R185,AB$16*1<=$D$8,$R185<$D$8,$P185>SUM($V185:AA185)),IF(SUM($P185*$U185/12,$V185:AA185)>$P185,$P185-SUM($V185:AA185),$P185*$U185/12),0)","v":{"v":0,"d":"0.00"}},{"$f":"IF(AND(AC$16*1>=$R185,AC$16*1<=$D$8,$R185<$D$8,$P185>SUM($V185:AB185)),IF(SUM($P185*$U185/12,$V185:AB185)>$P185,$P185-SUM($V185:AB185),$P185*$U185/12),0)","v":{"v":0,"d":"0.00"}},{"$f":"IF(AND(AD$16*1>=$R185,AD$16*1<=$D$8,$R185<$D$8,$P185>SUM($V185:AC185)),IF(SUM($P185*$U185/12,$V185:AC185)>$P185,$P185-SUM($V185:AC185),$P185*$U185/12),0)","v":{"v":0,"d":"0.00"}},{"$f":"IF(AND(AE$16*1>=$R185,AE$16*1<=$D$8,$R185<$D$8,$P185>SUM($V185:AD185)),IF(SUM($P185*$U185/12,$V185:AD185)>$P185,$P185-SUM($V185:AD185),$P185*$U185/12),0)","v":{"v":0,"d":"0.00"}},{"$f":"IF(AND(AF$16*1>=$R185,AF$16*1<=$D$8,$R185<$D$8,$P185>SUM($V185:AE185)),IF(SUM($P185*$U185/12,$V185:AE185)>$P185,$P185-SUM($V185:AE185),$P185*$U185/12),0)","v":{"v":0,"d":"0.00"}},{"$f":"IF(AND(AG$16*1>=$R185,AG$16*1<=$D$8,$R185<$D$8,$P185>SUM($V185:AF185)),IF(SUM($P185*$U185/12,$V185:AF185)>$P185,$P185-SUM($V185:AF185),$P185*$U185/12),0)","v":{"v":0,"d":"0.00"}},{"$f":"IF(AND(AH$16*1>=$R185,AH$16*1<=$D$8,$R185<$D$8,$P185>SUM($V185:AG185)),IF(SUM($P185*$U185/12,$V185:AG185)>$P185,$P185-SUM($V185:AG185),$P185*$U185/12),0)","v":{"v":0,"d":"0.00"}},{"v":0,"d":"0.00"},null,null,{"v":11060.62,"d":"11,060.62"},null,{"v":11060.62,"d":"11,060.62"}]
[null,null,178,"341211","ACTUALIZ.WINDOWS SERVER STD.LIC.",{"$nulls":3},1638.79,{"$nulls":4},1638.79,null,{"v":1638.79,"d":"1,638.79"},"2012-10-06","2012-11-01",null,null,{"v":0.25,"d":"25%"},{"v":1638.79,"d":"1,638.79"},{"$f":"IF(AND(W$16*1>=$R186,W$16*1<=$D$8,$R186<$D$8,$P186>SUM($V186:V186)),IF(SUM($P186*$U186/12,$V186:V186)>$P186,$P186-SUM($V186:V186),$P186*$U186/12),0)","v":{"v":0,"d":"0.00"}},{"$f":"IF(AND(X$16*1>=$R186,X$16*1<=$D$8,$R186<$D$8,$P186>SUM($V186:W186)),IF(SUM($P186*$U186/12,$V186:W186)>$P186,$P186-SUM($V186:W186),$P186*$U186/12),0)","v":{"v":0,"d":"0.00"}},{"$f":"IF(AND(Y$16*1>=$R186,Y$16*1<=$D$8,$R186<$D$8,$P186>SUM($V186:X186)),IF(SUM($P186*$U186/12,$V186:X186)>$P186,$P186-SUM($V186:X186),$P186*$U186/12),0)","v":{"v":0,"d":"0.00"}},{"$f":"IF(AND(Z$16*1>=$R186,Z$16*1<=$D$8,$R186<$D$8,$P186>SUM($V186:Y186)),IF(SUM($P186*$U186/12,$V186:Y186)>$P186,$P186-SUM($V186:Y186),$P186*$U186/12),0)","v":{"v":0,"d":"0.00"}},{"$f":"IF(AND(AA$16*1>=$R186,AA$16*1<=$D$8,$R186<$D$8,$P186>SUM($V186:Z186)),IF(SUM($P186*$U186/12,$V186:Z186)>$P186,$P186-SUM($V186:Z186),$P186*$U186/12),0)","v":{"v":0,"d":"0.00"}},{"$f":"IF(AND(AB$16*1>=$R186,AB$16*1<=$D$8,$R186<$D$8,$P186>SUM($V186:AA186)),IF(SUM($P186*$U186/12,$V186:AA186)>$P186,$P186-SUM($V186:AA186),$P186*$U186/12),0)","v":{"v":0,"d":"0.00"}},{"$f":"IF(AND(AC$16*1>=$R186,AC$16*1<=$D$8,$R186<$D$8,$P186>SUM($V186:AB186)),IF(SUM($P186*$U186/12,$V186:AB186)>$P186,$P186-SUM($V186:AB186),$P186*$U186/12),0)","v":{"v":0,"d":"0.00"}},{"$f":"IF(AND(AD$16*1>=$R186,AD$16*1<=$D$8,$R186<$D$8,$P186>SUM($V186:AC186)),IF(SUM($P186*$U186/12,$V186:AC186)>$P186,$P186-SUM($V186:AC186),$P186*$U186/12),0)","v":{"v":0,"d":"0.00"}},{"$f":"IF(AND(AE$16*1>=$R186,AE$16*1<=$D$8,$R186<$D$8,$P186>SUM($V186:AD186)),IF(SUM($P186*$U186/12,$V186:AD186)>$P186,$P186-SUM($V186:AD186),$P186*$U186/12),0)","v":{"v":0,"d":"0.00"}},{"$f":"IF(AND(AF$16*1>=$R186,AF$16*1<=$D$8,$R186<$D$8,$P186>SUM($V186:AE186)),IF(SUM($P186*$U186/12,$V186:AE186)>$P186,$P186-SUM($V186:AE186),$P186*$U186/12),0)","v":{"v":0,"d":"0.00"}},{"$f":"IF(AND(AG$16*1>=$R186,AG$16*1<=$D$8,$R186<$D$8,$P186>SUM($V186:AF186)),IF(SUM($P186*$U186/12,$V186:AF186)>$P186,$P186-SUM($V186:AF186),$P186*$U186/12),0)","v":{"v":0,"d":"0.00"}},{"$f":"IF(AND(AH$16*1>=$R186,AH$16*1<=$D$8,$R186<$D$8,$P186>SUM($V186:AG186)),IF(SUM($P186*$U186/12,$V186:AG186)>$P186,$P186-SUM($V186:AG186),$P186*$U186/12),0)","v":{"v":0,"d":"0.00"}},{"v":0,"d":"0.00"},null,null,{"v":1638.79,"d":"1,638.79"},null,{"v":1638.79,"d":"1,638.79"}]
[null,null,179,"341211","LICENCIAS LOTUS NOTES",{"$nulls":3},1635.11,{"$nulls":4},1635.11,null,{"v":1635.11,"d":"1,635.11"},"2013-05-30","2013-06-01",null,null,{"v":0.25,"d":"25%"},{"v":1635.11,"d":"1,635.11"},{"$f":"IF(AND(W$16*1>=$R187,W$16*1<=$D$8,$R187<$D$8,$P187>SUM($V187:V187)),IF(SUM($P187*$U187/12,$V187:V187)>$P187,$P187-SUM($V187:V187),$P187*$U187/12),0)","v":{"v":0,"d":"0.00"}},{"$f":"IF(AND(X$16*1>=$R187,X$16*1<=$D$8,$R187<$D$8,$P187>SUM($V187:W187)),IF(SUM($P187*$U187/12,$V187:W187)>$P187,$P187-SUM($V187:W187),$P187*$U187/12),0)","v":{"v":0,"d":"0.00"}},{"$f":"IF(AND(Y$16*1>=$R187,Y$16*1<=$D$8,$R187<$D$8,$P187>SUM($V187:X187)),IF(SUM($P187*$U187/12,$V187:X187)>$P187,$P187-SUM($V187:X187),$P187*$U187/12),0)","v":{"v":0,"d":"0.00"}},{"$f":"IF(AND(Z$16*1>=$R187,Z$16*1<=$D$8,$R187<$D$8,$P187>SUM($V187:Y187)),IF(SUM($P187*$U187/12,$V187:Y187)>$P187,$P187-SUM($V187:Y187),$P187*$U187/12),0)","v":{"v":0,"d":"0.00"}},{"$f":"IF(AND(AA$16*1>=$R187,AA$16*1<=$D$8,$R187<$D$8,$P187>SUM($V187:Z187)),IF(SUM($P187*$U187/12,$V187:Z187)>$P187,$P187-SUM($V187:Z187),$P187*$U187/12),0)","v":{"v":0,"d":"0.00"}},{"$f":"IF(AND(AB$16*1>=$R187,AB$16*1<=$D$8,$R187<$D$8,$P187>SUM($V187:AA187)),IF(SUM($P187*$U187/12,$V187:AA187)>$P187,$P187-SUM($V187:AA187),$P187*$U187/12),0)","v":{"v":0,"d":"0.00"}},{"$f":"IF(AND(AC$16*1>=$R187,AC$16*1<=$D$8,$R187<$D$8,$P187>SUM($V187:AB187)),IF(SUM($P187*$U187/12,$V187:AB187)>$P187,$P187-SUM($V187:AB187),$P187*$U187/12),0)","v":{"v":0,"d":"0.00"}},{"$f":"IF(AND(AD$16*1>=$R187,AD$16*1<=$D$8,$R187<$D$8,$P187>SUM($V187:AC187)),IF(SUM($P187*$U187/12,$V187:AC187)>$P187,$P187-SUM($V187:AC187),$P187*$U187/12),0)","v":{"v":0,"d":"0.00"}},{"$f":"IF(AND(AE$16*1>=$R187,AE$16*1<=$D$8,$R187<$D$8,$P187>SUM($V187:AD187)),IF(SUM($P187*$U187/12,$V187:AD187)>$P187,$P187-SUM($V187:AD187),$P187*$U187/12),0)","v":{"v":0,"d":"0.00"}},{"$f":"IF(AND(AF$16*1>=$R187,AF$16*1<=$D$8,$R187<$D$8,$P187>SUM($V187:AE187)),IF(SUM($P187*$U187/12,$V187:AE187)>$P187,$P187-SUM($V187:AE187),$P187*$U187/12),0)","v":{"v":0,"d":"0.00"}},{"$f":"IF(AND(AG$16*1>=$R187,AG$16*1<=$D$8,$R187<$D$8,$P187>SUM($V187:AF187)),IF(SUM($P187*$U187/12,$V187:AF187)>$P187,$P187-SUM($V187:AF187),$P187*$U187/12),0)","v":{"v":0,"d":"0.00"}},{"$f":"IF(AND(AH$16*1>=$R187,AH$16*1<=$D$8,$R187<$D$8,$P187>SUM($V187:AG187)),IF(SUM($P187*$U187/12,$V187:AG187)>$P187,$P187-SUM($V187:AG187),$P187*$U187/12),0)","v":{"v":0,"d":"0.00"}},{"v":0,"d":"0.00"},null,null,{"v":1635.11,"d":"1,635.11"},null,{"v":1635.11,"d":"1,635.11"}]
[null,null,180,"341211","SOFTWARE CONTABLE CONCAR",{"$nulls":3},3331.2,{"$nulls":4},3331.2,null,{"v":3331.2,"d":"3,331.20"},"2016-01-20","2016-02-01",null,null,{"v":0.25,"d":"25%"},{"v":2428.99,"d":"2,428.99"},{"$f":"IF(AND(W$16*1>=$R188,W$16*1<=$D$8,$R188<$D$8,$P188>SUM($V188:V188)),IF(SUM($P188*$U188/12,$V188:V188)>$P188,$P188-SUM($V188:V188),$P188*$U188/12),0)","v":{"v":69.39999999999999,"d":"69.40"}},{"$f":"IF(AND(X$16*1>=$R188,X$16*1<=$D$8,$R188<$D$8,$P188>SUM($V188:W188)),IF(SUM($P188*$U188/12,$V188:W188)>$P188,$P188-SUM($V188:W188),$P188*$U188/12),0)","v":{"v":69.39999999999999,"d":"69.40"}},{"$f":"IF(AND(Y$16*1>=$R188,Y$16*1<=$D$8,$R188<$D$8,$P188>SUM($V188:X188)),IF(SUM($P188*$U188/12,$V188:X188)>$P188,$P188-SUM($V188:X188),$P188*$U188/12),0)","v":{"v":69.39999999999999,"d":"69.40"}},{"$f":"IF(AND(Z$16*1>=$R188,Z$16*1<=$D$8,$R188<$D$8,$P188>SUM($V188:Y188)),IF(SUM($P188*$U188/12,$V188:Y188)>$P188,$P188-SUM($V188:Y188),$P188*$U188/12),0)","v":{"v":69.39999999999999,"d":"69.40"}},{"$f":"IF(AND(AA$16*1>=$R188,AA$16*1<=$D$8,$R188<$D$8,$P188>SUM($V188:Z188)),IF(SUM($P188*$U188/12,$V188:Z188)>$P188,$P188-SUM($V188:Z188),$P188*$U188/12),0)","v":{"v":69.39999999999999,"d":"69.40"}},{"$f":"IF(AND(AB$16*1>=$R188,AB$16*1<=$D$8,$R188<$D$8,$P188>SUM($V188:AA188)),IF(SUM($P188*$U188/12,$V188:AA188)>$P188,$P188-SUM($V188:AA188),$P188*$U188/12),0)","v":{"v":0,"d":"0.00"}},{"$f":"IF(AND(AC$16*1>=$R188,AC$16*1<=$D$8,$R188<$D$8,$P188>SUM($V188:AB188)),IF(SUM($P188*$U188/12,$V188:AB188)>$P188,$P188-SUM($V188:AB188),$P188*$U188/12),0)","v":{"v":0,"d":"0.00"}},{"$f":"IF(AND(AD$16*1>=$R188,AD$16*1<=$D$8,$R188<$D$8,$P188>SUM($V188:AC188)),IF(SUM($P188*$U188/12,$V188:AC188)>$P188,$P188-SUM($V188:AC188),$P188*$U188/12),0)","v":{"v":0,"d":"0.00"}},{"$f":"IF(AND(AE$16*1>=$R188,AE$16*1<=$D$8,$R188<$D$8,$P188>SUM($V188:AD188)),IF(SUM($P188*$U188/12,$V188:AD188)>$P188,$P188-SUM($V188:AD188),$P188*$U188/12),0)","v":{"v":0,"d":"0.00"}},{"$f":"IF(AND(AF$16*1>=$R188,AF$16*1<=$D$8,$R188<$D$8,$P188>SUM($V188:AE188)),IF(SUM($P188*$U188/12,$V188:AE188)>$P188,$P188-SUM($V188:AE188),$P188*$U188/12),0)","v":{"v":0,"d":"0.00"}},{"$f":"IF(AND(AG$16*1>=$R188,AG$16*1<=$D$8,$R188<$D$8,$P188>SUM($V188:AF188)),IF(SUM($P188*$U188/12,$V188:AF188)>$P188,$P188-SUM($V188:AF188),$P188*$U188/12),0)","v":{"v":0,"d":"0.00"}},{"$f":"IF(AND(AH$16*1>=$R188,AH$16*1<=$D$8,$R188<$D$8,$P188>SUM($V188:AG188)),IF(SUM($P188*$U188/12,$V188:AG188)>$P188,$P188-SUM($V188:AG188),$P188*$U188/12),0)","v":{"v":0,"d":"0.00"}},{"v":346.99999999999994,"d":"347.00"},null,null,{"v":2637.1899999999996,"d":"2,637.19"},null,{"v":2637.1899999999996,"d":"2,637.19"}]
[null,null,181,"349111","G. REMODELACION",{"$nulls":3},6677.98,{"$nulls":4},6677.98,null,{"v":6677.98,"d":"6,677.98"},"2004-09-29","2004-10-01",null,null,{"v":0.1,"d":"10%"},{"v":6677.98,"d":"6,677.98"},{"$f":"IF(AND(W$16*1>=$R189,W$16*1<=$D$8,$R189<$D$8,$P189>SUM($V189:V189)),IF(SUM($P189*$U189/12,$V189:V189)>$P189,$P189-SUM($V189:V189),$P189*$U189/12),0)","v":{"v":0,"d":"0.00"}},{"$f":"IF(AND(X$16*1>=$R189,X$16*1<=$D$8,$R189<$D$8,$P189>SUM($V189:W189)),IF(SUM($P189*$U189/12,$V189:W189)>$P189,$P189-SUM($V189:W189),$P189*$U189/12),0)","v":{"v":0,"d":"0.00"}},{"$f":"IF(AND(Y$16*1>=$R189,Y$16*1<=$D$8,$R189<$D$8,$P189>SUM($V189:X189)),IF(SUM($P189*$U189/12,$V189:X189)>$P189,$P189-SUM($V189:X189),$P189*$U189/12),0)","v":{"v":0,"d":"0.00"}},{"$f":"IF(AND(Z$16*1>=$R189,Z$16*1<=$D$8,$R189<$D$8,$P189>SUM($V189:Y189)),IF(SUM($P189*$U189/12,$V189:Y189)>$P189,$P189-SUM($V189:Y189),$P189*$U189/12),0)","v":{"v":0,"d":"0.00"}},{"$f":"IF(AND(AA$16*1>=$R189,AA$16*1<=$D$8,$R189<$D$8,$P189>SUM($V189:Z189)),IF(SUM($P189*$U189/12,$V189:Z189)>$P189,$P189-SUM($V189:Z189),$P189*$U189/12),0)","v":{"v":0,"d":"0.00"}},{"$f":"IF(AND(AB$16*1>=$R189,AB$16*1<=$D$8,$R189<$D$8,$P189>SUM($V189:AA189)),IF(SUM($P189*$U189/12,$V189:AA189)>$P189,$P189-SUM($V189:AA189),$P189*$U189/12),0)","v":{"v":0,"d":"0.00"}},{"$f":"IF(AND(AC$16*1>=$R189,AC$16*1<=$D$8,$R189<$D$8,$P189>SUM($V189:AB189)),IF(SUM($P189*$U189/12,$V189:AB189)>$P189,$P189-SUM($V189:AB189),$P189*$U189/12),0)","v":{"v":0,"d":"0.00"}},{"$f":"IF(AND(AD$16*1>=$R189,AD$16*1<=$D$8,$R189<$D$8,$P189>SUM($V189:AC189)),IF(SUM($P189*$U189/12,$V189:AC189)>$P189,$P189-SUM($V189:AC189),$P189*$U189/12),0)","v":{"v":0,"d":"0.00"}},{"$f":"IF(AND(AE$16*1>=$R189,AE$16*1<=$D$8,$R189<$D$8,$P189>SUM($V189:AD189)),IF(SUM($P189*$U189/12,$V189:AD189)>$P189,$P189-SUM($V189:AD189),$P189*$U189/12),0)","v":{"v":0,"d":"0.00"}},{"$f":"IF(AND(AF$16*1>=$R189,AF$16*1<=$D$8,$R189<$D$8,$P189>SUM($V189:AE189)),IF(SUM($P189*$U189/12,$V189:AE189)>$P189,$P189-SUM($V189:AE189),$P189*$U189/12),0)","v":{"v":0,"d":"0.00"}},{"$f":"IF(AND(AG$16*1>=$R189,AG$16*1<=$D$8,$R189<$D$8,$P189>SUM($V189:AF189)),IF(SUM($P189*$U189/12,$V189:AF189)>$P189,$P189-SUM($V189:AF189),$P189*$U189/12),0)","v":{"v":0,"d":"0.00"}},{"$f":"IF(AND(AH$16*1>=$R189,AH$16*1<=$D$8,$R189<$D$8,$P189>SUM($V189:AG189)),IF(SUM($P189*$U189/12,$V189:AG189)>$P189,$P189-SUM($V189:AG189),$P189*$U189/12),0)","v":{"v":0,"d":"0.00"}},{"v":0,"d":"0.00"},null,null,{"v":6677.98,"d":"6,677.98"},null,{"v":6677.98,"d":"6,677.98"}]
[null,null,182,"349111","G. REMODELACION",{"$nulls":3},7962.56,{"$nulls":4},7962.56,null,{"v":7962.56,"d":"7,962.56"},"2004-10-30","2004-11-01",null,null,{"v":0.1,"d":"10%"},{"v":7962.56,"d":"7,962.56"},{"$f":"IF(AND(W$16*1>=$R190,W$16*1<=$D$8,$R190<$D$8,$P190>SUM($V190:V190)),IF(SUM($P190*$U190/12,$V190:V190)>$P190,$P190-SUM($V190:V190),$P190*$U190/12),0)","v":{"v":0,"d":"0.00"}},{"$f":"IF(AND(X$16*1>=$R190,X$16*1<=$D$8,$R190<$D$8,$P190>SUM($V190:W190)),IF(SUM($P190*$U190/12,$V190:W190)>$P190,$P190-SUM($V190:W190),$P190*$U190/12),0)","v":{"v":0,"d":"0.00"}},{"$f":"IF(AND(Y$16*1>=$R190,Y$16*1<=$D$8,$R190<$D$8,$P190>SUM($V190:X190)),IF(SUM($P190*$U190/12,$V190:X190)>$P190,$P190-SUM($V190:X190),$P190*$U190/12),0)","v":{"v":0,"d":"0.00"}},{"$f":"IF(AND(Z$16*1>=$R190,Z$16*1<=$D$8,$R190<$D$8,$P190>SUM($V190:Y190)),IF(SUM($P190*$U190/12,$V190:Y190)>$P190,$P190-SUM($V190:Y190),$P190*$U190/12),0)","v":{"v":0,"d":"0.00"}},{"$f":"IF(AND(AA$16*1>=$R190,AA$16*1<=$D$8,$R190<$D$8,$P190>SUM($V190:Z190)),IF(SUM($P190*$U190/12,$V190:Z190)>$P190,$P190-SUM($V190:Z190),$P190*$U190/12),0)","v":{"v":0,"d":"0.00"}},{"$f":"IF(AND(AB$16*1>=$R190,AB$16*1<=$D$8,$R190<$D$8,$P190>SUM($V190:AA190)),IF(SUM($P190*$U190/12,$V190:AA190)>$P190,$P190-SUM($V190:AA190),$P190*$U190/12),0)","v":{"v":0,"d":"0.00"}},{"$f":"IF(AND(AC$16*1>=$R190,AC$16*1<=$D$8,$R190<$D$8,$P190>SUM($V190:AB190)),IF(SUM($P190*$U190/12,$V190:AB190)>$P190,$P190-SUM($V190:AB190),$P190*$U190/12),0)","v":{"v":0,"d":"0.00"}},{"$f":"IF(AND(AD$16*1>=$R190,AD$16*1<=$D$8,$R190<$D$8,$P190>SUM($V190:AC190)),IF(SUM($P190*$U190/12,$V190:AC190)>$P190,$P190-SUM($V190:AC190),$P190*$U190/12),0)","v":{"v":0,"d":"0.00"}},{"$f":"IF(AND(AE$16*1>=$R190,AE$16*1<=$D$8,$R190<$D$8,$P190>SUM($V190:AD190)),IF(SUM($P190*$U190/12,$V190:AD190)>$P190,$P190-SUM($V190:AD190),$P190*$U190/12),0)","v":{"v":0,"d":"0.00"}},{"$f":"IF(AND(AF$16*1>=$R190,AF$16*1<=$D$8,$R190<$D$8,$P190>SUM($V190:AE190)),IF(SUM($P190*$U190/12,$V190:AE190)>$P190,$P190-SUM($V190:AE190),$P190*$U190/12),0)","v":{"v":0,"d":"0.00"}},{"$f":"IF(AND(AG$16*1>=$R190,AG$16*1<=$D$8,$R190<$D$8,$P190>SUM($V190:AF190)),IF(SUM($P190*$U190/12,$V190:AF190)>$P190,$P190-SUM($V190:AF190),$P190*$U190/12),0)","v":{"v":0,"d":"0.00"}},{"$f":"IF(AND(AH$16*1>=$R190,AH$16*1<=$D$8,$R190<$D$8,$P190>SUM($V190:AG190)),IF(SUM($P190*$U190/12,$V190:AG190)>$P190,$P190-SUM($V190:AG190),$P190*$U190/12),0)","v":{"v":0,"d":"0.00"}},{"v":0,"d":"0.00"},null,null,{"v":7962.56,"d":"7,962.56"},null,{"v":7962.56,"d":"7,962.56"}]
[null,null,183,"349111","G. REMODELACION",{"$nulls":3},29194.46,{"$nulls":4},29194.46,null,{"v":29194.46,"d":"29,194.46"},"2004-11-29","2004-12-01",null,null,{"v":0.1,"d":"10%"},{"v":29194.46,"d":"29,194.46"},{"$f":"IF(AND(W$16*1>=$R191,W$16*1<=$D$8,$R191<$D$8,$P191>SUM($V191:V191)),IF(SUM($P191*$U191/12,$V191:V191)>$P191,$P191-SUM($V191:V191),$P191*$U191/12),0)","v":{"v":0,"d":"0.00"}},{"$f":"IF(AND(X$16*1>=$R191,X$16*1<=$D$8,$R191<$D$8,$P191>SUM($V191:W191)),IF(SUM($P191*$U191/12,$V191:W191)>$P191,$P191-SUM($V191:W191),$P191*$U191/12),0)","v":{"v":0,"d":"0.00"}},{"$f":"IF(AND(Y$16*1>=$R191,Y$16*1<=$D$8,$R191<$D$8,$P191>SUM($V191:X191)),IF(SUM($P191*$U191/12,$V191:X191)>$P191,$P191-SUM($V191:X191),$P191*$U191/12),0)","v":{"v":0,"d":"0.00"}},{"$f":"IF(AND(Z$16*1>=$R191,Z$16*1<=$D$8,$R191<$D$8,$P191>SUM($V191:Y191)),IF(SUM($P191*$U191/12,$V191:Y191)>$P191,$P191-SUM($V191:Y191),$P191*$U191/12),0)","v":{"v":0,"d":"0.00"}},{"$f":"IF(AND(AA$16*1>=$R191,AA$16*1<=$D$8,$R191<$D$8,$P191>SUM($V191:Z191)),IF(SUM($P191*$U191/12,$V191:Z191)>$P191,$P191-SUM($V191:Z191),$P191*$U191/12),0)","v":{"v":0,"d":"0.00"}},{"$f":"IF(AND(AB$16*1>=$R191,AB$16*1<=$D$8,$R191<$D$8,$P191>SUM($V191:AA191)),IF(SUM($P191*$U191/12,$V191:AA191)>$P191,$P191-SUM($V191:AA191),$P191*$U191/12),0)","v":{"v":0,"d":"0.00"}},{"$f":"IF(AND(AC$16*1>=$R191,AC$16*1<=$D$8,$R191<$D$8,$P191>SUM($V191:AB191)),IF(SUM($P191*$U191/12,$V191:AB191)>$P191,$P191-SUM($V191:AB191),$P191*$U191/12),0)","v":{"v":0,"d":"0.00"}},{"$f":"IF(AND(AD$16*1>=$R191,AD$16*1<=$D$8,$R191<$D$8,$P191>SUM($V191:AC191)),IF(SUM($P191*$U191/12,$V191:AC191)>$P191,$P191-SUM($V191:AC191),$P191*$U191/12),0)","v":{"v":0,"d":"0.00"}},{"$f":"IF(AND(AE$16*1>=$R191,AE$16*1<=$D$8,$R191<$D$8,$P191>SUM($V191:AD191)),IF(SUM($P191*$U191/12,$V191:AD191)>$P191,$P191-SUM($V191:AD191),$P191*$U191/12),0)","v":{"v":0,"d":"0.00"}},{"$f":"IF(AND(AF$16*1>=$R191,AF$16*1<=$D$8,$R191<$D$8,$P191>SUM($V191:AE191)),IF(SUM($P191*$U191/12,$V191:AE191)>$P191,$P191-SUM($V191:AE191),$P191*$U191/12),0)","v":{"v":0,"d":"0.00"}},{"$f":"IF(AND(AG$16*1>=$R191,AG$16*1<=$D$8,$R191<$D$8,$P191>SUM($V191:AF191)),IF(SUM($P191*$U191/12,$V191:AF191)>$P191,$P191-SUM($V191:AF191),$P191*$U191/12),0)","v":{"v":0,"d":"0.00"}},{"$f":"IF(AND(AH$16*1>=$R191,AH$16*1<=$D$8,$R191<$D$8,$P191>SUM($V191:AG191)),IF(SUM($P191*$U191/12,$V191:AG191)>$P191,$P191-SUM($V191:AG191),$P191*$U191/12),0)","v":{"v":0,"d":"0.00"}},{"v":0,"d":"0.00"},null,null,{"v":29194.46,"d":"29,194.46"},null,{"v":29194.46,"d":"29,194.46"}]
[null,null,184,"349111","G. REMODELACION",{"$nulls":3},4745.11,{"$nulls":4},4745.11,null,{"v":4745.11,"d":"4,745.11"},"2003-12-31","2004-01-01",null,null,{"v":0.1,"d":"10%"},{"v":4745.11,"d":"4,745.11"},{"$f":"IF(AND(W$16*1>=$R192,W$16*1<=$D$8,$R192<$D$8,$P192>SUM($V192:V192)),IF(SUM($P192*$U192/12,$V192:V192)>$P192,$P192-SUM($V192:V192),$P192*$U192/12),0)","v":{"v":0,"d":"0.00"}},{"$f":"IF(AND(X$16*1>=$R192,X$16*1<=$D$8,$R192<$D$8,$P192>SUM($V192:W192)),IF(SUM($P192*$U192/12,$V192:W192)>$P192,$P192-SUM($V192:W192),$P192*$U192/12),0)","v":{"v":0,"d":"0.00"}},{"$f":"IF(AND(Y$16*1>=$R192,Y$16*1<=$D$8,$R192<$D$8,$P192>SUM($V192:X192)),IF(SUM($P192*$U192/12,$V192:X192)>$P192,$P192-SUM($V192:X192),$P192*$U192/12),0)","v":{"v":0,"d":"0.00"}},{"$f":"IF(AND(Z$16*1>=$R192,Z$16*1<=$D$8,$R192<$D$8,$P192>SUM($V192:Y192)),IF(SUM($P192*$U192/12,$V192:Y192)>$P192,$P192-SUM($V192:Y192),$P192*$U192/12),0)","v":{"v":0,"d":"0.00"}},{"$f":"IF(AND(AA$16*1>=$R192,AA$16*1<=$D$8,$R192<$D$8,$P192>SUM($V192:Z192)),IF(SUM($P192*$U192/12,$V192:Z192)>$P192,$P192-SUM($V192:Z192),$P192*$U192/12),0)","v":{"v":0,"d":"0.00"}},{"$f":"IF(AND(AB$16*1>=$R192,AB$16*1<=$D$8,$R192<$D$8,$P192>SUM($V192:AA192)),IF(SUM($P192*$U192/12,$V192:AA192)>$P192,$P192-SUM($V192:AA192),$P192*$U192/12),0)","v":{"v":0,"d":"0.00"}},{"$f":"IF(AND(AC$16*1>=$R192,AC$16*1<=$D$8,$R192<$D$8,$P192>SUM($V192:AB192)),IF(SUM($P192*$U192/12,$V192:AB192)>$P192,$P192-SUM($V192:AB192),$P192*$U192/12),0)","v":{"v":0,"d":"0.00"}},{"$f":"IF(AND(AD$16*1>=$R192,AD$16*1<=$D$8,$R192<$D$8,$P192>SUM($V192:AC192)),IF(SUM($P192*$U192/12,$V192:AC192)>$P192,$P192-SUM($V192:AC192),$P192*$U192/12),0)","v":{"v":0,"d":"0.00"}},{"$f":"IF(AND(AE$16*1>=$R192,AE$16*1<=$D$8,$R192<$D$8,$P192>SUM($V192:AD192)),IF(SUM($P192*$U192/12,$V192:AD192)>$P192,$P192-SUM($V192:AD192),$P192*$U192/12),0)","v":{"v":0,"d":"0.00"}},{"$f":"IF(AND(AF$16*1>=$R192,AF$16*1<=$D$8,$R192<$D$8,$P192>SUM($V192:AE192)),IF(SUM($P192*$U192/12,$V192:AE192)>$P192,$P192-SUM($V192:AE192),$P192*$U192/12),0)","v":{"v":0,"d":"0.00"}},{"$f":"IF(AND(AG$16*1>=$R192,AG$16*1<=$D$8,$R192<$D$8,$P192>SUM($V192:AF192)),IF(SUM($P192*$U192/12,$V192:AF192)>$P192,$P192-SUM($V192:AF192),$P192*$U192/12),0)","v":{"v":0,"d":"0.00"}},{"$f":"IF(AND(AH$16*1>=$R192,AH$16*1<=$D$8,$R192<$D$8,$P192>SUM($V192:AG192)),IF(SUM($P192*$U192/12,$V192:AG192)>$P192,$P192-SUM($V192:AG192),$P192*$U192/12),0)","v":{"v":0,"d":"0.00"}},{"v":0,"d":"0.00"},null,null,{"v":4745.11,"d":"4,745.11"},null,{"v":4745.11,"d":"4,745.11"}]
[null,null,185,"335111","ESCRITORIO RECEPCION",{"$nulls":4},593.14,{"$nulls":3},593.14,null,593.14,"2019-01-13","2019-02-01",null,null,{"v":0.1,"d":"10%"},null,{"$f":"IF(AND(W$16*1>=$R193,W$16*1<=$D$8,$R193<$D$8,$P193>SUM($V193:V193)),IF(SUM($P193*$U193/12,$V193:V193)>$P193,$P193-SUM($V193:V193),$P193*$U193/12),0)","v":{"v":4.942833333333334,"d":"4.94"}},{"$f":"IF(AND(X$16*1>=$R193,X$16*1<=$D$8,$R193<$D$8,$P193>SUM($V193:W193)),IF(SUM($P193*$U193/12,$V193:W193)>$P193,$P193-SUM($V193:W193),$P193*$U193/12),0)","v":{"v":4.942833333333334,"d":"4.94"}},{"$f":"IF(AND(Y$16*1>=$R193,Y$16*1<=$D$8,$R193<$D$8,$P193>SUM($V193:X193)),IF(SUM($P193*$U193/12,$V193:X193)>$P193,$P193-SUM($V193:X193),$P193*$U193/12),0)","v":{"v":4.942833333333334,"d":"4.94"}},{"$f":"IF(AND(Z$16*1>=$R193,Z$16*1<=$D$8,$R193<$D$8,$P193>SUM($V193:Y193)),IF(SUM($P193*$U193/12,$V193:Y193)>$P193,$P193-SUM($V193:Y193),$P193*$U193/12),0)","v":{"v":4.942833333333334,"d":"4.94"}},{"$f":"IF(AND(AA$16*1>=$R193,AA$16*1<=$D$8,$R193<$D$8,$P193>SUM($V193:Z193)),IF(SUM($P193*$U193/12,$V193:Z193)>$P193,$P193-SUM($V193:Z193),$P193*$U193/12),0)","v":{"v":4.942833333333334,"d":"4.94"}},{"$f":"IF(AND(AB$16*1>=$R193,AB$16*1<=$D$8,$R193<$D$8,$P193>SUM($V193:AA193)),IF(SUM($P193*$U193/12,$V193:AA193)>$P193,$P193-SUM($V193:AA193),$P193*$U193/12),0)","v":{"v":0,"d":"0.00"}},{"$f":"IF(AND(AC$16*1>=$R193,AC$16*1<=$D$8,$R193<$D$8,$P193>SUM($V193:AB193)),IF(SUM($P193*$U193/12,$V193:AB193)>$P193,$P193-SUM($V193:AB193),$P193*$U193/12),0)","v":{"v":0,"d":"0.00"}},{"$f":"IF(AND(AD$16*1>=$R193,AD$16*1<=$D$8,$R193<$D$8,$P193>SUM($V193:AC193)),IF(SUM($P193*$U193/12,$V193:AC193)>$P193,$P193-SUM($V193:AC193),$P193*$U193/12),0)","v":{"v":0,"d":"0.00"}},{"$f":"IF(AND(AE$16*1>=$R193,AE$16*1<=$D$8,$R193<$D$8,$P193>SUM($V193:AD193)),IF(SUM($P193*$U193/12,$V193:AD193)>$P193,$P193-SUM($V193:AD193),$P193*$U193/12),0)","v":{"v":0,"d":"0.00"}},{"$f":"IF(AND(AF$16*1>=$R193,AF$16*1<=$D$8,$R193<$D$8,$P193>SUM($V193:AE193)),IF(SUM($P193*$U193/12,$V193:AE193)>$P193,$P193-SUM($V193:AE193),$P193*$U193/12),0)","v":{"v":0,"d":"0.00"}},{"$f":"IF(AND(AG$16*1>=$R193,AG$16*1<=$D$8,$R193<$D$8,$P193>SUM($V193:AF193)),IF(SUM($P193*$U193/12,$V193:AF193)>$P193,$P193-SUM($V193:AF193),$P193*$U193/12),0)","v":{"v":0,"d":"0.00"}},{"$f":"IF(AND(AH$16*1>=$R193,AH$16*1<=$D$8,$R193<$D$8,$P193>SUM($V193:AG193)),IF(SUM($P193*$U193/12,$V193:AG193)>$P193,$P193-SUM($V193:AG193),$P193*$U193/12),0)","v":{"v":0,"d":"0.00"}},{"v":24.714166666666667,"d":"24.71"},null,null,{"v":14.828500000000002,"d":"14.83"},null,{"v":14.828500000000002,"d":"14.83"}]
[null,null,186,"335111","ESCRITORIO PATENTES",{"$nulls":4},593.13,{"$nulls":3},593.13,null,593.13,"2019-01-13","2019-02-01",null,null,{"v":0.1,"d":"10%"},null,{"$f":"IF(AND(W$16*1>=$R194,W$16*1<=$D$8,$R194<$D$8,$P194>SUM($V194:V194)),IF(SUM($P194*$U194/12,$V194:V194)>$P194,$P194-SUM($V194:V194),$P194*$U194/12),0)","v":{"v":4.94275,"d":"4.94"}},{"$f":"IF(AND(X$16*1>=$R194,X$16*1<=$D$8,$R194<$D$8,$P194>SUM($V194:W194)),IF(SUM($P194*$U194/12,$V194:W194)>$P194,$P194-SUM($V194:W194),$P194*$U194/12),0)","v":{"v":4.94275,"d":"4.94"}},{"$f":"IF(AND(Y$16*1>=$R194,Y$16*1<=$D$8,$R194<$D$8,$P194>SUM($V194:X194)),IF(SUM($P194*$U194/12,$V194:X194)>$P194,$P194-SUM($V194:X194),$P194*$U194/12),0)","v":{"v":4.94275,"d":"4.94"}},{"$f":"IF(AND(Z$16*1>=$R194,Z$16*1<=$D$8,$R194<$D$8,$P194>SUM($V194:Y194)),IF(SUM($P194*$U194/12,$V194:Y194)>$P194,$P194-SUM($V194:Y194),$P194*$U194/12),0)","v":{"v":4.94275,"d":"4.94"}},{"$f":"IF(AND(AA$16*1>=$R194,AA$16*1<=$D$8,$R194<$D$8,$P194>SUM($V194:Z194)),IF(SUM($P194*$U194/12,$V194:Z194)>$P194,$P194-SUM($V194:Z194),$P194*$U194/12),0)","v":{"v":4.94275,"d":"4.94"}},{"$f":"IF(AND(AB$16*1>=$R194,AB$16*1<=$D$8,$R194<$D$8,$P194>SUM($V194:AA194)),IF(SUM($P194*$U194/12,$V194:AA194)>$P194,$P194-SUM($V194:AA194),$P194*$U194/12),0)","v":{"v":0,"d":"0.00"}},{"$f":"IF(AND(AC$16*1>=$R194,AC$16*1<=$D$8,$R194<$D$8,$P194>SUM($V194:AB194)),IF(SUM($P194*$U194/12,$V194:AB194)>$P194,$P194-SUM($V194:AB194),$P194*$U194/12),0)","v":{"v":0,"d":"0.00"}},{"$f":"IF(AND(AD$16*1>=$R194,AD$16*1<=$D$8,$R194<$D$8,$P194>SUM($V194:AC194)),IF(SUM($P194*$U194/12,$V194:AC194)>$P194,$P194-SUM($V194:AC194),$P194*$U194/12),0)","v":{"v":0,"d":"0.00"}},{"$f":"IF(AND(AE$16*1>=$R194,AE$16*1<=$D$8,$R194<$D$8,$P194>SUM($V194:AD194)),IF(SUM($P194*$U194/12,$V194:AD194)>$P194,$P194-SUM($V194:AD194),$P194*$U194/12),0)","v":{"v":0,"d":"0.00"}},{"$f":"IF(AND(AF$16*1>=$R194,AF$16*1<=$D$8,$R194<$D$8,$P194>SUM($V194:AE194)),IF(SUM($P194*$U194/12,$V194:AE194)>$P194,$P194-SUM($V194:AE194),$P194*$U194/12),0)","v":{"v":0,"d":"0.00"}},{"$f":"IF(AND(AG$16*1>=$R194,AG$16*1<=$D$8,$R194<$D$8,$P194>SUM($V194:AF194)),IF(SUM($P194*$U194/12,$V194:AF194)>$P194,$P194-SUM($V194:AF194),$P194*$U194/12),0)","v":{"v":0,"d":"0.00"}},{"$f":"IF(AND(AH$16*1>=$R194,AH$16*1<=$D$8,$R194<$D$8,$P194>SUM($V194:AG194)),IF(SUM($P194*$U194/12,$V194:AG194)>$P194,$P194-SUM($V194:AG194),$P194*$U194/12),0)","v":{"v":0,"d":"0.00"}},{"v":24.71375,"d":"24.71"},null,null,{"v":14.82825,"d":"14.83"},null,{"v":14.82825,"d":"14.83"}]
[null,null,187,"336111","IMPRESORA XEROX (RECEPCION)",{"$nulls":4},647.8,{"$nulls":3},647.8,null,{"v":647.8,"d":"647.80"},"2019-01-19","2019-02-01",null,null,{"v":0.25,"d":"25%"},null,{"$f":"IF(AND(W$16*1>=$R195,W$16*1<=$D$8,$R195<$D$8,$P195>SUM($V195:V195)),IF(SUM($P195*$U195/12,$V195:V195)>$P195,$P195-SUM($V195:V195),$P195*$U195/12),0)","v":{"v":13.495833333333332,"d":"13.50"}},{"$f":"IF(AND(X$16*1>=$R195,X$16*1<=$D$8,$R195<$D$8,$P195>SUM($V195:W195)),IF(SUM($P195*$U195/12,$V195:W195)>$P195,$P195-SUM($V195:W195),$P195*$U195/12),0)","v":{"v":13.495833333333332,"d":"13.50"}},{"$f":"IF(AND(Y$16*1>=$R195,Y$16*1<=$D$8,$R195<$D$8,$P195>SUM($V195:X195)),IF(SUM($P195*$U195/12,$V195:X195)>$P195,$P195-SUM($V195:X195),$P195*$U195/12),0)","v":{"v":13.495833333333332,"d":"13.50"}},{"$f":"IF(AND(Z$16*1>=$R195,Z$16*1<=$D$8,$R195<$D$8,$P195>SUM($V195:Y195)),IF(SUM($P195*$U195/12,$V195:Y195)>$P195,$P195-SUM($V195:Y195),$P195*$U195/12),0)","v":{"v":13.495833333333332,"d":"13.50"}},{"$f":"IF(AND(AA$16*1>=$R195,AA$16*1<=$D$8,$R195<$D$8,$P195>SUM($V195:Z195)),IF(SUM($P195*$U195/12,$V195:Z195)>$P195,$P195-SUM($V195:Z195),$P195*$U195/12),0)","v":{"v":13.495833333333332,"d":"13.50"}},{"$f":"IF(AND(AB$16*1>=$R195,AB$16*1<=$D$8,$R195<$D$8,$P195>SUM($V195:AA195)),IF(SUM($P195*$U195/12,$V195:AA195)>$P195,$P195-SUM($V195:AA195),$P195*$U195/12),0)","v":{"v":0,"d":"0.00"}},{"$f":"IF(AND(AC$16*1>=$R195,AC$16*1<=$D$8,$R195<$D$8,$P195>SUM($V195:AB195)),IF(SUM($P195*$U195/12,$V195:AB195)>$P195,$P195-SUM($V195:AB195),$P195*$U195/12),0)","v":{"v":0,"d":"0.00"}},{"$f":"IF(AND(AD$16*1>=$R195,AD$16*1<=$D$8,$R195<$D$8,$P195>SUM($V195:AC195)),IF(SUM($P195*$U195/12,$V195:AC195)>$P195,$P195-SUM($V195:AC195),$P195*$U195/12),0)","v":{"v":0,"d":"0.00"}},{"$f":"IF(AND(AE$16*1>=$R195,AE$16*1<=$D$8,$R195<$D$8,$P195>SUM($V195:AD195)),IF(SUM($P195*$U195/12,$V195:AD195)>$P195,$P195-SUM($V195:AD195),$P195*$U195/12),0)","v":{"v":0,"d":"0.00"}},{"$f":"IF(AND(AF$16*1>=$R195,AF$16*1<=$D$8,$R195<$D$8,$P195>SUM($V195:AE195)),IF(SUM($P195*$U195/12,$V195:AE195)>$P195,$P195-SUM($V195:AE195),$P195*$U195/12),0)","v":{"v":0,"d":"0.00"}},{"$f":"IF(AND(AG$16*1>=$R195,AG$16*1<=$D$8,$R195<$D$8,$P195>SUM($V195:AF195)),IF(SUM($P195*$U195/12,$V195:AF195)>$P195,$P195-SUM($V195:AF195),$P195*$U195/12),0)","v":{"v":0,"d":"0.00"}},{"$f":"IF(AND(AH$16*1>=$R195,AH$16*1<=$D$8,$R195<$D$8,$P195>SUM($V195:AG195)),IF(SUM($P195*$U195/12,$V195:AG195)>$P195,$P195-SUM($V195:AG195),$P195*$U195/12),0)","v":{"v":0,"d":"0.00"}},{"v":67.47916666666666,"d":"67.48"},null,null,{"v":40.4875,"d":"40.49"},null,{"v":40.4875,"d":"40.49"}]
[null,null,188,"336111","IMPRESORA HP LASER JET",{"$nulls":4},989.49,{"$nulls":3},989.49,null,989.49,"2019-01-19","2019-02-01",null,null,{"v":0.25,"d":"25%"},null,{"$f":"IF(AND(W$16*1>=$R196,W$16*1<=$D$8,$R196<$D$8,$P196>SUM($V196:V196)),IF(SUM($P196*$U196/12,$V196:V196)>$P196,$P196-SUM($V196:V196),$P196*$U196/12),0)","v":{"v":20.614375,"d":"20.61"}},{"$f":"IF(AND(X$16*1>=$R196,X$16*1<=$D$8,$R196<$D$8,$P196>SUM($V196:W196)),IF(SUM($P196*$U196/12,$V196:W196)>$P196,$P196-SUM($V196:W196),$P196*$U196/12),0)","v":{"v":20.614375,"d":"20.61"}},{"$f":"IF(AND(Y$16*1>=$R196,Y$16*1<=$D$8,$R196<$D$8,$P196>SUM($V196:X196)),IF(SUM($P196*$U196/12,$V196:X196)>$P196,$P196-SUM($V196:X196),$P196*$U196/12),0)","v":{"v":20.614375,"d":"20.61"}},{"$f":"IF(AND(Z$16*1>=$R196,Z$16*1<=$D$8,$R196<$D$8,$P196>SUM($V196:Y196)),IF(SUM($P196*$U196/12,$V196:Y196)>$P196,$P196-SUM($V196:Y196),$P196*$U196/12),0)","v":{"v":20.614375,"d":"20.61"}},{"$f":"IF(AND(AA$16*1>=$R196,AA$16*1<=$D$8,$R196<$D$8,$P196>SUM($V196:Z196)),IF(SUM($P196*$U196/12,$V196:Z196)>$P196,$P196-SUM($V196:Z196),$P196*$U196/12),0)","v":{"v":20.614375,"d":"20.61"}},{"$f":"IF(AND(AB$16*1>=$R196,AB$16*1<=$D$8,$R196<$D$8,$P196>SUM($V196:AA196)),IF(SUM($P196*$U196/12,$V196:AA196)>$P196,$P196-SUM($V196:AA196),$P196*$U196/12),0)","v":{"v":0,"d":"0.00"}},{"$f":"IF(AND(AC$16*1>=$R196,AC$16*1<=$D$8,$R196<$D$8,$P196>SUM($V196:AB196)),IF(SUM($P196*$U196/12,$V196:AB196)>$P196,$P196-SUM($V196:AB196),$P196*$U196/12),0)","v":{"v":0,"d":"0.00"}},{"$f":"IF(AND(AD$16*1>=$R196,AD$16*1<=$D$8,$R196<$D$8,$P196>SUM($V196:AC196)),IF(SUM($P196*$U196/12,$V196:AC196)>$P196,$P196-SUM($V196:AC196),$P196*$U196/12),0)","v":{"v":0,"d":"0.00"}},{"$f":"IF(AND(AE$16*1>=$R196,AE$16*1<=$D$8,$R196<$D$8,$P196>SUM($V196:AD196)),IF(SUM($P196*$U196/12,$V196:AD196)>$P196,$P196-SUM($V196:AD196),$P196*$U196/12),0)","v":{"v":0,"d":"0.00"}},{"$f":"IF(AND(AF$16*1>=$R196,AF$16*1<=$D$8,$R196<$D$8,$P196>SUM($V196:AE196)),IF(SUM($P196*$U196/12,$V196:AE196)>$P196,$P196-SUM($V196:AE196),$P196*$U196/12),0)","v":{"v":0,"d":"0.00"}},{"$f":"IF(AND(AG$16*1>=$R196,AG$16*1<=$D$8,$R196<$D$8,$P196>SUM($V196:AF196)),IF(SUM($P196*$U196/12,$V196:AF196)>$P196,$P196-SUM($V196:AF196),$P196*$U196/12),0)","v":{"v":0,"d":"0.00"}},{"$f":"IF(AND(AH$16*1>=$R196,AH$16*1<=$D$8,$R196<$D$8,$P196>SUM($V196:AG196)),IF(SUM($P196*$U196/12,$V196:AG196)>$P196,$P196-SUM($V196:AG196),$P196*$U196/12),0)","v":{"v":0,"d":"0.00"}},{"v":103.07187499999999,"d":"103.07"},null,null,{"v":61.843125,"d":"61.84"},null,{"v":61.843125,"d":"61.84"}]
[null,null,189,"336111","EQUIPOS INTEL COREL Y MONITORE",{"$nulls":4},5143.22,{"$nulls":3},5143.22,null,{"v":5143.22,"d":"5,143.22"},"2019-02-13","2019-03-01",null,null,{"v":0.25,"d":"25%"},null,{"$f":"IF(AND(W$16*1>=$R197,W$16*1<=$D$8,$R197<$D$8,$P197>SUM($V197:V197)),IF(SUM($P197*$U197/12,$V197:V197)>$P197,$P197-SUM($V197:V197),$P197*$U197/12),0)","v":{"v":107.15041666666667,"d":"107.15"}},{"$f":"IF(AND(X$16*1>=$R197,X$16*1<=$D$8,$R197<$D$8,$P197>SUM($V197:W197)),IF(SUM($P197*$U197/12,$V197:W197)>$P197,$P197-SUM($V197:W197),$P197*$U197/12),0)","v":{"v":107.15041666666667,"d":"107.15"}},{"$f":"IF(AND(Y$16*1>=$R197,Y$16*1<=$D$8,$R197<$D$8,$P197>SUM($V197:X197)),IF(SUM($P197*$U197/12,$V197:X197)>$P197,$P197-SUM($V197:X197),$P197*$U197/12),0)","v":{"v":107.15041666666667,"d":"107.15"}},{"$f":"IF(AND(Z$16*1>=$R197,Z$16*1<=$D$8,$R197<$D$8,$P197>SUM($V197:Y197)),IF(SUM($P197*$U197/12,$V197:Y197)>$P197,$P197-SUM($V197:Y197),$P197*$U197/12),0)","v":{"v":107.15041666666667,"d":"107.15"}},{"$f":"IF(AND(AA$16*1>=$R197,AA$16*1<=$D$8,$R197<$D$8,$P197>SUM($V197:Z197)),IF(SUM($P197*$U197/12,$V197:Z197)>$P197,$P197-SUM($V197:Z197),$P197*$U197/12),0)","v":{"v":107.15041666666667,"d":"107.15"}},{"$f":"IF(AND(AB$16*1>=$R197,AB$16*1<=$D$8,$R197<$D$8,$P197>SUM($V197:AA197)),IF(SUM($P197*$U197/12,$V197:AA197)>$P197,$P197-SUM($V197:AA197),$P197*$U197/12),0)","v":{"v":0,"d":"0.00"}},{"$f":"IF(AND(AC$16*1>=$R197,AC$16*1<=$D$8,$R197<$D$8,$P197>SUM($V197:AB197)),IF(SUM($P197*$U197/12,$V197:AB197)>$P197,$P197-SUM($V197:AB197),$P197*$U197/12),0)","v":{"v":0,"d":"0.00"}},{"$f":"IF(AND(AD$16*1>=$R197,AD$16*1<=$D$8,$R197<$D$8,$P197>SUM($V197:AC197)),IF(SUM($P197*$U197/12,$V197:AC197)>$P197,$P197-SUM($V197:AC197),$P197*$U197/12),0)","v":{"v":0,"d":"0.00"}},{"$f":"IF(AND(AE$16*1>=$R197,AE$16*1<=$D$8,$R197<$D$8,$P197>SUM($V197:AD197)),IF(SUM($P197*$U197/12,$V197:AD197)>$P197,$P197-SUM($V197:AD197),$P197*$U197/12),0)","v":{"v":0,"d":"0.00"}},{"$f":"IF(AND(AF$16*1>=$R197,AF$16*1<=$D$8,$R197<$D$8,$P197>SUM($V197:AE197)),IF(SUM($P197*$U197/12,$V197:AE197)>$P197,$P197-SUM($V197:AE197),$P197*$U197/12),0)","v":{"v":0,"d":"0.00"}},{"$f":"IF(AND(AG$16*1>=$R197,AG$16*1<=$D$8,$R197<$D$8,$P197>SUM($V197:AF197)),IF(SUM($P197*$U197/12,$V197:AF197)>$P197,$P197-SUM($V197:AF197),$P197*$U197/12),0)","v":{"v":0,"d":"0.00"}},{"$f":"IF(AND(AH$16*1>=$R197,AH$16*1<=$D$8,$R197<$D$8,$P197>SUM($V197:AG197)),IF(SUM($P197*$U197/12,$V197:AG197)>$P197,$P197-SUM($V197:AG197),$P197*$U197/12),0)","v":{"v":0,"d":"0.00"}},{"v":535.7520833333333,"d":"535.75"},null,null,{"v":321.45125,"d":"321.45"},null,{"v":321.45125,"d":"321.45"}]
[null,null,190,"336111","COMPUT.INTEL,MONITOR 18.5\"LG",{"$nulls":4},1714.41,{"$nulls":3},1714.41,null,{"v":1714.41,"d":"1,714.41"},"2019-03-10","2019-04-01",null,null,{"v":0.25,"d":"25%"},null,{"$f":"IF(AND(W$16*1>=$R198,W$16*1<=$D$8,$R198<$D$8,$P198>SUM($V198:V198)),IF(SUM($P198*$U198/12,$V198:V198)>$P198,$P198-SUM($V198:V198),$P198*$U198/12),0)","v":{"v":35.716875,"d":"35.72"}},{"$f":"IF(AND(X$16*1>=$R198,X$16*1<=$D$8,$R198<$D$8,$P198>SUM($V198:W198)),IF(SUM($P198*$U198/12,$V198:W198)>$P198,$P198-SUM($V198:W198),$P198*$U198/12),0)","v":{"v":35.716875,"d":"35.72"}},{"$f":"IF(AND(Y$16*1>=$R198,Y$16*1<=$D$8,$R198<$D$8,$P198>SUM($V198:X198)),IF(SUM($P198*$U198/12,$V198:X198)>$P198,$P198-SUM($V198:X198),$P198*$U198/12),0)","v":{"v":35.716875,"d":"35.72"}},{"$f":"IF(AND(Z$16*1>=$R198,Z$16*1<=$D$8,$R198<$D$8,$P198>SUM($V198:Y198)),IF(SUM($P198*$U198/12,$V198:Y198)>$P198,$P198-SUM($V198:Y198),$P198*$U198/12),0)","v":{"v":35.716875,"d":"35.72"}},{"$f":"IF(AND(AA$16*1>=$R198,AA$16*1<=$D$8,$R198<$D$8,$P198>SUM($V198:Z198)),IF(SUM($P198*$U198/12,$V198:Z198)>$P198,$P198-SUM($V198:Z198),$P198*$U198/12),0)","v":{"v":35.716875,"d":"35.72"}},{"$f":"IF(AND(AB$16*1>=$R198,AB$16*1<=$D$8,$R198<$D$8,$P198>SUM($V198:AA198)),IF(SUM($P198*$U198/12,$V198:AA198)>$P198,$P198-SUM($V198:AA198),$P198*$U198/12),0)","v":{"v":0,"d":"0.00"}},{"$f":"IF(AND(AC$16*1>=$R198,AC$16*1<=$D$8,$R198<$D$8,$P198>SUM($V198:AB198)),IF(SUM($P198*$U198/12,$V198:AB198)>$P198,$P198-SUM($V198:AB198),$P198*$U198/12),0)","v":{"v":0,"d":"0.00"}},{"$f":"IF(AND(AD$16*1>=$R198,AD$16*1<=$D$8,$R198<$D$8,$P198>SUM($V198:AC198)),IF(SUM($P198*$U198/12,$V198:AC198)>$P198,$P198-SUM($V198:AC198),$P198*$U198/12),0)","v":{"v":0,"d":"0.00"}},{"$f":"IF(AND(AE$16*1>=$R198,AE$16*1<=$D$8,$R198<$D$8,$P198>SUM($V198:AD198)),IF(SUM($P198*$U198/12,$V198:AD198)>$P198,$P198-SUM($V198:AD198),$P198*$U198/12),0)","v":{"v":0,"d":"0.00"}},{"$f":"IF(AND(AF$16*1>=$R198,AF$16*1<=$D$8,$R198<$D$8,$P198>SUM($V198:AE198)),IF(SUM($P198*$U198/12,$V198:AE198)>$P198,$P198-SUM($V198:AE198),$P198*$U198/12),0)","v":{"v":0,"d":"0.00"}},{"$f":"IF(AND(AG$16*1>=$R198,AG$16*1<=$D$8,$R198<$D$8,$P198>SUM($V198:AF198)),IF(SUM($P198*$U198/12,$V198:AF198)>$P198,$P198-SUM($V198:AF198),$P198*$U198/12),0)","v":{"v":0,"d":"0.00"}},{"$f":"IF(AND(AH$16*1>=$R198,AH$16*1<=$D$8,$R198<$D$8,$P198>SUM($V198:AG198)),IF(SUM($P198*$U198/12,$V198:AG198)>$P198,$P198-SUM($V198:AG198),$P198*$U198/12),0)","v":{"v":0,"d":"0.00"}},{"v":178.58437500000002,"d":"178.58"},null,null,{"v":107.150625,"d":"107.15"},null,{"v":107.150625,"d":"107.15"}]
[null,null,191,"335111","SILLA FIJA Y ESCRITORIO ARCHIV",{"$nulls":4},908.05,{"$nulls":3},908.05,null,908.05,"2019-03-20","2019-04-01",null,null,{"v":0.1,"d":"10%"},null,{"$f":"IF(AND(W$16*1>=$R199,W$16*1<=$D$8,$R199<$D$8,$P199>SUM($V199:V199)),IF(SUM($P199*$U199/12,$V199:V199)>$P199,$P199-SUM($V199:V199),$P199*$U199/12),0)","v":{"v":7.567083333333334,"d":"7.57"}},{"$f":"IF(AND(X$16*1>=$R199,X$16*1<=$D$8,$R199<$D$8,$P199>SUM($V199:W199)),IF(SUM($P199*$U199/12,$V199:W199)>$P199,$P199-SUM($V199:W199),$P199*$U199/12),0)","v":{"v":7.567083333333334,"d":"7.57"}},{"$f":"IF(AND(Y$16*1>=$R199,Y$16*1<=$D$8,$R199<$D$8,$P199>SUM($V199:X199)),IF(SUM($P199*$U199/12,$V199:X199)>$P199,$P199-SUM($V199:X199),$P199*$U199/12),0)","v":{"v":7.567083333333334,"d":"7.57"}},{"$f":"IF(AND(Z$16*1>=$R199,Z$16*1<=$D$8,$R199<$D$8,$P199>SUM($V199:Y199)),IF(SUM($P199*$U199/12,$V199:Y199)>$P199,$P199-SUM($V199:Y199),$P199*$U199/12),0)","v":{"v":7.567083333333334,"d":"7.57"}},{"$f":"IF(AND(AA$16*1>=$R199,AA$16*1<=$D$8,$R199<$D$8,$P199>SUM($V199:Z199)),IF(SUM($P199*$U199/12,$V199:Z199)>$P199,$P199-SUM($V199:Z199),$P199*$U199/12),0)","v":{"v":7.567083333333334,"d":"7.57"}},{"$f":"IF(AND(AB$16*1>=$R199,AB$16*1<=$D$8,$R199<$D$8,$P199>SUM($V199:AA199)),IF(SUM($P199*$U199/12,$V199:AA199)>$P199,$P199-SUM($V199:AA199),$P199*$U199/12),0)","v":{"v":0,"d":"0.00"}},{"$f":"IF(AND(AC$16*1>=$R199,AC$16*1<=$D$8,$R199<$D$8,$P199>SUM($V199:AB199)),IF(SUM($P199*$U199/12,$V199:AB199)>$P199,$P199-SUM($V199:AB199),$P199*$U199/12),0)","v":{"v":0,"d":"0.00"}},{"$f":"IF(AND(AD$16*1>=$R199,AD$16*1<=$D$8,$R199<$D$8,$P199>SUM($V199:AC199)),IF(SUM($P199*$U199/12,$V199:AC199)>$P199,$P199-SUM($V199:AC199),$P199*$U199/12),0)","v":{"v":0,"d":"0.00"}},{"$f":"IF(AND(AE$16*1>=$R199,AE$16*1<=$D$8,$R199<$D$8,$P199>SUM($V199:AD199)),IF(SUM($P199*$U199/12,$V199:AD199)>$P199,$P199-SUM($V199:AD199),$P199*$U199/12),0)","v":{"v":0,"d":"0.00"}},{"$f":"IF(AND(AF$16*1>=$R199,AF$16*1<=$D$8,$R199<$D$8,$P199>SUM($V199:AE199)),IF(SUM($P199*$U199/12,$V199:AE199)>$P199,$P199-SUM($V199:AE199),$P199*$U199/12),0)","v":{"v":0,"d":"0.00"}},{"$f":"IF(AND(AG$16*1>=$R199,AG$16*1<=$D$8,$R199<$D$8,$P199>SUM($V199:AF199)),IF(SUM($P199*$U199/12,$V199:AF199)>$P199,$P199-SUM($V199:AF199),$P199*$U199/12),0)","v":{"v":0,"d":"0.00"}},{"$f":"IF(AND(AH$16*1>=$R199,AH$16*1<=$D$8,$R199<$D$8,$P199>SUM($V199:AG199)),IF(SUM($P199*$U199/12,$V199:AG199)>$P199,$P199-SUM($V199:AG199),$P199*$U199/12),0)","v":{"v":0,"d":"0.00"}},{"v":37.83541666666667,"d":"37.84"},null,null,{"v":22.70125,"d":"22.70"},null,{"v":22.70125,"d":"22.70"}]
[null,null,192,"336311","MANTENIMIENTO CAMARA, DVR",{"$nulls":4},152.54,{"$nulls":3},152.54,null,152.54,"2019-03-23","2019-04-01",null,null,{"v":0.1,"d":"10%"},null,{"$f":"IF(AND(W$16*1>=$R200,W$16*1<=$D$8,$R200<$D$8,$P200>SUM($V200:V200)),IF(SUM($P200*$U200/12,$V200:V200)>$P200,$P200-SUM($V200:V200),$P200*$U200/12),0)","v":{"v":1.2711666666666666,"d":"1.27"}},{"$f":"IF(AND(X$16*1>=$R200,X$16*1<=$D$8,$R200<$D$8,$P200>SUM($V200:W200)),IF(SUM($P200*$U200/12,$V200:W200)>$P200,$P200-SUM($V200:W200),$P200*$U200/12),0)","v":{"v":1.2711666666666666,"d":"1.27"}},{"$f":"IF(AND(Y$16*1>=$R200,Y$16*1<=$D$8,$R200<$D$8,$P200>SUM($V200:X200)),IF(SUM($P200*$U200/12,$V200:X200)>$P200,$P200-SUM($V200:X200),$P200*$U200/12),0)","v":{"v":1.2711666666666666,"d":"1.27"}},{"$f":"IF(AND(Z$16*1>=$R200,Z$16*1<=$D$8,$R200<$D$8,$P200>SUM($V200:Y200)),IF(SUM($P200*$U200/12,$V200:Y200)>$P200,$P200-SUM($V200:Y200),$P200*$U200/12),0)","v":{"v":1.2711666666666666,"d":"1.27"}},{"$f":"IF(AND(AA$16*1>=$R200,AA$16*1<=$D$8,$R200<$D$8,$P200>SUM($V200:Z200)),IF(SUM($P200*$U200/12,$V200:Z200)>$P200,$P200-SUM($V200:Z200),$P200*$U200/12),0)","v":{"v":1.2711666666666666,"d":"1.27"}},{"$f":"IF(AND(AB$16*1>=$R200,AB$16*1<=$D$8,$R200<$D$8,$P200>SUM($V200:AA200)),IF(SUM($P200*$U200/12,$V200:AA200)>$P200,$P200-SUM($V200:AA200),$P200*$U200/12),0)","v":{"v":0,"d":"0.00"}},{"$f":"IF(AND(AC$16*1>=$R200,AC$16*1<=$D$8,$R200<$D$8,$P200>SUM($V200:AB200)),IF(SUM($P200*$U200/12,$V200:AB200)>$P200,$P200-SUM($V200:AB200),$P200*$U200/12),0)","v":{"v":0,"d":"0.00"}},{"$f":"IF(AND(AD$16*1>=$R200,AD$16*1<=$D$8,$R200<$D$8,$P200>SUM($V200:AC200)),IF(SUM($P200*$U200/12,$V200:AC200)>$P200,$P200-SUM($V200:AC200),$P200*$U200/12),0)","v":{"v":0,"d":"0.00"}},{"$f":"IF(AND(AE$16*1>=$R200,AE$16*1<=$D$8,$R200<$D$8,$P200>SUM($V200:AD200)),IF(SUM($P200*$U200/12,$V200:AD200)>$P200,$P200-SUM($V200:AD200),$P200*$U200/12),0)","v":{"v":0,"d":"0.00"}},{"$f":"IF(AND(AF$16*1>=$R200,AF$16*1<=$D$8,$R200<$D$8,$P200>SUM($V200:AE200)),IF(SUM($P200*$U200/12,$V200:AE200)>$P200,$P200-SUM($V200:AE200),$P200*$U200/12),0)","v":{"v":0,"d":"0.00"}},{"$f":"IF(AND(AG$16*1>=$R200,AG$16*1<=$D$8,$R200<$D$8,$P200>SUM($V200:AF200)),IF(SUM($P200*$U200/12,$V200:AF200)>$P200,$P200-SUM($V200:AF200),$P200*$U200/12),0)","v":{"v":0,"d":"0.00"}},{"$f":"IF(AND(AH$16*1>=$R200,AH$16*1<=$D$8,$R200<$D$8,$P200>SUM($V200:AG200)),IF(SUM($P200*$U200/12,$V200:AG200)>$P200,$P200-SUM($V200:AG200),$P200*$U200/12),0)","v":{"v":0,"d":"0.00"}},{"v":6.355833333333333,"d":"6.36"},null,null,{"v":3.8134999999999994,"d":"3.81"},null,{"v":3.8134999999999994,"d":"3.81"}]
[null,null,193,"336111","COMPRA IMPRESORA EPSON MATRICI",{"$nulls":4},606.78,{"$nulls":3},606.78,null,606.78,"2019-03-26","2019-04-01",null,null,{"v":0.25,"d":"25%"},null,{"$f":"IF(AND(W$16*1>=$R201,W$16*1<=$D$8,$R201<$D$8,$P201>SUM($V201:V201)),IF(SUM($P201*$U201/12,$V201:V201)>$P201,$P201-SUM($V201:V201),$P201*$U201/12),0)","v":{"v":12.64125,"d":"12.64"}},{"$f":"IF(AND(X$16*1>=$R201,X$16*1<=$D$8,$R201<$D$8,$P201>SUM($V201:W201)),IF(SUM($P201*$U201/12,$V201:W201)>$P201,$P201-SUM($V201:W201),$P201*$U201/12),0)","v":{"v":12.64125,"d":"12.64"}},{"$f":"IF(AND(Y$16*1>=$R201,Y$16*1<=$D$8,$R201<$D$8,$P201>SUM($V201:X201)),IF(SUM($P201*$U201/12,$V201:X201)>$P201,$P201-SUM($V201:X201),$P201*$U201/12),0)","v":{"v":12.64125,"d":"12.64"}},{"$f":"IF(AND(Z$16*1>=$R201,Z$16*1<=$D$8,$R201<$D$8,$P201>SUM($V201:Y201)),IF(SUM($P201*$U201/12,$V201:Y201)>$P201,$P201-SUM($V201:Y201),$P201*$U201/12),0)","v":{"v":12.64125,"d":"12.64"}},{"$f":"IF(AND(AA$16*1>=$R201,AA$16*1<=$D$8,$R201<$D$8,$P201>SUM($V201:Z201)),IF(SUM($P201*$U201/12,$V201:Z201)>$P201,$P201-SUM($V201:Z201),$P201*$U201/12),0)","v":{"v":12.64125,"d":"12.64"}},{"$f":"IF(AND(AB$16*1>=$R201,AB$16*1<=$D$8,$R201<$D$8,$P201>SUM($V201:AA201)),IF(SUM($P201*$U201/12,$V201:AA201)>$P201,$P201-SUM($V201:AA201),$P201*$U201/12),0)","v":{"v":0,"d":"0.00"}},{"$f":"IF(AND(AC$16*1>=$R201,AC$16*1<=$D$8,$R201<$D$8,$P201>SUM($V201:AB201)),IF(SUM($P201*$U201/12,$V201:AB201)>$P201,$P201-SUM($V201:AB201),$P201*$U201/12),0)","v":{"v":0,"d":"0.00"}},{"$f":"IF(AND(AD$16*1>=$R201,AD$16*1<=$D$8,$R201<$D$8,$P201>SUM($V201:AC201)),IF(SUM($P201*$U201/12,$V201:AC201)>$P201,$P201-SUM($V201:AC201),$P201*$U201/12),0)","v":{"v":0,"d":"0.00"}},{"$f":"IF(AND(AE$16*1>=$R201,AE$16*1<=$D$8,$R201<$D$8,$P201>SUM($V201:AD201)),IF(SUM($P201*$U201/12,$V201:AD201)>$P201,$P201-SUM($V201:AD201),$P201*$U201/12),0)","v":{"v":0,"d":"0.00"}},{"$f":"IF(AND(AF$16*1>=$R201,AF$16*1<=$D$8,$R201<$D$8,$P201>SUM($V201:AE201)),IF(SUM($P201*$U201/12,$V201:AE201)>$P201,$P201-SUM($V201:AE201),$P201*$U201/12),0)","v":{"v":0,"d":"0.00"}},{"$f":"IF(AND(AG$16*1>=$R201,AG$16*1<=$D$8,$R201<$D$8,$P201>SUM($V201:AF201)),IF(SUM($P201*$U201/12,$V201:AF201)>$P201,$P201-SUM($V201:AF201),$P201*$U201/12),0)","v":{"v":0,"d":"0.00"}},{"$f":"IF(AND(AH$16*1>=$R201,AH$16*1<=$D$8,$R201<$D$8,$P201>SUM($V201:AG201)),IF(SUM($P201*$U201/12,$V201:AG201)>$P201,$P201-SUM($V201:AG201),$P201*$U201/12),0)","v":{"v":0,"d":"0.00"}},{"$f":"SUM(W201:AH201)","v":{"v":63.20625,"d":"63.21"}},null,null,{"v":37.92375,"d":"37.92"},null,{"v":37.92375,"d":"37.92"}]
[null,null,194,"335111"," ARTICULOS VARIOS",{"$nulls":4},404.05,{"$nulls":3},404.05,null,404.05,"2019-03-31","2019-04-01",null,null,{"v":0.1,"d":"10%"},null,{"$f":"IF(AND(W$16*1>=$R202,W$16*1<=$D$8,$R202<$D$8,$P202>SUM($V202:V202)),IF(SUM($P202*$U202/12,$V202:V202)>$P202,$P202-SUM($V202:V202),$P202*$U202/12),0)","v":{"v":3.3670833333333334,"d":"3.37"}},{"$f":"IF(AND(X$16*1>=$R202,X$16*1<=$D$8,$R202<$D$8,$P202>SUM($V202:W202)),IF(SUM($P202*$U202/12,$V202:W202)>$P202,$P202-SUM($V202:W202),$P202*$U202/12),0)","v":{"v":3.3670833333333334,"d":"3.37"}},{"$f":"IF(AND(Y$16*1>=$R202,Y$16*1<=$D$8,$R202<$D$8,$P202>SUM($V202:X202)),IF(SUM($P202*$U202/12,$V202:X202)>$P202,$P202-SUM($V202:X202),$P202*$U202/12),0)","v":{"v":3.3670833333333334,"d":"3.37"}},{"$f":"IF(AND(Z$16*1>=$R202,Z$16*1<=$D$8,$R202<$D$8,$P202>SUM($V202:Y202)),IF(SUM($P202*$U202/12,$V202:Y202)>$P202,$P202-SUM($V202:Y202),$P202*$U202/12),0)","v":{"v":3.3670833333333334,"d":"3.37"}},{"$f":"IF(AND(AA$16*1>=$R202,AA$16*1<=$D$8,$R202<$D$8,$P202>SUM($V202:Z202)),IF(SUM($P202*$U202/12,$V202:Z202)>$P202,$P202-SUM($V202:Z202),$P202*$U202/12),0)","v":{"v":3.3670833333333334,"d":"3.37"}},{"$f":"IF(AND(AB$16*1>=$R202,AB$16*1<=$D$8,$R202<$D$8,$P202>SUM($V202:AA202)),IF(SUM($P202*$U202/12,$V202:AA202)>$P202,$P202-SUM($V202:AA202),$P202*$U202/12),0)","v":{"v":0,"d":"0.00"}},{"$f":"IF(AND(AC$16*1>=$R202,AC$16*1<=$D$8,$R202<$D$8,$P202>SUM($V202:AB202)),IF(SUM($P202*$U202/12,$V202:AB202)>$P202,$P202-SUM($V202:AB202),$P202*$U202/12),0)","v":{"v":0,"d":"0.00"}},{"$f":"IF(AND(AD$16*1>=$R202,AD$16*1<=$D$8,$R202<$D$8,$P202>SUM($V202:AC202)),IF(SUM($P202*$U202/12,$V202:AC202)>$P202,$P202-SUM($V202:AC202),$P202*$U202/12),0)","v":{"v":0,"d":"0.00"}},{"$f":"IF(AND(AE$16*1>=$R202,AE$16*1<=$D$8,$R202<$D$8,$P202>SUM($V202:AD202)),IF(SUM($P202*$U202/12,$V202:AD202)>$P202,$P202-SUM($V202:AD202),$P202*$U202/12),0)","v":{"v":0,"d":"0.00"}},{"$f":"IF(AND(AF$16*1>=$R202,AF$16*1<=$D$8,$R202<$D$8,$P202>SUM($V202:AE202)),IF(SUM($P202*$U202/12,$V202:AE202)>$P202,$P202-SUM($V202:AE202),$P202*$U202/12),0)","v":{"v":0,"d":"0.00"}},{"$f":"IF(AND(AG$16*1>=$R202,AG$16*1<=$D$8,$R202<$D$8,$P202>SUM($V202:AF202)),IF(SUM($P202*$U202/12,$V202:AF202)>$P202,$P202-SUM($V202:AF202),$P202*$U202/12),0)","v":{"v":0,"d":"0.00"}},{"$f":"IF(AND(AH$16*1>=$R202,AH$16*1<=$D$8,$R202<$D$8,$P202>SUM($V202:AG202)),IF(SUM($P202*$U202/12,$V202:AG202)>$P202,$P202-SUM($V202:AG202),$P202*$U202/12),0)","v":{"v":0,"d":"0.00"}},{"v":16.835416666666667,"d":"16.84"},null,null,{"v":10.10125,"d":"10.10"},null,{"v":10.10125,"d":"10.10"}]
[null,null,195,"336111","2 EQPO INTEL CORE DISCO DURO",{"$nulls":4},3428.81,{"$nulls":3},3428.81,null,{"v":3428.81,"d":"3,428.81"},"2019-04-01","2019-05-01",null,null,{"v":0.25,"d":"25%"},null,{"$f":"IF(AND(W$16*1>=$R203,W$16*1<=$D$8,$R203<$D$8,$P203>SUM($V203:V203)),IF(SUM($P203*$U203/12,$V203:V203)>$P203,$P203-SUM($V203:V203),$P203*$U203/12),0)","v":{"v":71.43354166666667,"d":"71.43"}},{"$f":"IF(AND(X$16*1>=$R203,X$16*1<=$D$8,$R203<$D$8,$P203>SUM($V203:W203)),IF(SUM($P203*$U203/12,$V203:W203)>$P203,$P203-SUM($V203:W203),$P203*$U203/12),0)","v":{"v":71.43354166666667,"d":"71.43"}},{"$f":"IF(AND(Y$16*1>=$R203,Y$16*1<=$D$8,$R203<$D$8,$P203>SUM($V203:X203)),IF(SUM($P203*$U203/12,$V203:X203)>$P203,$P203-SUM($V203:X203),$P203*$U203/12),0)","v":{"v":71.43354166666667,"d":"71.43"}},{"$f":"IF(AND(Z$16*1>=$R203,Z$16*1<=$D$8,$R203<$D$8,$P203>SUM($V203:Y203)),IF(SUM($P203*$U203/12,$V203:Y203)>$P203,$P203-SUM($V203:Y203),$P203*$U203/12),0)","v":{"v":71.43354166666667,"d":"71.43"}},{"$f":"IF(AND(AA$16*1>=$R203,AA$16*1<=$D$8,$R203<$D$8,$P203>SUM($V203:Z203)),IF(SUM($P203*$U203/12,$V203:Z203)>$P203,$P203-SUM($V203:Z203),$P203*$U203/12),0)","v":{"v":71.43354166666667,"d":"71.43"}},{"$f":"IF(AND(AB$16*1>=$R203,AB$16*1<=$D$8,$R203<$D$8,$P203>SUM($V203:AA203)),IF(SUM($P203*$U203/12,$V203:AA203)>$P203,$P203-SUM($V203:AA203),$P203*$U203/12),0)","v":{"v":0,"d":"0.00"}},{"$f":"IF(AND(AC$16*1>=$R203,AC$16*1<=$D$8,$R203<$D$8,$P203>SUM($V203:AB203)),IF(SUM($P203*$U203/12,$V203:AB203)>$P203,$P203-SUM($V203:AB203),$P203*$U203/12),0)","v":{"v":0,"d":"0.00"}},{"$f":"IF(AND(AD$16*1>=$R203,AD$16*1<=$D$8,$R203<$D$8,$P203>SUM($V203:AC203)),IF(SUM($P203*$U203/12,$V203:AC203)>$P203,$P203-SUM($V203:AC203),$P203*$U203/12),0)","v":{"v":0,"d":"0.00"}},{"$f":"IF(AND(AE$16*1>=$R203,AE$16*1<=$D$8,$R203<$D$8,$P203>SUM($V203:AD203)),IF(SUM($P203*$U203/12,$V203:AD203)>$P203,$P203-SUM($V203:AD203),$P203*$U203/12),0)","v":{"v":0,"d":"0.00"}},{"$f":"IF(AND(AF$16*1>=$R203,AF$16*1<=$D$8,$R203<$D$8,$P203>SUM($V203:AE203)),IF(SUM($P203*$U203/12,$V203:AE203)>$P203,$P203-SUM($V203:AE203),$P203*$U203/12),0)","v":{"v":0,"d":"0.00"}},{"$f":"IF(AND(AG$16*1>=$R203,AG$16*1<=$D$8,$R203<$D$8,$P203>SUM($V203:AF203)),IF(SUM($P203*$U203/12,$V203:AF203)>$P203,$P203-SUM($V203:AF203),$P203*$U203/12),0)","v":{"v":0,"d":"0.00"}},{"$f":"IF(AND(AH$16*1>=$R203,AH$16*1<=$D$8,$R203<$D$8,$P203>SUM($V203:AG203)),IF(SUM($P203*$U203/12,$V203:AG203)>$P203,$P203-SUM($V203:AG203),$P203*$U203/12),0)","v":{"v":0,"d":"0.00"}},{"v":357.16770833333334,"d":"357.17"},null,null,{"v":214.30062500000003,"d":"214.30"},null,{"v":214.30062500000003,"d":"214.30"}]
[null,null,196,"336111","TOSHIBA C45T PANTALLA TACTIL",{"$nulls":4},1708.47,{"$nulls":3},1708.47,null,{"v":1708.47,"d":"1,708.47"},"2019-04-03","2019-05-01",null,null,{"v":0.25,"d":"25%"},null,{"$f":"IF(AND(W$16*1>=$R204,W$16*1<=$D$8,$R204<$D$8,$P204>SUM($V204:V204)),IF(SUM($P204*$U204/12,$V204:V204)>$P204,$P204-SUM($V204:V204),$P204*$U204/12),0)","v":{"v":35.593125,"d":"35.59"}},{"$f":"IF(AND(X$16*1>=$R204,X$16*1<=$D$8,$R204<$D$8,$P204>SUM($V204:W204)),IF(SUM($P204*$U204/12,$V204:W204)>$P204,$P204-SUM($V204:W204),$P204*$U204/12),0)","v":{"v":35.593125,"d":"35.59"}},{"$f":"IF(AND(Y$16*1>=$R204,Y$16*1<=$D$8,$R204<$D$8,$P204>SUM($V204:X204)),IF(SUM($P204*$U204/12,$V204:X204)>$P204,$P204-SUM($V204:X204),$P204*$U204/12),0)","v":{"v":35.593125,"d":"35.59"}},{"$f":"IF(AND(Z$16*1>=$R204,Z$16*1<=$D$8,$R204<$D$8,$P204>SUM($V204:Y204)),IF(SUM($P204*$U204/12,$V204:Y204)>$P204,$P204-SUM($V204:Y204),$P204*$U204/12),0)","v":{"v":35.593125,"d":"35.59"}},{"$f":"IF(AND(AA$16*1>=$R204,AA$16*1<=$D$8,$R204<$D$8,$P204>SUM($V204:Z204)),IF(SUM($P204*$U204/12,$V204:Z204)>$P204,$P204-SUM($V204:Z204),$P204*$U204/12),0)","v":{"v":35.593125,"d":"35.59"}},{"$f":"IF(AND(AB$16*1>=$R204,AB$16*1<=$D$8,$R204<$D$8,$P204>SUM($V204:AA204)),IF(SUM($P204*$U204/12,$V204:AA204)>$P204,$P204-SUM($V204:AA204),$P204*$U204/12),0)","v":{"v":0,"d":"0.00"}},{"$f":"IF(AND(AC$16*1>=$R204,AC$16*1<=$D$8,$R204<$D$8,$P204>SUM($V204:AB204)),IF(SUM($P204*$U204/12,$V204:AB204)>$P204,$P204-SUM($V204:AB204),$P204*$U204/12),0)","v":{"v":0,"d":"0.00"}},{"$f":"IF(AND(AD$16*1>=$R204,AD$16*1<=$D$8,$R204<$D$8,$P204>SUM($V204:AC204)),IF(SUM($P204*$U204/12,$V204:AC204)>$P204,$P204-SUM($V204:AC204),$P204*$U204/12),0)","v":{"v":0,"d":"0.00"}},{"$f":"IF(AND(AE$16*1>=$R204,AE$16*1<=$D$8,$R204<$D$8,$P204>SUM($V204:AD204)),IF(SUM($P204*$U204/12,$V204:AD204)>$P204,$P204-SUM($V204:AD204),$P204*$U204/12),0)","v":{"v":0,"d":"0.00"}},{"$f":"IF(AND(AF$16*1>=$R204,AF$16*1<=$D$8,$R204<$D$8,$P204>SUM($V204:AE204)),IF(SUM($P204*$U204/12,$V204:AE204)>$P204,$P204-SUM($V204:AE204),$P204*$U204/12),0)","v":{"v":0,"d":"0.00"}},{"$f":"IF(AND(AG$16*1>=$R204,AG$16*1<=$D$8,$R204<$D$8,$P204>SUM($V204:AF204)),IF(SUM($P204*$U204/12,$V204:AF204)>$P204,$P204-SUM($V204:AF204),$P204*$U204/12),0)","v":{"v":0,"d":"0.00"}},{"$f":"IF(AND(AH$16*1>=$R204,AH$16*1<=$D$8,$R204<$D$8,$P204>SUM($V204:AG204)),IF(SUM($P204*$U204/12,$V204:AG204)>$P204,$P204-SUM($V204:AG204),$P204*$U204/12),0)","v":{"v":0,"d":"0.00"}},{"v":177.965625,"d":"177.97"},null,null,{"v":106.779375,"d":"106.78"},null,{"v":106.779375,"d":"106.78"}]

{"sheet":"RESUMEN","index":2,"n_rows":23,"n_cols":23,"rows_kept":23,"merged":[[9,2,9,22],[11,2,12,2],[11,3,12,3],[11,4,11,6],[11,7,11,21],[22,2,22,3]]}
[null,"Hoja de resumen • Registro de activos fijos y depreciación"]
[null,"MOS Expert CPC Martín Cruz • +51 998 401 784 | Excel No Convencional"]
{"$rows_empty":7}
[null,null,{"$f":"TITULO","v":"CUADRO DE ACTIVOS Y DEPRECIACION AL 31/05/2020"}]
[]
[null,null,"CUENTA","NOMBRE DE CUENTA","ACTIVO",null,null,"DEPRECIACION MENSUAL",{"$nulls":14},"ACTIVO"]
[{"$nulls":4},"SALDO INICIAL","COMPRAS","SALDO FINAL","SALDO INICIAL","ENE","FEB","MAR","ABR","MAY","JUN","JUL","AGO","SEP","OCT","NOV","DIC","DEL PERIODO","SALDO FINAL","NETO"]
[null,null,"335111",{"$f":"VLOOKUP(C14,TASAS!$C$6:$D$13,2,0)","v":"MUEBLES"},{"$f":"SUMIF('F 7.1 Det bs AF'!$D$17:$D$204,$C14,'F 7.1 Det bs AF'!I$17:I$204)","v":{"v":59143.99999999998,"d":"59,144.00"}},{"$f":"SUMIF('F 7.1 Det bs AF'!$D$17:$D$204,$C14,'F 7.1 Det bs AF'!J$17:J$204)","v":{"v":2498.37,"d":"2,498.37"}},{"$f":"SUM(E14:F14)","v":{"v":61642.36999999998,"d":"61,642.37"}},{"$f":"SUMIF('F 7.1 Det bs AF'!$D$17:$D$204,$C14,'F 7.1 Det bs AF'!V$17:V$204)","v":{"v":43866.120000000024,"d":"43,866.12"}},{"$f":"SUMIF('F 7.1 Det bs AF'!$D$17:$D$204,$C14,'F 7.1 Det bs AF'!W$17:W$204)","v":{"v":220.77441666666675,"d":"220.77"}},{"$f":"SUMIF('F 7.1 Det bs AF'!$D$17:$D$204,$C14,'F 7.1 Det bs AF'!X$17:X$204)","v":{"v":219.1807500000001,"d":"219.18"}},{"$f":"SUMIF('F 7.1 Det bs AF'!$D$17:$D$204,$C14,'F 7.1 Det bs AF'!Y$17:Y$204)","v":{"v":219.16758333333343,"d":"219.17"}},{"$f":"SUMIF('F 7.1 Det bs AF'!$D$17:$D$204,$C14,'F 7.1 Det bs AF'!Z$17:Z$204)","v":{"v":219.16758333333343,"d":"219.17"}},{"$f":"SUMIF('F 7.1 Det bs AF'!$D$17:$D$204,$C14,'F 7.1 Det bs AF'!AA$17:AA$204)","v":{"v":219.16758333333343,"d":"219.17"}},{"$f":"SUMIF('F 7.1 Det bs AF'!$D$17:$D$204,$C14,'F 7.1 Det bs AF'!AB$17:AB$204)","v":{"v":0,"d":"0.00"}},{"$f":"SUMIF('F 7.1 Det bs AF'!$D$17:$D$204,$C14,'F 7.1 Det bs AF'!AC$17:AC$204)","v":{"v":0,"d":"0.00"}},{"$f":"SUMIF('F 7.1 Det bs AF'!$D$17:$D$204,$C14,'F 7.1 Det bs AF'!AD$17:AD$204)","v":{"v":0,"d":"0.00"}},{"$f":"SUMIF('F 7.1 Det bs AF'!$D$17:$D$204,$C14,'F 7.1 Det bs AF'!AE$17:AE$204)","v":{"v":0,"d":"0.00"}},{"$f":"SUMIF('F 7.1 Det bs AF'!$D$17:$D$204,$C14,'F 7.1 Det bs AF'!AF$17:AF$204)","v":{"v":0,"d":"0.00"}},{"$f":"SUMIF('F 7.1 Det bs AF'!$D$17:$D$204,$C14,'F 7.1 Det bs AF'!AG$17:AG$204)","v":{"v":0,"d":"0.00"}},{"$f":"SUMIF('F 7.1 Det bs AF'!$D$17:$D$204,$C14,'F 7.1 Det bs AF'!AH$17:AH$204)","v":{"v":0,"d":"0.00"}},{"$f":"SUM(I14:T14)","v":{"v":1097.457916666667,"d":"1,097.46"}},{"$f":"SUM(H14,U14)","v":{"v":44963.57791666669,"d":"44,963.58"}},{"$f":"G14-V14","v":{"v":16678.79208333329,"d":"16,678.79"}}]
[null,null,"335211",{"$f":"VLOOKUP(C15,TASAS!$C$6:$D$13,2,0)","v":"ENSERES"},{"$f":"SUMIF('F 7.1 Det bs AF'!$D$17:$D$204,$C15,'F 7.1 Det bs AF'!I$17:I$204)","v":{"v":6605.8099999999995,"d":"6,605.81"}},{"$f":"SUMIF('F 7.1 Det bs AF'!$D$17:$D$204,$C15,'F 7.1 Det bs AF'!J$17:J$204)","v":{"v":0,"d":"0.00"}},{"$f":"SUM(E15:F15)","v":{"v":6605.8099999999995,"d":"6,605.81"}},{"$f":"SUMIF('F 7.1 Det bs AF'!$D$17:$D$204,$C15,'F 7.1 Det bs AF'!V$17:V$204)","v":{"v":6605.8099999999995,"d":"6,605.81"}},{"$f":"SUMIF('F 7.1 Det bs AF'!$D$17:$D$204,$C15,'F 7.1 Det bs AF'!W$17:W$204)","v":{"v":0,"d":"0.00"}},{"$f":"SUMIF('F 7.1 Det bs AF'!$D$17:$D$204,$C15,'F 7.1 Det bs AF'!X$17:X$204)","v":{"v":0,"d":"0.00"}},{"$f":"SUMIF('F 7.1 Det bs AF'!$D$17:$D$204,$C15,'F 7.1 Det bs AF'!Y$17:Y$204)","v":{"v":0,"d":"0.00"}},{"$f":"SUMIF('F 7.1 Det bs AF'!$D$17:$D$204,$C15,'F 7.1 Det bs AF'!Z$17:Z$204)","v":{"v":0,"d":"0.00"}},{"$f":"SUMIF('F 7.1 Det bs AF'!$D$17:$D$204,$C15,'F 7.1 Det bs AF'!AA$17:AA$204)","v":{"v":0,"d":"0.00"}},{"$f":"SUMIF('F 7.1 Det bs AF'!$D$17:$D$204,$C15,'F 7.1 Det bs AF'!AB$17:AB$204)","v":{"v":0,"d":"0.00"}},{"$f":"SUMIF('F 7.1 Det bs AF'!$D$17:$D$204,$C15,'F 7.1 Det bs AF'!AC$17:AC$204)","v":{"v":0,"d":"0.00"}},{"$f":"SUMIF('F 7.1 Det bs AF'!$D$17:$D$204,$C15,'F 7.1 Det bs AF'!AD$17:AD$204)","v":{"v":0,"d":"0.00"}},{"$f":"SUMIF('F 7.1 Det bs AF'!$D$17:$D$204,$C15,'F 7.1 Det bs AF'!AE$17:AE$204)","v":{"v":0,"d":"0.00"}},{"$f":"SUMIF('F 7.1 Det bs AF'!$D$17:$D$204,$C15,'F 7.1 Det bs AF'!AF$17:AF$204)","v":{"v":0,"d":"0.00"}},{"$f":"SUMIF('F 7.1 Det bs AF'!$D$17:$D$204,$C15,'F 7.1 Det bs AF'!AG$17:AG$204)","v":{"v":0,"d":"0.00"}},{"$f":"SUMIF('F 7.1 Det bs AF'!$D$17:$D$204,$C15,'F 7.1 Det bs AF'!AH$17:AH$204)","v":{"v":0,"d":"0.00"}},{"$f":"SUM(I15:T15)","v":{"v":0,"d":"0.00"}},{"v":6605.8099999999995,"d":"6,605.81"},{"$f":"G15-V15","v":{"v":0,"d":"0.00"}}]
[null,null,"336111",{"$f":"VLOOKUP(C16,TASAS!$C$6:$D$13,2,0)","v":"EQUIPO COMPUTO"},{"$f":"SUMIF('F 7.1 Det bs AF'!$D$17:$D$204,$C16,'F 7.1 Det bs AF'!I$17:I$204)","v":{"v":97830.93999999997,"d":"97,830.94"}},{"$f":"SUMIF('F 7.1 Det bs AF'!$D$17:$D$204,$C16,'F 7.1 Det bs AF'!J$17:J$204)","v":{"v":14238.98,"d":"14,238.98"}},{"v":112069.91999999997,"d":"112,069.92"},{"$f":"SUMIF('F 7.1 Det bs AF'!$D$17:$D$204,$C16,'F 7.1 Det bs AF'!V$17:V$204)","v":{"v":81405.19000000002,"d":"81,405.19"}},{"$f":"SUMIF('F 7.1 Det bs AF'!$D$17:$D$204,$C16,'F 7.1 Det bs AF'!W$17:W$204)","v":{"v":874.0760416666665,"d":"874.08"}},{"$f":"SUMIF('F 7.1 Det bs AF'!$D$17:$D$204,$C16,'F 7.1 Det bs AF'!X$17:X$204)","v":{"v":874.0760416666665,"d":"874.08"}},{"$f":"SUMIF('F 7.1 Det bs AF'!$D$17:$D$204,$C16,'F 7.1 Det bs AF'!Y$17:Y$204)","v":{"v":849.3554166666665,"d":"849.36"}},{"$f":"SUMIF('F 7.1 Det bs AF'!$D$17:$D$204,$C16,'F 7.1 Det bs AF'!Z$17:Z$204)","v":{"v":849.3525,"d":"849.35"}},{"$f":"SUMIF('F 7.1 Det bs AF'!$D$17:$D$204,$C16,'F 7.1 Det bs AF'!AA$17:AA$204)","v":{"v":849.3525,"d":"849.35"}},{"$f":"SUMIF('F 7.1 Det bs AF'!$D$17:$D$204,$C16,'F 7.1 Det bs AF'!AB$17:AB$204)","v":{"v":0,"d":"0.00"}},{"$f":"SUMIF('F 7.1 Det bs AF'!$D$17:$D$204,$C16,'F 7.1 Det bs AF'!AC$17:AC$204)","v":{"v":0,"d":"0.00"}},{"$f":"SUMIF('F 7.1 Det bs AF'!$D$17:$D$204,$C16,'F 7.1 Det bs AF'!AD$17:AD$204)","v":{"v":0,"d":"0.00"}},{"$f":"SUMIF('F 7.1 Det bs AF'!$D$17:$D$204,$C16,'F 7.1 Det bs AF'!AE$17:AE$204)","v":{"v":0,"d":"0.00"}},{"$f":"SUMIF('F 7.1 Det bs AF'!$D$17:$D$204,$C16,'F 7.1 Det bs AF'!AF$17:AF$204)","v":{"v":0,"d":"0.00"}},{"$f":"SUMIF('F 7.1 Det bs AF'!$D$17:$D$204,$C16,'F 7.1 Det bs AF'!AG$17:AG$204)","v":{"v":0,"d":"0.00"}},{"$f":"SUMIF('F 7.1 Det bs AF'!$D$17:$D$204,$C16,'F 7.1 Det bs AF'!AH$17:AH$204)","v":{"v":0,"d":"0.00"}},{"v":4296.2125,"d":"4,296.21"},{"v":85701.40250000001,"d":"85,701.40"},{"v":26368.517499999958,"d":"26,368.52"}]
[null,null,"336211",{"$f":"VLOOKUP(C17,TASAS!$C$6:$D$13,2,0)","v":"EQUIPO DE COMUNICACION"},{"$f":"SUMIF('F 7.1 Det bs AF'!$D$17:$D$204,$C17,'F 7.1 Det bs AF'!I$17:I$204)","v":{"v":12377.839999999997,"d":"12,377.84"}},{"$f":"SUMIF('F 7.1 Det bs AF'!$D$17:$D$204,$C17,'F 7.1 Det bs AF'!J$17:J$204)","v":{"v":0,"d":"0.00"}},{"v":12377.839999999997,"d":"12,377.84"},{"$f":"SUMIF('F 7.1 Det bs AF'!$D$17:$D$204,$C17,'F 7.1 Det bs AF'!V$17:V$204)","v":{"v":5527.460000000001,"d":"5,527.46"}},{"$f":"SUMIF('F 7.1 Det bs AF'!$D$17:$D$204,$C17,'F 7.1 Det bs AF'!W$17:W$204)","v":{"v":74.75183333333334,"d":"74.75"}},{"$f":"SUMIF('F 7.1 Det bs AF'!$D$17:$D$204,$C17,'F 7.1 Det bs AF'!X$17:X$204)","v":{"v":74.75183333333334,"d":"74.75"}},{"$f":"SUMIF('F 7.1 Det bs AF'!$D$17:$D$204,$C17,'F 7.1 Det bs AF'!Y$17:Y$204)","v":{"v":74.75183333333334,"d":"74.75"}},{"$f":"SUMIF('F 7.1 Det bs AF'!$D$17:$D$204,$C17,'F 7.1 Det bs AF'!Z$17:Z$204)","v":{"v":74.75183333333334,"d":"74.75"}},{"$f":"SUMIF('F 7.1 Det bs AF'!$D$17:$D$204,$C17,'F 7.1 Det bs AF'!AA$17:AA$204)","v":{"v":74.75183333333334,"d":"74.75"}},{"$f":"SUMIF('F 7.1 Det bs AF'!$D$17:$D$204,$C17,'F 7.1 Det bs AF'!AB$17:AB$204)","v":{"v":0,"d":"0.00"}},{"$f":"SUMIF('F 7.1 Det bs AF'!$D$17:$D$204,$C17,'F 7.1 Det bs AF'!AC$17:AC$204)","v":{"v":0,"d":"0.00"}},{"$f":"SUMIF('F 7.1 Det bs AF'!$D$17:$D$204,$C17,'F 7.1 Det bs AF'!AD$17:AD$204)","v":{"v":0,"d":"0.00"}},{"$f":"SUMIF('F 7.1 Det bs AF'!$D$17:$D$204,$C17,'F 7.1 Det bs AF'!AE$17:AE$204)","v":{"v":0,"d":"0.00"}},{"$f":"SUMIF('F 7.1 Det bs AF'!$D$17:$D$204,$C17,'F 7.1 Det bs AF'!AF$17:AF$204)","v":{"v":0,"d":"0.00"}},{"$f":"SUMIF('F 7.1 Det bs AF'!$D$17:$D$204,$C17,'F 7.1 Det bs AF'!AG$17:AG$204)","v":{"v":0,"d":"0.00"}},{"$f":"SUMIF('F 7.1 Det bs AF'!$D$17:$D$204,$C17,'F 7.1 Det bs AF'!AH$17:AH$204)","v":{"v":0,"d":"0.00"}},{"v":373.7591666666667,"d":"373.76"},{"v":5901.219166666668,"d":"5,901.22"},{"v":6476.620833333329,"d":"6,476.62"}]
[null,null,"336311",{"$f":"VLOOKUP(C18,TASAS!$C$6:$D$13,2,0)","v":"EQUIPOS DE SEGURIDAD"},{"$f":"SUMIF('F 7.1 Det bs AF'!$D$17:$D$204,$C18,'F 7.1 Det bs AF'!I$17:I$204)","v":{"v":6506.85,"d":"6,506.85"}},{"$f":"SUMIF('F 7.1 Det bs AF'!$D$17:$D$204,$C18,'F 7.1 Det bs AF'!J$17:J$204)","v":152.54},{"v":6659.39,"d":"6,659.39"},{"$f":"SUMIF('F 7.1 Det bs AF'!$D$17:$D$204,$C18,'F 7.1 Det bs AF'!V$17:V$204)","v":{"v":6506.85,"d":"6,506.85"}},{"$f":"SUMIF('F 7.1 Det bs AF'!$D$17:$D$204,$C18,'F 7.1 Det bs AF'!W$17:W$204)","v":{"v":1.2711666666666666,"d":"1.27"}},{"$f":"SUMIF('F 7.1 Det bs AF'!$D$17:$D$204,$C18,'F 7.1 Det bs AF'!X$17:X$204)","v":{"v":1.2711666666666666,"d":"1.27"}},{"$f":"SUMIF('F 7.1 Det bs AF'!$D$17:$D$204,$C18,'F 7.1 Det bs AF'!Y$17:Y$204)","v":{"v":1.2711666666666666,"d":"1.27"}},{"$f":"SUMIF('F 7.1 Det bs AF'!$D$17:$D$204,$C18,'F 7.1 Det bs AF'!Z$17:Z$204)","v":{"v":1.2711666666666666,"d":"1.27"}},{"$f":"SUMIF('F 7.1 Det bs AF'!$D$17:$D$204,$C18,'F 7.1 Det bs AF'!AA$17:AA$204)","v":{"v":1.2711666666666666,"d":"1.27"}},{"$f":"SUMIF('F 7.1 Det bs AF'!$D$17:$D$204,$C18,'F 7.1 Det bs AF'!AB$17:AB$204)","v":{"v":0,"d":"0.00"}},{"$f":"SUMIF('F 7.1 Det bs AF'!$D$17:$D$204,$C18,'F 7.1 Det bs AF'!AC$17:AC$204)","v":{"v":0,"d":"0.00"}},{"$f":"SUMIF('F 7.1 Det bs AF'!$D$17:$D$204,$C18,'F 7.1 Det bs AF'!AD$17:AD$204)","v":{"v":0,"d":"0.00"}},{"$f":"SUMIF('F 7.1 Det bs AF'!$D$17:$D$204,$C18,'F 7.1 Det bs AF'!AE$17:AE$204)","v":{"v":0,"d":"0.00"}},{"$f":"SUMIF('F 7.1 Det bs AF'!$D$17:$D$204,$C18,'F 7.1 Det bs AF'!AF$17:AF$204)","v":{"v":0,"d":"0.00"}},{"$f":"SUMIF('F 7.1 Det bs AF'!$D$17:$D$204,$C18,'F 7.1 Det bs AF'!AG$17:AG$204)","v":{"v":0,"d":"0.00"}},{"$f":"SUMIF('F 7.1 Det bs AF'!$D$17:$D$204,$C18,'F 7.1 Det bs AF'!AH$17:AH$204)","v":{"v":0,"d":"0.00"}},{"v":6.355833333333333,"d":"6.36"},{"v":6513.205833333333,"d":"6,513.21"},{"v":146.1841666666669,"d":"146.18"}]
[null,null,"336911",{"$f":"VLOOKUP(C19,TASAS!$C$6:$D$13,2,0)","v":"OTROS EQUIPOS"},{"$f":"SUMIF('F 7.1 Det bs AF'!$D$17:$D$204,$C19,'F 7.1 Det bs AF'!I$17:I$204)","v":{"v":87394.35,"d":"87,394.35"}},{"$f":"SUMIF('F 7.1 Det bs AF'!$D$17:$D$204,$C19,'F 7.1 Det bs AF'!J$17:J$204)","v":{"v":0,"d":"0.00"}},{"v":87394.35,"d":"87,394.35"},{"$f":"SUMIF('F 7.1 Det bs AF'!$D$17:$D$204,$C19,'F 7.1 Det bs AF'!V$17:V$204)","v":{"v":87241,"d":"87,241.00"}},{"$f":"SUMIF('F 7.1 Det bs AF'!$D$17:$D$204,$C19,'F 7.1 Det bs AF'!W$17:W$204)","v":{"v":13.120666666666667,"d":"13.12"}},{"$f":"SUMIF('F 7.1 Det bs AF'!$D$17:$D$204,$C19,'F 7.1 Det bs AF'!X$17:X$204)","v":{"v":13.120666666666667,"d":"13.12"}},{"$f":"SUMIF('F 7.1 Det bs AF'!$D$17:$D$204,$C19,'F 7.1 Det bs AF'!Y$17:Y$204)","v":{"v":13.120666666666667,"d":"13.12"}},{"$f":"SUMIF('F 7.1 Det bs AF'!$D$17:$D$204,$C19,'F 7.1 Det bs AF'!Z$17:Z$204)","v":{"v":13.120666666666667,"d":"13.12"}},{"$f":"SUMIF('F 7.1 Det bs AF'!$D$17:$D$204,$C19,'F 7.1 Det bs AF'!AA$17:AA$204)","v":{"v":13.120666666666667,"d":"13.12"}},{"$f":"SUMIF('F 7.1 Det bs AF'!$D$17:$D$204,$C19,'F 7.1 Det bs AF'!AB$17:AB$204)","v":{"v":0,"d":"0.00"}},{"$f":"SUMIF('F 7.1 Det bs AF'!$D$17:$D$204,$C19,'F 7.1 Det bs AF'!AC$17:AC$204)","v":{"v":0,"d":"0.00"}},{"$f":"SUMIF('F 7.1 Det bs AF'!$D$17:$D$204,$C19,'F 7.1 Det bs AF'!AD$17:AD$204)","v":{"v":0,"d":"0.00"}},{"$f":"SUMIF('F 7.1 Det bs AF'!$D$17:$D$204,$C19,'F 7.1 Det bs AF'!AE$17:AE$204)","v":{"v":0,"d":"0.00"}},{"$f":"SUMIF('F 7.1 Det bs AF'!$D$17:$D$204,$C19,'F 7.1 Det bs AF'!AF$17:AF$204)","v":{"v":0,"d":"0.00"}},{"$f":"SUMIF('F 7.1 Det bs AF'!$D$17:$D$204,$C19,'F 7.1 Det bs AF'!AG$17:AG$204)","v":{"v":0,"d":"0.00"}},{"$f":"SUMIF('F 7.1 Det bs AF'!$D$17:$D$204,$C19,'F 7.1 Det bs AF'!AH$17:AH$204)","v":{"v":0,"d":"0.00"}},{"v":65.60333333333334,"d":"65.60"},{"v":87306.60333333333,"d":"87,306.60"},{"v":87.74666666667326,"d":"87.75"}]
[null,null,"341211",{"$f":"VLOOKUP(C20,TASAS!$C$6:$D$13,2,0)","v":"LICENCIAS DE PROGRAMAS"},{"$f":"SUMIF('F 7.1 Det bs AF'!$D$17:$D$204,$C20,'F 7.1 Det bs AF'!I$17:I$204)","v":{"v":81561.84999999999,"d":"81,561.85"}},{"$f":"SUMIF('F 7.1 Det bs AF'!$D$17:$D$204,$C20,'F 7.1 Det bs AF'!J$17:J$204)","v":{"v":0,"d":"0.00"}},{"v":81561.84999999999,"d":"81,561.85"},{"$f":"SUMIF('F 7.1 Det bs AF'!$D$17:$D$204,$C20,'F 7.1 Det bs AF'!V$17:V$204)","v":{"v":80659.64,"d":"80,659.64"}},{"$f":"SUMIF('F 7.1 Det bs AF'!$D$17:$D$204,$C20,'F 7.1 Det bs AF'!W$17:W$204)","v":{"v":69.39999999999999,"d":"69.40"}},{"$f":"SUMIF('F 7.1 Det bs AF'!$D$17:$D$204,$C20,'F 7.1 Det bs AF'!X$17:X$204)","v":{"v":69.39999999999999,"d":"69.40"}},{"$f":"SUMIF('F 7.1 Det bs AF'!$D$17:$D$204,$C20,'F 7.1 Det bs AF'!Y$17:Y$204)","v":{"v":69.39999999999999,"d":"69.40"}},{"$f":"SUMIF('F 7.1 Det bs AF'!$D$17:$D$204,$C20,'F 7.1 Det bs AF'!Z$17:Z$204)","v":{"v":69.39999999999999,"d":"69.40"}},{"$f":"SUMIF('F 7.1 Det bs AF'!$D$17:$D$204,$C20,'F 7.1 Det bs AF'!AA$17:AA$204)","v":{"v":69.39999999999999,"d":"69.40"}},{"$f":"SUMIF('F 7.1 Det bs AF'!$D$17:$D$204,$C20,'F 7.1 Det bs AF'!AB$17:AB$204)","v":{"v":0,"d":"0.00"}},{"$f":"SUMIF('F 7.1 Det bs AF'!$D$17:$D$204,$C20,'F 7.1 Det bs AF'!AC$17:AC$204)","v":{"v":0,"d":"0.00"}},{"$f":"SUMIF('F 7.1 Det bs AF'!$D$17:$D$204,$C20,'F 7.1 Det bs AF'!AD$17:AD$204)","v":{"v":0,"d":"0.00"}},{"$f":"SUMIF('F 7.1 Det bs AF'!$D$17:$D$204,$C20,'F 7.1 Det bs AF'!AE$17:AE$204)","v":{"v":0,"d":"0.00"}},{"$f":"SUMIF('F 7.1 Det bs AF'!$D$17:$D$204,$C20,'F 7.1 Det bs AF'!AF$17:AF$204)","v":{"v":0,"d":"0.00"}},{"$f":"SUMIF('F 7.1 Det bs AF'!$D$17:$D$204,$C20,'F 7.1 Det bs AF'!AG$17:AG$204)","v":{"v":0,"d":"0.00"}},{"$f":"SUMIF('F 7.1 Det bs AF'!$D$17:$D$204,$C20,'F 7.1 Det bs AF'!AH$17:AH$204)","v":{"v":0,"d":"0.00"}},{"v":346.99999999999994,"d":"347.00"},{"v":81006.64,"d":"81,006.64"},{"v":555.2099999999919,"d":"555.21"}]
[null,null,"349111",{"$f":"VLOOKUP(C21,TASAS!$C$6:$D$13,2,0)","v":"OTROS ACTIVOS INTANGIBLES"},{"$f":"SUMIF('F 7.1 Det bs AF'!$D$17:$D$204,$C21,'F 7.1 Det bs AF'!I$17:I$204)","v":{"v":48580.11,"d":"48,580.11"}},{"$f":"SUMIF('F 7.1 Det bs AF'!$D$17:$D$204,$C21,'F 7.1 Det bs AF'!J$17:J$204)","v":{"v":0,"d":"0.00"}},{"v":48580.11,"d":"48,580.11"},{"$f":"SUMIF('F 7.1 Det bs AF'!$D$17:$D$204,$C21,'F 7.1 Det bs AF'!V$17:V$204)","v":{"v":48580.11,"d":"48,580.11"}},{"$f":"SUMIF('F 7.1 Det bs AF'!$D$17:$D$204,$C21,'F 7.1 Det bs AF'!W$17:W$204)","v":{"v":0,"d":"0.00"}},{"$f":"SUMIF('F 7.1 Det bs AF'!$D$17:$D$204,$C21,'F 7.1 Det bs AF'!X$17:X$204)","v":{"v":0,"d":"0.00"}},{"$f":"SUMIF('F 7.1 Det bs AF'!$D$17:$D$204,$C21,'F 7.1 Det bs AF'!Y$17:Y$204)","v":{"v":0,"d":"0.00"}},{"$f":"SUMIF('F 7.1 Det bs AF'!$D$17:$D$204,$C21,'F 7.1 Det bs AF'!Z$17:Z$204)","v":{"v":0,"d":"0.00"}},{"$f":"SUMIF('F 7.1 Det bs AF'!$D$17:$D$204,$C21,'F 7.1 Det bs AF'!AA$17:AA$204)","v":{"v":0,"d":"0.00"}},{"$f":"SUMIF('F 7.1 Det bs AF'!$D$17:$D$204,$C21,'F 7.1 Det bs AF'!AB$17:AB$204)","v":{"v":0,"d":"0.00"}},{"$f":"SUMIF('F 7.1 Det bs AF'!$D$17:$D$204,$C21,'F 7.1 Det bs AF'!AC$17:AC$204)","v":{"v":0,"d":"0.00"}},{"$f":"SUMIF('F 7.1 Det bs AF'!$D$17:$D$204,$C21,'F 7.1 Det bs AF'!AD$17:AD$204)","v":{"v":0,"d":"0.00"}},{"$f":"SUMIF('F 7.1 Det bs AF'!$D$17:$D$204,$C21,'F 7.1 Det bs AF'!AE$17:AE$204)","v":{"v":0,"d":"0.00"}},{"$f":"SUMIF('F 7.1 Det bs AF'!$D$17:$D$204,$C21,'F 7.1 Det bs AF'!AF$17:AF$204)","v":{"v":0,"d":"0.00"}},{"$f":"SUMIF('F 7.1 Det bs AF'!$D$17:$D$204,$C21,'F 7.1 Det bs AF'!AG$17:AG$204)","v":{"v":0,"d":"0.00"}},{"$f":"SUMIF('F 7.1 Det bs AF'!$D$17:$D$204,$C21,'F 7.1 Det bs AF'!AH$17:AH$204)","v":{"v":0,"d":"0.00"}},{"v":0,"d":"0.00"},{"v":48580.11,"d":"48,580.11"},{"v":0,"d":"0.00"}]
[]
[null,null,"TOTAL",null,{"$f":"SUM(E14:E22)","v":{"v":400001.7499999999,"d":"400,001.75"}},{"$f":"SUM(F14:F22)","v":{"v":16889.89,"d":"16,889.89"}},{"v":416891.6399999999,"d":"416,891.64"},{"v":360392.18000000005,"d":"360,392.18"},{"v":1253.394125,"d":"1,253.39"},{"v":1251.8004583333334,"d":"1,251.80"},{"v":1227.0666666666666,"d":"1,227.07"},{"v":1227.06375,"d":"1,227.06"},{"v":1227.06375,"d":"1,227.06"},{"v":0,"d":"0.00"},{"v":0,"d":"0.00"},{"v":0,"d":"0.00"},{"v":0,"d":"0.00"},{"v":0,"d":"0.00"},{"v":0,"d":"0.00"},{"v":0,"d":"0.00"},{"v":6186.38875,"d":"6,186.39"},{"v":366578.56875000003,"d":"366,578.57"},{"v":50313.071249999906,"d":"50,313.07"}]

{"sheet":"DO_HT","index":3,"n_rows":15,"n_cols":8,"rows_kept":15,"hidden":true}
[]
[]
[null,null,"FECHA","AÑO MES",null,"Etiquetas de fila",null,{"$f":"\"CUADRO DE ACTIVOS Y DEPRECIACION AL \"&TEXT(F4,\"DD/MM/\")&YEAR(F4)","v":"CUADRO DE ACTIVOS Y DEPRECIACION AL 31/05/2020"}]
[null,null,{"$f":"DATE(YEAR(TODAY()),ROWS(C$3:C4),0)","v":"2020-01-31"},{"$f":"YEAR(C4)&\" • \"&TEXT(C4,\"MM MMM\")","v":"2020 • 01 Ene"},null,"2020-05-31"]
[null,null,{"$f":"DATE(YEAR(TODAY()),ROWS(C$3:C5),0)","v":"2020-02-29"},"2020 • 02 Feb"]
[null,null,{"$f":"DATE(YEAR(TODAY()),ROWS(C$3:C6),0)","v":"2020-03-31"},"2020 • 03 Mar"]
[null,null,{"$f":"DATE(YEAR(TODAY()),ROWS(C$3:C7),0)","v":"2020-04-30"},"2020 • 04 Abr"]
[null,null,{"$f":"DATE(YEAR(TODAY()),ROWS(C$3:C8),0)","v":"2020-05-31"},"2020 • 05 May"]
[null,null,{"$f":"DATE(YEAR(TODAY()),ROWS(C$3:C9),0)","v":"2020-06-30"},"2020 • 06 Jun"]
[null,null,{"$f":"DATE(YEAR(TODAY()),ROWS(C$3:C10),0)","v":"2020-07-31"},"2020 • 07 Jul"]
[null,null,{"$f":"DATE(YEAR(TODAY()),ROWS(C$3:C11),0)","v":"2020-08-31"},"2020 • 08 Ago"]
[null,null,{"$f":"DATE(YEAR(TODAY()),ROWS(C$3:C12),0)","v":"2020-09-30"},"2020 • 09 Set"]
[null,null,{"$f":"DATE(YEAR(TODAY()),ROWS(C$3:C13),0)","v":"2020-10-31"},"2020 • 10 Oct"]
[null,null,{"$f":"DATE(YEAR(TODAY()),ROWS(C$3:C14),0)","v":"2020-11-30"},"2020 • 11 Nov"]
[null,null,{"$f":"DATE(YEAR(TODAY()),ROWS(C$3:C15),0)","v":"2020-12-31"},"2020 • 12 Dic"]