{"text_format":"3","workbook":"xlsx","n_sheets":4,"sheets":["DO_HT","DO_EERR","DATA","EERR DINAMICO"],"not_rendered":{"macros":1,"defined_names":3,"pivot_tables":1},"read":"whole","date_system":"1900"}

{"sheet":"DO_HT","index":0,"n_rows":10,"n_cols":7,"rows_kept":10,"hidden":true}
[]
[]
[]
[]
[]
[null,null,"Grupo","Numero","Abreviatura",null,"Etiquetas de fila"]
[null,null,"Bimestral",2,"Bim.",null,6]
[null,null,"Trimestral",3,"Trim."]
[null,null,"Cuatrimestral",4,"Cuat."]
[null,null,"Semestral",6,"Sem."]

{"sheet":"DO_EERR","index":1,"n_rows":115,"n_cols":16,"rows_kept":115,"hidden":true}
[]
[]
[]
[]
[]
[null,null,{"$f":"IF(COLUMNS($C$6:C$6)<=12/DO_EERR!$N$6,COLUMNS($C$6:C$6),\"\")","v":1},{"$f":"IF(COLUMNS($C$6:D$6)<=12/DO_EERR!$N$6,COLUMNS($C$6:D$6),\"\")","v":2},{"$f":"IF(COLUMNS($C$6:E$6)<=12/DO_EERR!$N$6,COLUMNS($C$6:E$6),\"\")","v":""},{"$f":"IF(COLUMNS($C$6:F$6)<=12/DO_EERR!$N$6,COLUMNS($C$6:F$6),\"\")","v":""},{"$f":"IF(COLUMNS($C$6:G$6)<=12/DO_EERR!$N$6,COLUMNS($C$6:G$6),\"\")","v":""},{"$f":"IF(COLUMNS($C$6:H$6)<=12/DO_EERR!$N$6,COLUMNS($C$6:H$6),\"\")","v":""},{"$nulls":5},{"$f":"DO_HT!G7","v":6}]
[null,null,{"$f":"IF(C6=\"\",\"\",VLOOKUP(DO_EERR!$N$6,DO_HT!$D$7:$E$10,2,0)&\" \"&C$6)","v":"Sem. 1"},{"$f":"IF(D6=\"\",\"\",VLOOKUP(DO_EERR!$N$6,DO_HT!$D$7:$E$10,2,0)&\" \"&D$6)","v":"Sem. 2"},{"$f":"IF(E6=\"\",\"\",VLOOKUP(DO_EERR!$N$6,DO_HT!$D$7:$E$10,2,0)&\" \"&E$6)","v":""},{"$f":"IF(F6=\"\",\"\",VLOOKUP(DO_EERR!$N$6,DO_HT!$D$7:$E$10,2,0)&\" \"&F$6)","v":""},{"$f":"IF(G6=\"\",\"\",VLOOKUP(DO_EERR!$N$6,DO_HT!$D$7:$E$10,2,0)&\" \"&G$6)","v":""},{"$f":"IF(H6=\"\",\"\",VLOOKUP(DO_EERR!$N$6,DO_HT!$D$7:$E$10,2,0)&\" \"&H$6)","v":""},{"$nulls":4},"Fecha","Agrupación","Rubro","Importe S/"]
[null,null,{"$f":"SUMIFS(DO_EERR!$P$8:$P$115,DO_EERR!$O$8:$O$115,'EERR DINAMICO'!$E9,DO_EERR!$N$8:$N$115,C$6)","v":{"v":-2264906.29,"d":"2,264,906"}},{"$f":"SUMIFS(DO_EERR!$P$8:$P$115,DO_EERR!$O$8:$O$115,'EERR DINAMICO'!$E9,DO_EERR!$N$8:$N$115,D$6)","v":{"v":-2104200.21,"d":"2,104,200"}},{"$f":"SUMIFS(DO_EERR!$P$8:$P$115,DO_EERR!$O$8:$O$115,'EERR DINAMICO'!$E9,DO_EERR!$N$8:$N$115,E$6)","v":0},{"$f":"SUMIFS(DO_EERR!$P$8:$P$115,DO_EERR!$O$8:$O$115,'EERR DINAMICO'!$E9,DO_EERR!$N$8:$N$115,F$6)","v":0},{"$f":"SUMIFS(DO_EERR!$P$8:$P$115,DO_EERR!$O$8:$O$115,'EERR DINAMICO'!$E9,DO_EERR!$N$8:$N$115,G$6)","v":0},{"$f":"SUMIFS(DO_EERR!$P$8:$P$115,DO_EERR!$O$8:$O$115,'EERR DINAMICO'!$E9,DO_EERR!$N$8:$N$115,H$6)","v":0},{"$nulls":4},"2019-01-31",{"$f":"ROUNDUP(MONTH(M8)/N$6,0)","v":1},"Gastos de Personal, Directores y Gerentes",{"v":91387.32999999999,"d":"91,387.33"}]
[null,null,{"$f":"SUMIFS(DO_EERR!$P$8:$P$115,DO_EERR!$O$8:$O$115,'EERR DINAMICO'!$E10,DO_EERR!$N$8:$N$115,C$6)","v":{"v":1138146.78,"d":"-1,138,147"}},{"$f":"SUMIFS(DO_EERR!$P$8:$P$115,DO_EERR!$O$8:$O$115,'EERR DINAMICO'!$E10,DO_EERR!$N$8:$N$115,D$6)","v":{"v":1057389.7999999998,"d":"-1,057,390"}},{"$f":"SUMIFS(DO_EERR!$P$8:$P$115,DO_EERR!$O$8:$O$115,'EERR DINAMICO'!$E10,DO_EERR!$N$8:$N$115,E$6)","v":0},{"$f":"SUMIFS(DO_EERR!$P$8:$P$115,DO_EERR!$O$8:$O$115,'EERR DINAMICO'!$E10,DO_EERR!$N$8:$N$115,F$6)","v":0},{"$f":"SUMIFS(DO_EERR!$P$8:$P$115,DO_EERR!$O$8:$O$115,'EERR DINAMICO'!$E10,DO_EERR!$N$8:$N$115,G$6)","v":0},{"$f":"SUMIFS(DO_EERR!$P$8:$P$115,DO_EERR!$O$8:$O$115,'EERR DINAMICO'!$E10,DO_EERR!$N$8:$N$115,H$6)","v":0},{"$nulls":4},"2019-01-31",1,"Gastos de Servicios Prestados por Terceros",{"v":208555.77,"d":"208,555.77"}]
[null,null,{"$f":"SUMIFS(DO_EERR!$P$8:$P$115,DO_EERR!$O$8:$O$115,'EERR DINAMICO'!$E11,DO_EERR!$N$8:$N$115,C$6)","v":{"v":498726.0299999999,"d":"-498,726"}},{"$f":"SUMIFS(DO_EERR!$P$8:$P$115,DO_EERR!$O$8:$O$115,'EERR DINAMICO'!$E11,DO_EERR!$N$8:$N$115,D$6)","v":{"v":463338.97,"d":"-463,339"}},{"$f":"SUMIFS(DO_EERR!$P$8:$P$115,DO_EERR!$O$8:$O$115,'EERR DINAMICO'!$E11,DO_EERR!$N$8:$N$115,E$6)","v":0},{"$f":"SUMIFS(DO_EERR!$P$8:$P$115,DO_EERR!$O$8:$O$115,'EERR DINAMICO'!$E11,DO_EERR!$N$8:$N$115,F$6)","v":0},{"$f":"SUMIFS(DO_EERR!$P$8:$P$115,DO_EERR!$O$8:$O$115,'EERR DINAMICO'!$E11,DO_EERR!$N$8:$N$115,G$6)","v":0},{"$f":"SUMIFS(DO_EERR!$P$8:$P$115,DO_EERR!$O$8:$O$115,'EERR DINAMICO'!$E11,DO_EERR!$N$8:$N$115,H$6)","v":0},{"$nulls":4},"2019-01-31",1,"Gastos Financieros",{"v":26505.41,"d":"26,505.41"}]
[null,null,{"$f":"SUMIFS(DO_EERR!$P$8:$P$115,DO_EERR!$O$8:$O$115,'EERR DINAMICO'!$E12,DO_EERR!$N$8:$N$115,C$6)","v":{"v":2439.7999999999997,"d":"-2,440"}},{"$f":"SUMIFS(DO_EERR!$P$8:$P$115,DO_EERR!$O$8:$O$115,'EERR DINAMICO'!$E12,DO_EERR!$N$8:$N$115,D$6)","v":{"v":2266.7,"d":"-2,267"}},{"$f":"SUMIFS(DO_EERR!$P$8:$P$115,DO_EERR!$O$8:$O$115,'EERR DINAMICO'!$E12,DO_EERR!$N$8:$N$115,E$6)","v":0},{"$f":"SUMIFS(DO_EERR!$P$8:$P$115,DO_EERR!$O$8:$O$115,'EERR DINAMICO'!$E12,DO_EERR!$N$8:$N$115,F$6)","v":0},{"$f":"SUMIFS(DO_EERR!$P$8:$P$115,DO_EERR!$O$8:$O$115,'EERR DINAMICO'!$E12,DO_EERR!$N$8:$N$115,G$6)","v":0},{"$f":"SUMIFS(DO_EERR!$P$8:$P$115,DO_EERR!$O$8:$O$115,'EERR DINAMICO'!$E12,DO_EERR!$N$8:$N$115,H$6)","v":0},{"$nulls":4},"2019-01-31",1,"Gastos por Tributos",{"v":447.08000000000004,"d":"447.08"}]
[null,null,{"$f":"SUMIFS(DO_EERR!$P$8:$P$115,DO_EERR!$O$8:$O$115,'EERR DINAMICO'!$E13,DO_EERR!$N$8:$N$115,C$6)","v":{"v":53383.55,"d":"-53,384"}},{"$f":"SUMIFS(DO_EERR!$P$8:$P$115,DO_EERR!$O$8:$O$115,'EERR DINAMICO'!$E13,DO_EERR!$N$8:$N$115,D$6)","v":{"v":49595.76000000001,"d":"-49,596"}},{"$f":"SUMIFS(DO_EERR!$P$8:$P$115,DO_EERR!$O$8:$O$115,'EERR DINAMICO'!$E13,DO_EERR!$N$8:$N$115,E$6)","v":0},{"$f":"SUMIFS(DO_EERR!$P$8:$P$115,DO_EERR!$O$8:$O$115,'EERR DINAMICO'!$E13,DO_EERR!$N$8:$N$115,F$6)","v":0},{"$f":"SUMIFS(DO_EERR!$P$8:$P$115,DO_EERR!$O$8:$O$115,'EERR DINAMICO'!$E13,DO_EERR!$N$8:$N$115,G$6)","v":0},{"$f":"SUMIFS(DO_EERR!$P$8:$P$115,DO_EERR!$O$8:$O$115,'EERR DINAMICO'!$E13,DO_EERR!$N$8:$N$115,H$6)","v":0},{"$nulls":4},"2019-01-31",1,"Ingresos Financieros",{"v":-23515.77,"d":"-23,515.77 "}]
[null,null,{"$f":"SUMIFS(DO_EERR!$P$8:$P$115,DO_EERR!$O$8:$O$115,'EERR DINAMICO'!$E14,DO_EERR!$N$8:$N$115,C$6)","v":{"v":117541.18,"d":"-117,541"}},{"$f":"SUMIFS(DO_EERR!$P$8:$P$115,DO_EERR!$O$8:$O$115,'EERR DINAMICO'!$E14,DO_EERR!$N$8:$N$115,D$6)","v":{"v":109201.03,"d":"-109,201"}},{"$f":"SUMIFS(DO_EERR!$P$8:$P$115,DO_EERR!$O$8:$O$115,'EERR DINAMICO'!$E14,DO_EERR!$N$8:$N$115,E$6)","v":0},{"$f":"SUMIFS(DO_EERR!$P$8:$P$115,DO_EERR!$O$8:$O$115,'EERR DINAMICO'!$E14,DO_EERR!$N$8:$N$115,F$6)","v":0},{"$f":"SUMIFS(DO_EERR!$P$8:$P$115,DO_EERR!$O$8:$O$115,'EERR DINAMICO'!$E14,DO_EERR!$N$8:$N$115,G$6)","v":0},{"$f":"SUMIFS(DO_EERR!$P$8:$P$115,DO_EERR!$O$8:$O$115,'EERR DINAMICO'!$E14,DO_EERR!$N$8:$N$115,H$6)","v":0},{"$nulls":4},"2019-01-31",1,"Otros Gastos de Gestion",{"v":9782.08,"d":"9,782.08"}]
[null,null,{"$f":"SUMIFS(DO_EERR!$P$8:$P$115,DO_EERR!$O$8:$O$115,'EERR DINAMICO'!$E15,DO_EERR!$N$8:$N$115,C$6)","v":{"v":-20177.829999999998,"d":"20,178"}},{"$f":"SUMIFS(DO_EERR!$P$8:$P$115,DO_EERR!$O$8:$O$115,'EERR DINAMICO'!$E15,DO_EERR!$N$8:$N$115,D$6)","v":{"v":-18746.13,"d":"18,746"}},{"$f":"SUMIFS(DO_EERR!$P$8:$P$115,DO_EERR!$O$8:$O$115,'EERR DINAMICO'!$E15,DO_EERR!$N$8:$N$115,E$6)","v":0},{"$f":"SUMIFS(DO_EERR!$P$8:$P$115,DO_EERR!$O$8:$O$115,'EERR DINAMICO'!$E15,DO_EERR!$N$8:$N$115,F$6)","v":0},{"$f":"SUMIFS(DO_EERR!$P$8:$P$115,DO_EERR!$O$8:$O$115,'EERR DINAMICO'!$E15,DO_EERR!$N$8:$N$115,G$6)","v":0},{"$f":"SUMIFS(DO_EERR!$P$8:$P$115,DO_EERR!$O$8:$O$115,'EERR DINAMICO'!$E15,DO_EERR!$N$8:$N$115,H$6)","v":0},{"$nulls":4},"2019-01-31",1,"Otros Ingresos de Gestión",{"v":-3697.42,"d":"-3,697.42 "}]
[null,null,{"$f":"SUMIFS(DO_EERR!$P$8:$P$115,DO_EERR!$O$8:$O$115,'EERR DINAMICO'!$E16,DO_EERR!$N$8:$N$115,C$6)","v":{"v":-128332.06000000001,"d":"128,332"}},{"$f":"SUMIFS(DO_EERR!$P$8:$P$115,DO_EERR!$O$8:$O$115,'EERR DINAMICO'!$E16,DO_EERR!$N$8:$N$115,D$6)","v":{"v":-119226.29,"d":"119,226"}},{"$f":"SUMIFS(DO_EERR!$P$8:$P$115,DO_EERR!$O$8:$O$115,'EERR DINAMICO'!$E16,DO_EERR!$N$8:$N$115,E$6)","v":0},{"$f":"SUMIFS(DO_EERR!$P$8:$P$115,DO_EERR!$O$8:$O$115,'EERR DINAMICO'!$E16,DO_EERR!$N$8:$N$115,F$6)","v":0},{"$f":"SUMIFS(DO_EERR!$P$8:$P$115,DO_EERR!$O$8:$O$115,'EERR DINAMICO'!$E16,DO_EERR!$N$8:$N$115,G$6)","v":0},{"$f":"SUMIFS(DO_EERR!$P$8:$P$115,DO_EERR!$O$8:$O$115,'EERR DINAMICO'!$E16,DO_EERR!$N$8:$N$115,H$6)","v":0},{"$nulls":4},"2019-01-31",1,"Valuación y Deterioro de Activos y Provisiones",{"v":21538.43,"d":"21,538.43"}]
[null,null,{"$f":"SUMIFS(DO_EERR!$P$8:$P$115,DO_EERR!$O$8:$O$115,'EERR DINAMICO'!$E17,DO_EERR!$N$8:$N$115,C$6)","v":{"v":144647.37,"d":"-144,647"}},{"$f":"SUMIFS(DO_EERR!$P$8:$P$115,DO_EERR!$O$8:$O$115,'EERR DINAMICO'!$E17,DO_EERR!$N$8:$N$115,D$6)","v":{"v":134383.96,"d":"-134,384"}},{"$f":"SUMIFS(DO_EERR!$P$8:$P$115,DO_EERR!$O$8:$O$115,'EERR DINAMICO'!$E17,DO_EERR!$N$8:$N$115,E$6)","v":0},{"$f":"SUMIFS(DO_EERR!$P$8:$P$115,DO_EERR!$O$8:$O$115,'EERR DINAMICO'!$E17,DO_EERR!$N$8:$N$115,F$6)","v":0},{"$f":"SUMIFS(DO_EERR!$P$8:$P$115,DO_EERR!$O$8:$O$115,'EERR DINAMICO'!$E17,DO_EERR!$N$8:$N$115,G$6)","v":0},{"$f":"SUMIFS(DO_EERR!$P$8:$P$115,DO_EERR!$O$8:$O$115,'EERR DINAMICO'!$E17,DO_EERR!$N$8:$N$115,H$6)","v":0},{"$nulls":4},"2019-01-31",1,"Ventas",{"v":-415024.88,"d":"-415,024.88 "}]
[null,null,{"$f":"SUM(C8:C16)","v":{"v":-458531.4700000001,"d":"458,531"}},{"v":-425996.41000000027,"d":"425,996"},0,0,0,0,{"$nulls":4},"2019-02-28",1,"Gastos de Personal, Directores y Gerentes",{"v":59984.28,"d":"59,984.28"}]
[{"$nulls":12},"2019-02-28",1,"Gastos de Servicios Prestados por Terceros",{"v":136890.62000000002,"d":"136,890.62"}]
[{"$nulls":12},"2019-02-28",1,"Gastos Financieros",{"v":17397.46,"d":"17,397.46"}]
[{"$nulls":12},"2019-02-28",1,"Gastos por Tributos",293.44]
[{"$nulls":12},"2019-02-28",1,"Ingresos Financieros",{"v":-15435.140000000001,"d":"-15,435.14 "}]
[{"$nulls":12},"2019-02-28",1,"Otros Gastos de Gestion",{"v":6420.709999999999,"d":"6,420.71"}]
[{"$nulls":12},"2019-02-28",1,"Otros Ingresos de Gestión",{"v":-2426.89,"d":"-2,426.89 "}]
[{"$nulls":12},"2019-02-28",1,"Valuación y Deterioro de Activos y Provisiones",{"v":14137.27,"d":"14,137.27"}]
[{"$nulls":12},"2019-02-28",1,"Ventas",{"v":-272411.67,"d":"-272,411.67 "}]
[{"$nulls":12},"2019-03-31",1,"Gastos de Personal, Directores y Gerentes",{"v":96554.82999999999,"d":"96,554.83"}]
[{"$nulls":12},"2019-03-31",1,"Gastos de Servicios Prestados por Terceros",{"v":220348.56,"d":"220,348.56"}]
[{"$nulls":12},"2019-03-31",1,"Gastos Financieros",{"v":28004.149999999998,"d":"28,004.15"}]
[{"$nulls":12},"2019-03-31",1,"Gastos por Tributos",{"v":472.34999999999997,"d":"472.35"}]
[{"$nulls":12},"2019-03-31",1,"Ingresos Financieros",{"v":-24845.460000000003,"d":"-24,845.46 "}]
[{"$nulls":12},"2019-03-31",1,"Otros Gastos de Gestion",{"v":10335.210000000001,"d":"10,335.21"}]
[{"$nulls":12},"2019-03-31",1,"Otros Ingresos de Gestión",{"v":-3906.4900000000002,"d":"-3,906.49 "}]
[{"$nulls":12},"2019-03-31",1,"Valuación y Deterioro de Activos y Provisiones",{"v":22756.319999999996,"d":"22,756.32"}]
[{"$nulls":12},"2019-03-31",1,"Ventas",{"v":-438492.49,"d":"-438,492.49 "}]
[{"$nulls":12},"2019-04-30",1,"Gastos de Personal, Directores y Gerentes",{"v":83921.18999999999,"d":"83,921.19"}]
[{"$nulls":12},"2019-04-30",1,"Gastos de Servicios Prestados por Terceros",{"v":191517.24000000002,"d":"191,517.24"}]
[{"$nulls":12},"2019-04-30",1,"Gastos Financieros",{"v":24339.98,"d":"24,339.98"}]
[{"$nulls":12},"2019-04-30",1,"Gastos por Tributos",410.55]
[{"$nulls":12},"2019-04-30",1,"Ingresos Financieros",{"v":-21594.58,"d":"-21,594.58 "}]
[{"$nulls":12},"2019-04-30",{"$f":"ROUNDUP(MONTH(M40)/N$6,0)","v":1},"Otros Gastos de Gestion",{"v":8982.900000000001,"d":"8,982.90"}]
[{"$nulls":12},"2019-04-30",1,"Otros Ingresos de Gestión",{"v":-3395.34,"d":"-3,395.34 "}]
[{"$nulls":12},"2019-04-30",1,"Valuación y Deterioro de Activos y Provisiones",{"v":19778.780000000002,"d":"19,778.78"}]
[{"$nulls":12},"2019-04-30",1,"Ventas",{"v":-381118.35,"d":"-381,118.35 "}]
[{"$nulls":12},"2019-05-31",1,"Gastos de Personal, Directores y Gerentes",{"v":107739.79999999997,"d":"107,739.80"}]
[{"$nulls":12},"2019-05-31",1,"Gastos de Servicios Prestados por Terceros",{"v":245873.87999999998,"d":"245,873.88"}]
[{"$nulls":12},"2019-05-31",1,"Gastos Financieros",{"v":31248.18,"d":"31,248.18"}]
[{"$nulls":12},"2019-05-31",1,"Gastos por Tributos",527.07]
[{"$nulls":12},"2019-05-31",1,"Ingresos Financieros",{"v":-27723.579999999998,"d":"-27,723.58 "}]
[{"$nulls":12},"2019-05-31",1,"Otros Gastos de Gestion",{"v":11532.460000000001,"d":"11,532.46"}]
[{"$nulls":12},"2019-05-31",1,"Otros Ingresos de Gestión",{"v":-4359.0199999999995,"d":"-4,359.02 "}]
[{"$nulls":12},"2019-05-31",1,"Valuación y Deterioro de Activos y Provisiones",{"v":25392.42,"d":"25,392.42"}]
[{"$nulls":12},"2019-05-31",1,"Ventas",{"v":-489287.77999999997,"d":"-489,287.78 "}]
[{"$nulls":12},"2019-06-30",1,"Gastos de Personal, Directores y Gerentes",{"v":59138.6,"d":"59,138.60"}]
[{"$nulls":12},"2019-06-30",1,"Gastos de Servicios Prestados por Terceros",{"v":134960.71000000002,"d":"134,960.71"}]
[{"$nulls":12},"2019-06-30",1,"Gastos Financieros",{"v":17152.19,"d":"17,152.19"}]
[{"$nulls":12},"2019-06-30",1,"Gastos por Tributos",289.31]
[{"$nulls":12},"2019-06-30",1,"Ingresos Financieros",{"v":-15217.53,"d":"-15,217.53 "}]
[{"$nulls":12},"2019-06-30",1,"Otros Gastos de Gestion",{"v":6330.19,"d":"6,330.19"}]
[{"$nulls":12},"2019-06-30",1,"Otros Ingresos de Gestión",{"v":-2392.6699999999996,"d":"-2,392.67 "}]
[{"$nulls":12},"2019-06-30",1,"Valuación y Deterioro de Activos y Provisiones",{"v":13937.960000000001,"d":"13,937.96"}]
[{"$nulls":12},"2019-06-30",1,"Ventas",{"v":-268571.12,"d":"-268,571.12 "}]
[{"$nulls":12},"2019-07-31",2,"Gastos de Personal, Directores y Gerentes",{"v":60645.31000000001,"d":"60,645.31"}]
[{"$nulls":12},"2019-07-31",2,"Gastos de Servicios Prestados por Terceros",{"v":138399.17,"d":"138,399.17"}]
[{"$nulls":12},"2019-07-31",2,"Gastos Financieros",{"v":17589.19,"d":"17,589.19"}]
[{"$nulls":12},"2019-07-31",2,"Gastos por Tributos",296.68]
[{"$nulls":12},"2019-07-31",2,"Ingresos Financieros",{"v":-15605.240000000002,"d":"-15,605.24 "}]
[{"$nulls":12},"2019-07-31",2,"Otros Gastos de Gestion",{"v":6491.47,"d":"6,491.47"}]
[{"$nulls":12},"2019-07-31",2,"Otros Ingresos de Gestión",{"v":-2453.64,"d":"-2,453.64 "}]
[{"$nulls":12},"2019-07-31",2,"Valuación y Deterioro de Activos y Provisiones",{"v":14293.06,"d":"14,293.06"}]
[{"$nulls":12},"2019-07-31",2,"Ventas",{"v":-275413.62,"d":"-275,413.62 "}]
[{"$nulls":12},"2019-08-31",2,"Gastos de Personal, Directores y Gerentes",{"v":86145.26999999999,"d":"86,145.27"}]
[{"$nulls":12},"2019-08-31",{"$f":"ROUNDUP(MONTH(M72)/N$6,0)","v":2},"Gastos de Servicios Prestados por Terceros",{"v":196592.84,"d":"196,592.84"}]
[{"$nulls":12},"2019-08-31",2,"Gastos Financieros",{"v":24985.04,"d":"24,985.04"}]
[{"$nulls":12},"2019-08-31",2,"Gastos por Tributos",421.43]
[{"$nulls":12},"2019-08-31",2,"Ingresos Financieros",{"v":-22166.879999999997,"d":"-22,166.88 "}]
[{"$nulls":12},"2019-08-31",2,"Otros Gastos de Gestion",{"v":9220.99,"d":"9,220.99"}]
[{"$nulls":12},"2019-08-31",2,"Otros Ingresos de Gestión",{"v":-3485.3300000000004,"d":"-3,485.33 "}]
[{"$nulls":12},"2019-08-31",2,"Valuación y Deterioro de Activos y Provisiones",{"v":20302.95,"d":"20,302.95"}]
[{"$nulls":12},"2019-08-31",2,"Ventas",{"v":-391218.77,"d":"-391,218.77 "}]
[{"$nulls":12},"2019-09-30",2,"Gastos de Personal, Directores y Gerentes",{"v":107544.06999999998,"d":"107,544.07"}]
{"$rows_left_out":36}
{"sheet":"DATA","index":2,"n_rows":114,"n_cols":5,"rows_kept":114}
[null,"Estado de resultados comparativo • dinámico"]
[null,"MOS Expert CPC Martín Cruz • +51 998 401 784 | Excel No Convencional"]
[]
[]
[]
[null,null,"Fecha","Rubro","Importe S/"]
[null,null,"2019-01-31","Gastos de Personal, Directores y Gerentes",91387.32999999999]
[null,null,"2019-01-31","Gastos de Servicios Prestados por Terceros",208555.77]
[null,null,"2019-01-31","Gastos Financieros",26505.41]
[null,null,"2019-01-31","Gastos por Tributos",447.08000000000004]
[null,null,"2019-01-31","Ingresos Financieros",-23515.77]
[null,null,"2019-01-31","Otros Gastos de Gestion",9782.08]
[null,null,"2019-01-31","Otros Ingresos de Gestión",-3697.42]
[null,null,"2019-01-31","Valuación y Deterioro de Activos y Provisiones",21538.43]
[null,null,"2019-01-31","Ventas",-415024.88]
[null,null,"2019-02-28","Gastos de Personal, Directores y Gerentes",59984.28]
[null,null,"2019-02-28","Gastos de Servicios Prestados por Terceros",136890.62000000002]
[null,null,"2019-02-28","Gastos Financieros",17397.46]
[null,null,"2019-02-28","Gastos por Tributos",293.44]
[null,null,"2019-02-28","Ingresos Financieros",-15435.140000000001]
[null,null,"2019-02-28","Otros Gastos de Gestion",6420.709999999999]
[null,null,"2019-02-28","Otros Ingresos de Gestión",-2426.89]
[null,null,"2019-02-28","Valuación y Deterioro de Activos y Provisiones",14137.27]
[null,null,"2019-02-28","Ventas",-272411.67]
[null,null,"2019-03-31","Gastos de Personal, Directores y Gerentes",96554.82999999999]
[null,null,"2019-03-31","Gastos de Servicios Prestados por Terceros",220348.56]
[null,null,"2019-03-31","Gastos Financieros",28004.149999999998]
[null,null,"2019-03-31","Gastos por Tributos",472.34999999999997]
[null,null,"2019-03-31","Ingresos Financieros",-24845.460000000003]
[null,null,"2019-03-31","Otros Gastos de Gestion",10335.210000000001]
[null,null,"2019-03-31","Otros Ingresos de Gestión",-3906.4900000000002]
[null,null,"2019-03-31","Valuación y Deterioro de Activos y Provisiones",22756.319999999996]
[null,null,"2019-03-31","Ventas",-438492.49]
[null,null,"2019-04-30","Gastos de Personal, Directores y Gerentes",83921.18999999999]
[null,null,"2019-04-30","Gastos de Servicios Prestados por Terceros",191517.24000000002]
[null,null,"2019-04-30","Gastos Financieros",24339.98]
[null,null,"2019-04-30","Gastos por Tributos",410.55]
[null,null,"2019-04-30","Ingresos Financieros",-21594.58]
[null,null,"2019-04-30","Otros Gastos de Gestion",8982.900000000001]
[null,null,"2019-04-30","Otros Ingresos de Gestión",-3395.34]
[null,null,"2019-04-30","Valuación y Deterioro de Activos y Provisiones",19778.780000000002]
[null,null,"2019-04-30","Ventas",-381118.35]
[null,null,"2019-05-31","Gastos de Personal, Directores y Gerentes",107739.79999999997]
[null,null,"2019-05-31","Gastos de Servicios Prestados por Terceros",245873.87999999998]
[null,null,"2019-05-31","Gastos Financieros",31248.18]
[null,null,"2019-05-31","Gastos por Tributos",527.07]
[null,null,"2019-05-31","Ingresos Financieros",-27723.579999999998]
[null,null,"2019-05-31","Otros Gastos de Gestion",11532.460000000001]
[null,null,"2019-05-31","Otros Ingresos de Gestión",-4359.0199999999995]
[null,null,"2019-05-31","Valuación y Deterioro de Activos y Provisiones",25392.42]
[null,null,"2019-05-31","Ventas",-489287.77999999997]
[null,null,"2019-06-30","Gastos de Personal, Directores y Gerentes",59138.6]
[null,null,"2019-06-30","Gastos de Servicios Prestados por Terceros",134960.71000000002]
[null,null,"2019-06-30","Gastos Financieros",17152.19]
[null,null,"2019-06-30","Gastos por Tributos",289.31]
[null,null,"2019-06-30","Ingresos Financieros",-15217.53]
[null,null,"2019-06-30","Otros Gastos de Gestion",6330.19]
[null,null,"2019-06-30","Otros Ingresos de Gestión",-2392.6699999999996]
[null,null,"2019-06-30","Valuación y Deterioro de Activos y Provisiones",13937.960000000001]
[null,null,"2019-06-30","Ventas",-268571.12]
[null,null,"2019-07-31","Gastos de Personal, Directores y Gerentes",60645.31000000001]
[null,null,"2019-07-31","Gastos de Servicios Prestados por Terceros",138399.17]
[null,null,"2019-07-31","Gastos Financieros",17589.19]
[null,null,"2019-07-31","Gastos por Tributos",296.68]
[null,null,"2019-07-31","Ingresos Financieros",-15605.240000000002]
[null,null,"2019-07-31","Otros Gastos de Gestion",6491.47]
[null,null,"2019-07-31","Otros Ingresos de Gestión",-2453.64]
[null,null,"2019-07-31","Valuación y Deterioro de Activos y Provisiones",14293.06]
[null,null,"2019-07-31","Ventas",-275413.62]
[null,null,"2019-08-31","Gastos de Personal, Directores y Gerentes",86145.26999999999]
[null,null,"2019-08-31","Gastos de Servicios Prestados por Terceros",196592.84]
[null,null,"2019-08-31","Gastos Financieros",24985.04]
[null,null,"2019-08-31","Gastos por Tributos",421.43]
[null,null,"2019-08-31","Ingresos Financieros",-22166.879999999997]
[null,null,"2019-08-31","Otros Gastos de Gestion",9220.99]
[null,null,"2019-08-31","Otros Ingresos de Gestión",-3485.3300000000004]
[null,null,"2019-08-31","Valuación y Deterioro de Activos y Provisiones",20302.95]
[null,null,"2019-08-31","Ventas",-391218.77]
[null,null,"2019-09-30","Gastos de Personal, Directores y Gerentes",107544.06999999998]
[null,null,"2019-09-30","Gastos de Servicios Prestados por Terceros",245427.23]
{"$rows_left_out":35}
{"sheet":"EERR DINAMICO","index":3,"n_rows":18,"n_cols":11,"rows_kept":18}
[null,"Estado de resultados comparativo • dinámico"]
[null,"MOS Expert CPC Martín Cruz • +51 998 401 784 | Excel No Convencional"]
[]
[]
[{"$nulls":4},"Estado de resultados comparativo"]
[]
[{"$nulls":5},{"$f":"lista01.01","v":1},2,"","","",""]
[{"$nulls":4},"Rubros","Sem. 1","Sem. 2","","","",""]
[{"$nulls":4},"Ventas",{"v":-2264906.29,"d":"2,264,906"},{"v":-2104200.21,"d":"2,104,200"},0,0,0,0]
[{"$nulls":4},"Gastos de Servicios Prestados por Terceros",{"v":1138146.78,"d":"-1,138,147"},{"v":1057389.7999999998,"d":"-1,057,390"},0,0,0,0]
[{"$nulls":4},"Gastos de Personal, Directores y Gerentes",{"v":498726.0299999999,"d":"-498,726"},{"v":463338.97,"d":"-463,339"},0,0,0,0]
[{"$nulls":4},"Gastos por Tributos",{"v":2439.7999999999997,"d":"-2,440"},{"v":2266.7,"d":"-2,267"},0,0,0,0]
[{"$nulls":4},"Otros Gastos de Gestion",{"v":53383.55,"d":"-53,384"},{"v":49595.76000000001,"d":"-49,596"},0,0,0,0]
[{"$nulls":4},"Valuación y Deterioro de Activos y Provisiones",{"v":117541.18,"d":"-117,541"},{"v":109201.03,"d":"-109,201"},0,0,0,0]
[{"$nulls":4},"Otros Ingresos de Gestión",{"v":-20177.829999999998,"d":"20,178"},{"v":-18746.13,"d":"18,746"},0,0,0,0]
[{"$nulls":4},"Ingresos Financieros",{"v":-128332.06000000001,"d":"128,332"},{"v":-119226.29,"d":"119,226"},0,0,0,0]
[{"$nulls":4},"Gastos Financieros",{"v":144647.37,"d":"-144,647"},{"v":134383.96,"d":"-134,384"},0,0,0,0]
[{"$nulls":4},"Resultado Neto",{"v":-458531.4700000001,"d":"458,531"},{"v":-425996.41000000027,"d":"425,996"},0,0,0,0]