{"text_format":"3","workbook":"xlsx","n_sheets":5,"sheets":["2016","2017","DO_DATA","RESUMENES","DO RESUMENES"],"not_rendered":{"macros":1,"defined_names":36},"read":"whole","date_system":"1900"}

{"sheet":"2016","index":0,"n_rows":23,"n_cols":14,"rows_kept":23}
[null,"Consolidación año 2016"]
[null,"MOS Expert CPC Martín Cruz • +51 998 401 784 | Excel No Convencional"]
[]
[]
[]
[null,{"$f":"lista01.01","v":"Rubros"},"Enero","Febrero","Marzo","Abril","Mayo","Junio","Julio","Agosto","Septiembre","Octubre","Noviembre","Diciembre"]
[null,"01.01. Marca Nacional",{"v":65796.27,"d":"65,796.27"},{"v":22522.19,"d":"22,522.19"},{"v":44673.54,"d":"44,673.54"},{"v":62837.26,"d":"62,837.26"},{"v":7528.74,"d":"7,528.74"},{"v":66682.37,"d":"66,682.37"},{"v":49432,"d":"49,432.00"},{"v":19873.72,"d":"19,873.72"},{"v":20751.48,"d":"20,751.48"},{"v":9974.43,"d":"9,974.43"},{"v":57126.35,"d":"57,126.35"},{"v":12628.78,"d":"12,628.78"}]
[null,"01.02. Marca en el Extrajero",{"v":44037.91,"d":"44,037.91"},{"v":37443.62,"d":"37,443.62"},"",{"v":64378.55,"d":"64,378.55"},{"v":67607.96,"d":"67,607.96"},{"v":62646.36,"d":"62,646.36"},{"v":65191.7,"d":"65,191.70"},{"v":35195.81,"d":"35,195.81"},{"v":60090.36,"d":"60,090.36"},"",{"v":46239.35,"d":"46,239.35"},{"v":9653.1,"d":"9,653.10"}]
[null,"01.03. Renovaciones",{"v":2850.18,"d":"2,850.18"},{"v":47106.71,"d":"47,106.71"},{"v":10440.4,"d":"10,440.40"},{"v":69101.19,"d":"69,101.19"},{"v":36375.34,"d":"36,375.34"},{"v":41901.51,"d":"41,901.51"},"",{"v":33645.14,"d":"33,645.14"},{"v":67145.51,"d":"67,145.51"},"",{"v":16582.73,"d":"16,582.73"},{"v":38726.25,"d":"38,726.25"}]
[null,"01.04. Busqueda y Vigilancia",{"v":7289.91,"d":"7,289.91"},{"v":51613.54,"d":"51,613.54"},{"v":13258.04,"d":"13,258.04"},{"v":4208.38,"d":"4,208.38"},{"v":21107.31,"d":"21,107.31"},"",{"v":53166.76,"d":"53,166.76"},{"v":33079.28,"d":"33,079.28"},{"v":51183.79,"d":"51,183.79"},"",{"v":59573.52,"d":"59,573.52"},{"v":50164.85,"d":"50,164.85"}]
[null,"01.05. Dominio",{"v":37649.55,"d":"37,649.55"},{"v":53271.43,"d":"53,271.43"},"",{"v":38870.2,"d":"38,870.20"},{"v":35864.67,"d":"35,864.67"},{"v":40757.41,"d":"40,757.41"},{"v":14652.82,"d":"14,652.82"},{"v":48686.91,"d":"48,686.91"},{"v":24289.9,"d":"24,289.90"},{"v":41521.87,"d":"41,521.87"},{"v":39862.38,"d":"39,862.38"},{"v":11765.95,"d":"11,765.95"}]
[null,"01.06. Otros Marca",{"v":1650.47,"d":"1,650.47"},{"v":59512.89,"d":"59,512.89"},{"v":17508.23,"d":"17,508.23"},{"v":23364.02,"d":"23,364.02"},{"v":13484.15,"d":"13,484.15"},{"v":68308.03,"d":"68,308.03"},{"v":68096.95,"d":"68,096.95"},{"v":29661.2,"d":"29,661.20"},"","",{"v":66560.34,"d":"66,560.34"},{"v":16392.04,"d":"16,392.04"}]
[null,"02.01. Patente Nacional",{"v":43361.16,"d":"43,361.16"},{"v":25687.2,"d":"25,687.20"},{"v":41810.87,"d":"41,810.87"},{"v":40906.72,"d":"40,906.72"},{"v":9100.25,"d":"9,100.25"},{"v":43314.71,"d":"43,314.71"},{"v":44249.65,"d":"44,249.65"},{"v":46977.21,"d":"46,977.21"},{"v":48002.59,"d":"48,002.59"},"",{"v":38093.15,"d":"38,093.15"},{"v":8628.03,"d":"8,628.03"}]
[null,"02.02. PCT",{"v":6960.43,"d":"6,960.43"},{"v":6269.61,"d":"6,269.61"},{"v":19983.22,"d":"19,983.22"},{"v":11646.96,"d":"11,646.96"},{"v":43955.6,"d":"43,955.60"},{"v":5864.72,"d":"5,864.72"},{"v":6811.44,"d":"6,811.44"},{"v":24265.71,"d":"24,265.71"},{"v":42757.4,"d":"42,757.40"},{"v":30770.57,"d":"30,770.57"},{"v":11593.76,"d":"11,593.76"},{"v":34052.13,"d":"34,052.13"}]
[null,"02.03. Diseño Industrial",{"v":17084.37,"d":"17,084.37"},{"v":20355.27,"d":"20,355.27"},{"v":43601.77,"d":"43,601.77"},{"v":35816.55,"d":"35,816.55"},{"v":25476.73,"d":"25,476.73"},{"v":46832.54,"d":"46,832.54"},{"v":18040.43,"d":"18,040.43"},{"v":7185.75,"d":"7,185.75"},{"v":37922.12,"d":"37,922.12"},{"v":10698.12,"d":"10,698.12"},{"v":28361.31,"d":"28,361.31"},{"v":9733.18,"d":"9,733.18"}]
{"$rows_left_out":9}
{"sheet":"2017","index":1,"n_rows":22,"n_cols":14,"rows_kept":22}
[null,"Consolidación año 2017"]
[null,"MOS Expert CPC Martín Cruz • +51 998 401 784 | Excel No Convencional"]
[]
[]
[null,{"$f":"lista01.02","v":"Rubros"},"Enero","Febrero","Marzo","Abril","Mayo","Junio","Julio","Agosto","Septiembre","Octubre","Noviembre","Diciembre"]
[null,"01.01. Marca Nacional",{"v":41207.55,"d":"41,207.55"},{"v":27784.48,"d":"27,784.48"},"",{"v":24688.95,"d":"24,688.95"},{"v":76476.27,"d":"76,476.27"},{"v":38295.81,"d":"38,295.81"},{"v":76509.23,"d":"76,509.23"},{"v":43967.94,"d":"43,967.94"},{"v":74944.34,"d":"74,944.34"},{"v":29358.54,"d":"29,358.54"},{"v":26742.41,"d":"26,742.41"},{"v":27388.56,"d":"27,388.56"}]
[null,"01.02. Marca en el Extrajero",{"v":73380.44,"d":"73,380.44"},{"v":43861.99,"d":"43,861.99"},{"v":69323.46,"d":"69,323.46"},"",{"v":81580.65,"d":"81,580.65"},"",{"v":37889.14,"d":"37,889.14"},"",{"v":43665.5,"d":"43,665.50"},{"v":10025.58,"d":"10,025.58"},{"v":41422.18,"d":"41,422.18"},""]
[null,"01.03. Renovaciones",{"v":83570.18,"d":"83,570.18"},{"v":17386.2,"d":"17,386.20"},{"v":56775.21,"d":"56,775.21"},{"v":72389.63,"d":"72,389.63"},{"v":87518.47,"d":"87,518.47"},{"v":25959.59,"d":"25,959.59"},{"v":64804.29,"d":"64,804.29"},{"v":39487.35,"d":"39,487.35"},{"v":14933.23,"d":"14,933.23"},{"v":62995.41,"d":"62,995.41"},{"v":59123.13,"d":"59,123.13"},{"v":87303.77,"d":"87,303.77"}]
[null,"01.04. Busqueda y Vigilancia",{"v":88950.2,"d":"88,950.20"},{"v":75127.86,"d":"75,127.86"},"",{"v":18501,"d":"18,501.00"},{"v":57231.91,"d":"57,231.91"},{"v":5639.91,"d":"5,639.91"},{"v":19620.62,"d":"19,620.62"},{"v":43360.29,"d":"43,360.29"},{"v":51473.23,"d":"51,473.23"},"",{"v":87735.07,"d":"87,735.07"},{"v":85363.03,"d":"85,363.03"}]
[null,"01.05. Dominio",{"v":29283.51,"d":"29,283.51"},{"v":80920.95,"d":"80,920.95"},{"v":2526.68,"d":"2,526.68"},{"v":70231.59,"d":"70,231.59"},{"v":32620.35,"d":"32,620.35"},"",{"v":62884.88,"d":"62,884.88"},{"v":19455.08,"d":"19,455.08"},{"v":23514.43,"d":"23,514.43"},{"v":6093.47,"d":"6,093.47"},"",{"v":4940.9,"d":"4,940.90"}]
[null,"01.06. Otros Marca",{"v":13475.62,"d":"13,475.62"},{"v":31768.56,"d":"31,768.56"},{"v":58221.39,"d":"58,221.39"},{"v":56722.93,"d":"56,722.93"},{"v":31991.54,"d":"31,991.54"},{"v":62044.49,"d":"62,044.49"},{"v":62897.46,"d":"62,897.46"},{"v":63338.31,"d":"63,338.31"},{"v":43537.95,"d":"43,537.95"},{"v":58365.14,"d":"58,365.14"},{"v":88332.18,"d":"88,332.18"},{"v":64880.12,"d":"64,880.12"}]
[null,"02.01. Patente Nacional",{"v":55809.66,"d":"55,809.66"},{"v":34019.35,"d":"34,019.35"},{"v":86245.55,"d":"86,245.55"},{"v":80292.24,"d":"80,292.24"},{"v":18699.56,"d":"18,699.56"},{"v":28631.92,"d":"28,631.92"},{"v":62821.63,"d":"62,821.63"},{"v":60174.98,"d":"60,174.98"},{"v":84568.91,"d":"84,568.91"},{"v":44510.43,"d":"44,510.43"},{"v":87468.36,"d":"87,468.36"},""]
[null,"02.02. PCT",{"v":77029.99,"d":"77,029.99"},{"v":29976.27,"d":"29,976.27"},"",{"v":33758.57,"d":"33,758.57"},"",{"v":81985.82,"d":"81,985.82"},{"v":45454.8,"d":"45,454.80"},{"v":54935.89,"d":"54,935.89"},{"v":34761.27,"d":"34,761.27"},{"v":37992.91,"d":"37,992.91"},{"v":84760.57,"d":"84,760.57"},{"v":72972.21,"d":"72,972.21"}]
[null,"02.03. Diseño Industrial","",{"v":42950.57,"d":"42,950.57"},{"v":75904.36,"d":"75,904.36"},{"v":70041.87,"d":"70,041.87"},{"v":55549.19,"d":"55,549.19"},{"v":49665.47,"d":"49,665.47"},{"v":26478.23,"d":"26,478.23"},{"v":46474.01,"d":"46,474.01"},{"v":20662.97,"d":"20,662.97"},{"v":80388.26,"d":"80,388.26"},{"v":36145.62,"d":"36,145.62"},{"v":70304.26,"d":"70,304.26"}]
[null,"02.04. Variedad Vegetal",{"v":47227.99,"d":"47,227.99"},{"v":67831.65,"d":"67,831.65"},{"v":21079.74,"d":"21,079.74"},{"v":54761.48,"d":"54,761.48"},{"v":31835.69,"d":"31,835.69"},{"v":88405.93,"d":"88,405.93"},{"v":63422.77,"d":"63,422.77"},{"v":60690.59,"d":"60,690.59"},{"v":40755.37,"d":"40,755.37"},"",{"v":87638.15,"d":"87,638.15"},""]
{"$rows_left_out":8}
{"sheet":"DO_DATA","index":2,"n_rows":46,"n_cols":14,"rows_kept":46,"hidden":true}
[]
[]
[]
[]
[]
[null,"Rubros","Enero","Febrero","Marzo","Abril","Mayo","Junio","Julio","Agosto","Septiembre","Octubre","Noviembre","Diciembre"]
[null,"01.01. Marca Nacional",{"$f":"IF(RAND()<0.1,\"\",ROUND(RANDBETWEEN(1000,70000)+RAND(),2))","v":{"v":65796.27,"d":"65,796.27"}},{"v":22522.19,"d":"22,522.19"},{"v":44673.54,"d":"44,673.54"},{"v":62837.26,"d":"62,837.26"},{"v":7528.74,"d":"7,528.74"},{"v":66682.37,"d":"66,682.37"},{"v":49432,"d":"49,432.00"},{"v":19873.72,"d":"19,873.72"},{"v":20751.48,"d":"20,751.48"},{"v":9974.43,"d":"9,974.43"},{"v":57126.35,"d":"57,126.35"},{"v":12628.78,"d":"12,628.78"}]
[null,"01.02. Marca en el Extrajero",{"v":44037.91,"d":"44,037.91"},{"v":37443.62,"d":"37,443.62"},"",{"v":64378.55,"d":"64,378.55"},{"v":67607.96,"d":"67,607.96"},{"v":62646.36,"d":"62,646.36"},{"v":65191.7,"d":"65,191.70"},{"v":35195.81,"d":"35,195.81"},{"v":60090.36,"d":"60,090.36"},"",{"v":46239.35,"d":"46,239.35"},{"v":9653.1,"d":"9,653.10"}]
[null,"01.03. Renovaciones",{"v":2850.18,"d":"2,850.18"},{"v":47106.71,"d":"47,106.71"},{"v":10440.4,"d":"10,440.40"},{"v":69101.19,"d":"69,101.19"},{"v":36375.34,"d":"36,375.34"},{"v":41901.51,"d":"41,901.51"},"",{"v":33645.14,"d":"33,645.14"},{"v":67145.51,"d":"67,145.51"},"",{"v":16582.73,"d":"16,582.73"},{"v":38726.25,"d":"38,726.25"}]
[null,"01.04. Busqueda y Vigilancia",{"v":7289.91,"d":"7,289.91"},{"v":51613.54,"d":"51,613.54"},{"v":13258.04,"d":"13,258.04"},{"v":4208.38,"d":"4,208.38"},{"v":21107.31,"d":"21,107.31"},"",{"v":53166.76,"d":"53,166.76"},{"v":33079.28,"d":"33,079.28"},{"v":51183.79,"d":"51,183.79"},"",{"v":59573.52,"d":"59,573.52"},{"v":50164.85,"d":"50,164.85"}]
[null,"01.05. Dominio",{"v":37649.55,"d":"37,649.55"},{"v":53271.43,"d":"53,271.43"},"",{"v":38870.2,"d":"38,870.20"},{"v":35864.67,"d":"35,864.67"},{"v":40757.41,"d":"40,757.41"},{"v":14652.82,"d":"14,652.82"},{"v":48686.91,"d":"48,686.91"},{"v":24289.9,"d":"24,289.90"},{"v":41521.87,"d":"41,521.87"},{"v":39862.38,"d":"39,862.38"},{"v":11765.95,"d":"11,765.95"}]
[null,"01.06. Otros Marca",{"v":1650.47,"d":"1,650.47"},{"v":59512.89,"d":"59,512.89"},{"v":17508.23,"d":"17,508.23"},{"v":23364.02,"d":"23,364.02"},{"v":13484.15,"d":"13,484.15"},{"v":68308.03,"d":"68,308.03"},{"v":68096.95,"d":"68,096.95"},{"v":29661.2,"d":"29,661.20"},"","",{"v":66560.34,"d":"66,560.34"},{"v":16392.04,"d":"16,392.04"}]
[null,"02.01. Patente Nacional",{"$f":"IF(RAND()<0.1,\"\",ROUND(RANDBETWEEN(5000,50000)+RAND(),2))","v":{"v":43361.16,"d":"43,361.16"}},{"v":25687.2,"d":"25,687.20"},{"v":41810.87,"d":"41,810.87"},{"v":40906.72,"d":"40,906.72"},{"v":9100.25,"d":"9,100.25"},{"v":43314.71,"d":"43,314.71"},{"v":44249.65,"d":"44,249.65"},{"v":46977.21,"d":"46,977.21"},{"v":48002.59,"d":"48,002.59"},"",{"v":38093.15,"d":"38,093.15"},{"v":8628.03,"d":"8,628.03"}]
[null,"02.02. PCT",{"v":6960.43,"d":"6,960.43"},{"v":6269.61,"d":"6,269.61"},{"v":19983.22,"d":"19,983.22"},{"v":11646.96,"d":"11,646.96"},{"v":43955.6,"d":"43,955.60"},{"v":5864.72,"d":"5,864.72"},{"v":6811.44,"d":"6,811.44"},{"v":24265.71,"d":"24,265.71"},{"v":42757.4,"d":"42,757.40"},{"v":30770.57,"d":"30,770.57"},{"v":11593.76,"d":"11,593.76"},{"v":34052.13,"d":"34,052.13"}]
[null,"02.03. Diseño Industrial",{"v":17084.37,"d":"17,084.37"},{"v":20355.27,"d":"20,355.27"},{"v":43601.77,"d":"43,601.77"},{"v":35816.55,"d":"35,816.55"},{"v":25476.73,"d":"25,476.73"},{"v":46832.54,"d":"46,832.54"},{"v":18040.43,"d":"18,040.43"},{"v":7185.75,"d":"7,185.75"},{"v":37922.12,"d":"37,922.12"},{"v":10698.12,"d":"10,698.12"},{"v":28361.31,"d":"28,361.31"},{"v":9733.18,"d":"9,733.18"}]
{"$rows_left_out":32}
{"sheet":"RESUMENES","index":3,"n_rows":34,"n_cols":12,"rows_kept":34,"merged":[[4,8,5,8],[4,11,5,11],[14,8,15,8],[14,11,15,11]]}
[null,"Consolidación por años"]
[null,"MOS Expert CPC Martín Cruz • +51 998 401 784 | Excel No Convencional"]
[]
[]
[null,{"$f":"lista02.01","v":{"v":2017,"d":"Año 2017"}},"MARCA","PATENTE","OTROS","TOTAL","GRAFICA",null,{"$f":"lista02.03","v":"MARCA"},2017,2016,"% Var"]
[null,"Enero",{"v":329867.5,"d":"329,867.50"},{"v":267632.59,"d":"267,632.59"},{"v":2170.31,"d":"2,170.31"},{"v":599670.4000000001,"d":"599,670.40"},"███████████",null,"","Octubre","Octubre",""]
[null,"Febrero",{"v":276850.04,"d":"276,850.04"},{"v":304486.55,"d":"304,486.55"},{"v":8503.55,"d":"8,503.55"},{"v":589840.14,"d":"589,840.14"},"███████████",null,"01.01. Marca Nacional",{"v":29358.54,"d":"29,358.54"},{"v":9974.43,"d":"9,974.43"},{"v":1.9433802232308013,"d":"194.34%"}]
[null,"Marzo",{"v":186846.74,"d":"186,846.74"},{"v":354878.83999999997,"d":"354,878.84"},{"v":10607.35,"d":"10,607.35"},{"v":552332.9299999999,"d":"552,332.93"},"███████████",null,"01.02. Marca en el Extrajero",{"v":10025.58,"d":"10,025.58"},"",""]
[null,"Abril",{"v":242534.09999999998,"d":"242,534.10"},{"v":400592.36,"d":"400,592.36"},{"v":8399.66,"d":"8,399.66"},{"v":651526.12,"d":"651,526.12"},"█████████████",null,"01.03. Renovaciones",{"v":62995.41,"d":"62,995.41"},"",""]
[null,"Mayo",{"v":367419.18999999994,"d":"367,419.19"},{"v":259408.08000000002,"d":"259,408.08"},{"v":5136.120000000001,"d":"5,136.12"},{"v":631963.39,"d":"631,963.39"},"████████████",null,"01.04. Busqueda y Vigilancia","","",""]
[null,"Junio",{"v":131939.8,"d":"131,939.80"},{"v":304765.46,"d":"304,765.46"},{"v":5459.02,"d":"5,459.02"},{"v":442164.28,"d":"442,164.28"},"████████",null,"01.05. Dominio",{"v":6093.47,"d":"6,093.47"},{"v":41521.87,"d":"41,521.87"},{"v":-0.8532467347930139,"d":"-85.32%"}]
[null,"Julio",{"v":324605.62,"d":"324,605.62"},{"v":371001.54,"d":"371,001.54"},{"v":13278.42,"d":"13,278.42"},{"v":708885.58,"d":"708,885.58"},"██████████████",null,"01.06. Otros Marca",{"v":58365.14,"d":"58,365.14"},"",""]
[null,"Agosto",{"v":209608.97000000003,"d":"209,608.97"},{"v":335969.79,"d":"335,969.79"},{"v":4405.23,"d":"4,405.23"},{"v":549983.99,"d":"549,983.99"},"██████████",null,"","","",""]
[null,"Septiembre",{"v":252068.68,"d":"252,068.68"},{"v":375688.20999999996,"d":"375,688.21"},{"v":6842.87,"d":"6,842.87"},{"v":634599.7599999999,"d":"634,599.76"},"████████████",null,"","","",""]
[null,"Octubre",{"v":166838.14,"d":"166,838.14"},{"v":351204.20999999996,"d":"351,204.21"},{"v":5040.15,"d":"5,040.15"},{"v":523082.5,"d":"523,082.50"},"██████████",null,"PATENTE",2017,2016,"% Var"]
{"$rows_left_out":20}
{"sheet":"DO RESUMENES","index":4,"n_rows":37,"n_cols":14,"rows_kept":37,"hidden":true}
[]
[]
[]
[{"$nulls":3},"Nombre de rangos"]
[{"$nulls":3},"MOS - CPC Martín Cruz - 998401784"]
[]
[]
[{"$nulls":3},{"$f":"IF(RAND()<0.5,2016,2017)","v":{"v":2017,"d":"Año 2017"}},"MARCA","PATENTE","OTROS","TOTAL","GRAFICA",null,"MARCA",2017,2016,"% Var"]
[{"$nulls":3},"Enero",{"$f":"SUM(INDIRECT($D$8&\"!\"&$D9) INDIRECT($D$8&\"!\"&E$8))","v":{"v":329867.5,"d":"329,867.50"}},{"$f":"SUM(INDIRECT($D$8&\"!\"&$D9) INDIRECT($D$8&\"!\"&F$8))","v":{"v":267632.59,"d":"267,632.59"}},{"$f":"SUM(INDIRECT($D$8&\"!\"&$D9) INDIRECT($D$8&\"!\"&G$8))","v":{"v":2170.31,"d":"2,170.31"}},{"$f":"SUM(E9:G9)","v":{"v":599670.4000000001,"d":"599,670.40"}},{"$f":"REPT(\"█\",H9/50000)","v":"███████████"},null,{"$f":"\"\"","v":""},{"$f":"INDEX('2017'!$C$5:$N$5,RANDBETWEEN(1,12))","v":"Octubre"},{"$f":"L9","v":"Octubre"},{"$f":"\"\"","v":""}]
[{"$nulls":3},"Febrero",{"$f":"SUM(INDIRECT($D$8&\"!\"&$D10) INDIRECT($D$8&\"!\"&E$8))","v":{"v":276850.04,"d":"276,850.04"}},{"$f":"SUM(INDIRECT($D$8&\"!\"&$D10) INDIRECT($D$8&\"!\"&F$8))","v":{"v":304486.55,"d":"304,486.55"}},{"$f":"SUM(INDIRECT($D$8&\"!\"&$D10) INDIRECT($D$8&\"!\"&G$8))","v":{"v":8503.55,"d":"8,503.55"}},{"v":589840.14,"d":"589,840.14"},"███████████",null,"01.01. Marca Nacional",{"$f":"INDIRECT(L$8&\"!\"&L$9) INDIRECT(L$8&\"!\"&$K$8)","v":{"v":29358.54,"d":"29,358.54"}},{"$f":"INDIRECT(M$8&\"!\"&M$9) INDIRECT(M$8&\"!\"&$K$8)","v":{"v":9974.43,"d":"9,974.43"}},{"$f":"IFERROR(L10/M10-1,\"\")","v":{"v":1.9433802232308013,"d":"194.34%"}}]
[{"$nulls":3},"Marzo",{"$f":"SUM(INDIRECT($D$8&\"!\"&$D11) INDIRECT($D$8&\"!\"&E$8))","v":{"v":186846.74,"d":"186,846.74"}},{"$f":"SUM(INDIRECT($D$8&\"!\"&$D11) INDIRECT($D$8&\"!\"&F$8))","v":{"v":354878.83999999997,"d":"354,878.84"}},{"$f":"SUM(INDIRECT($D$8&\"!\"&$D11) INDIRECT($D$8&\"!\"&G$8))","v":{"v":10607.35,"d":"10,607.35"}},{"v":552332.9299999999,"d":"552,332.93"},"███████████",null,"01.02. Marca en el Extrajero",{"v":10025.58,"d":"10,025.58"},"",""]
[{"$nulls":3},"Abril",{"$f":"SUM(INDIRECT($D$8&\"!\"&$D12) INDIRECT($D$8&\"!\"&E$8))","v":{"v":242534.09999999998,"d":"242,534.10"}},{"$f":"SUM(INDIRECT($D$8&\"!\"&$D12) INDIRECT($D$8&\"!\"&F$8))","v":{"v":400592.36,"d":"400,592.36"}},{"$f":"SUM(INDIRECT($D$8&\"!\"&$D12) INDIRECT($D$8&\"!\"&G$8))","v":{"v":8399.66,"d":"8,399.66"}},{"v":651526.12,"d":"651,526.12"},"█████████████",null,"01.03. Renovaciones",{"v":62995.41,"d":"62,995.41"},"",""]
[{"$nulls":3},"Mayo",{"$f":"SUM(INDIRECT($D$8&\"!\"&$D13) INDIRECT($D$8&\"!\"&E$8))","v":{"v":367419.18999999994,"d":"367,419.19"}},{"$f":"SUM(INDIRECT($D$8&\"!\"&$D13) INDIRECT($D$8&\"!\"&F$8))","v":{"v":259408.08000000002,"d":"259,408.08"}},{"$f":"SUM(INDIRECT($D$8&\"!\"&$D13) INDIRECT($D$8&\"!\"&G$8))","v":{"v":5136.120000000001,"d":"5,136.12"}},{"v":631963.39,"d":"631,963.39"},"████████████",null,"01.04. Busqueda y Vigilancia","","",""]
[{"$nulls":3},"Junio",{"$f":"SUM(INDIRECT($D$8&\"!\"&$D14) INDIRECT($D$8&\"!\"&E$8))","v":{"v":131939.8,"d":"131,939.80"}},{"$f":"SUM(INDIRECT($D$8&\"!\"&$D14) INDIRECT($D$8&\"!\"&F$8))","v":{"v":304765.46,"d":"304,765.46"}},{"$f":"SUM(INDIRECT($D$8&\"!\"&$D14) INDIRECT($D$8&\"!\"&G$8))","v":{"v":5459.02,"d":"5,459.02"}},{"v":442164.28,"d":"442,164.28"},"████████",null,"01.05. Dominio",{"v":6093.47,"d":"6,093.47"},{"v":41521.87,"d":"41,521.87"},{"v":-0.8532467347930139,"d":"-85.32%"}]
[{"$nulls":3},"Julio",{"$f":"SUM(INDIRECT($D$8&\"!\"&$D15) INDIRECT($D$8&\"!\"&E$8))","v":{"v":324605.62,"d":"324,605.62"}},{"$f":"SUM(INDIRECT($D$8&\"!\"&$D15) INDIRECT($D$8&\"!\"&F$8))","v":{"v":371001.54,"d":"371,001.54"}},{"$f":"SUM(INDIRECT($D$8&\"!\"&$D15) INDIRECT($D$8&\"!\"&G$8))","v":{"v":13278.42,"d":"13,278.42"}},{"v":708885.58,"d":"708,885.58"},"██████████████",null,"01.06. Otros Marca",{"v":58365.14,"d":"58,365.14"},"",""]
{"$rows_left_out":22}