{"text_format":"3","workbook":"xlsx","n_sheets":39,"sheets":["DO_CLAVE","INICIO","DO_A1_01","ARG1_01","DO_A1_02","ARG1_02","DO_A1_03","ARG1_03","DO_A1_04","ARG1_04","DO_A1_05","ARG1_05","DO_A1_06","ARG1_06","DO_A3_01","DO_A1_07","ARG1_07","DO_A1_08","ARG1_08","DO_A1_09","ARG1_09","ARG3_01","DO_A3_02","ARG3_02","DO_A3_03","ARG3_03","DO_A2_01","ARG2_01","DO_A2_02","ARG2_02","DO_A2_03","ARG2_03","DO_A2_04","ARG2_04","DO_A2_05","ARG2_05","DO_A2_06","DO_ARG2_06","DO_EJER01"],"not_rendered":{"macros":1,"defined_names":67},"read":"whole","date_system":"1900"}

{"sheet":"DO_CLAVE","index":0,"n_rows":3,"n_cols":2,"rows_kept":3,"hidden":true}
["Acceso1",1]
["Acceso2",2]
["Acceso3",3]

{"sheet":"INICIO","index":1,"n_rows":35,"n_cols":6,"rows_kept":35,"merged":[[4,2,4,4],[5,2,5,4]]}
[null,"Excel No Convencional"]
[null,"MOS Expert - CPC Martín Cruz - 998401784"]
[]
[]
[null,null,"Taller de Excel"]
[null,null,"Buscando datos en Excel - Inicial Experto"]
[]
[null,null,"►","Argumento VALOR BUSCADO"]
[null,null,{"$f":"\"\"","v":""},"•","Sin usar celda de apoyo","Desprotegida"]
[null,null,{"$f":"\"\"","v":""},"•","Usando celda de apoyo","Desprotegida"]
[null,null,{"$f":"\"\"","v":""},"•","Usando comodines","Protegida"]
[null,null,{"$f":"\"\"","v":""},"•","Corrigiendo el valor buscado (1)","Protegida"]
[null,null,{"$f":"\"\"","v":""},"•","Corrigiendo el valor buscado (2)","Protegida"]
[null,null,{"$f":"\"\"","v":""},"•","Valores repetidos","Protegida"]
[null,null,{"$f":"\"\"","v":""},"•","Aproximación de números","Protegida"]
[null,null,{"$f":"\"\"","v":""},"•","Aproximación de fechas","Protegida"]
[null,null,{"$f":"\"\"","v":""},"•","Aproximación de texto (1)","Protegida"]
[null,null,{"$f":"\"\"","v":""},"•","Aproximación de texto (2) avanzado","Protegida"]
[null,null,{"$f":"\"\"","v":""},{"$f":"\"\"","v":""}]
[null,null,"►","Argumento INDICADOR DE COLUMNA / FILA"]
[{"$nulls":3},"•","Columna o fila fija","Desprotegida"]
[{"$nulls":3},"•","Columna o fila calculada: usando celda de apoyo (1)","Protegida"]
[{"$nulls":3},"•","Columna o fila calculada: sin usar celda de apoyo (1)","Protegida"]
[{"$nulls":3},"•","Columna o fila calculada: usando celda de apoyo (2)","Protegida"]
[{"$nulls":3},"•","Columna o fila calculada: sin usar celda de apoyo (2)","Protegida"]
[{"$nulls":3},"•","Columna o fila calculada: usando celda de apoyo caso especial (1)","Protegida"]
[{"$nulls":3},"•","Columna o fila calculada: usando celda de apoyo caso especial (2)","Protegida"]
[]
[null,null,"►","Argumento MATRIZ BUSCAR EN"]
[{"$nulls":3},"•","Matriz sin celdas de apoyo","Protegida"]
[{"$nulls":3},"•","Buscando en dos matrices","Protegida"]
[{"$nulls":3},"•","Buscando en más de dos matrices","Protegida"]
[{"$nulls":3},"•","Buscando en más de dos matrices: correción manual","Protegida"]
[{"$nulls":3},"•","Buscando en más de dos matrices: correción formulada","Protegida"]
[{"$nulls":3},"•","Matriz en reversa","Protegida"]

{"sheet":"DO_A1_01","index":2,"n_rows":46,"n_cols":14,"rows_kept":46,"hidden":true}
[null,"Argumento valor buscado"]
[null,"MOS Expert - CPC Martín Cruz - 998401784"]
[]
[]
[{"$nulls":8},{"$f":"\"\"","v":""},{"$f":"\"Columna \"&TEXT(COLUMNS($J$6:J$6),\"00\")&CHAR(10)&\" ↓\"","v":"Columna 01\n ↓"},{"$f":"\"Columna \"&TEXT(COLUMNS($J$6:K$6),\"00\")&CHAR(10)&\" ↓\"","v":"Columna 02\n ↓"},{"$f":"\"Columna \"&TEXT(COLUMNS($J$6:L$6),\"00\")&CHAR(10)&\" ↓\"","v":"Columna 03\n ↓"},{"$f":"\"Columna \"&TEXT(COLUMNS($J$6:M$6),\"00\")&CHAR(10)&\" ↓\"","v":"Columna 04\n ↓"},{"$f":"\"Columna \"&TEXT(COLUMNS($J$6:N$6),\"00\")&CHAR(10)&\" ↓\"","v":"Columna 05\n ↓"}]
[null,{"$f":"\"\"","v":""},"VALOR BUSCADO",null,null,{"$f":"IF(ARG1_01!E6=\"\",\"\",IF(G6=\"f\",IF(E6=ARG1_01!E6,\"ü\",\"û\"),\"\"))","v":""},null,null,{"$f":"\"Fila \"&TEXT(ROWS(I$6:I6),\"00\")&\" →\"","v":"Fila 01 →"},"Meses","Norte","Sur","Este","Oeste"]
[null,{"$f":"\"\"","v":""},{"$f":"\"\"","v":""},null,null,{"$f":"IF(ARG1_01!E7=\"\",\"\",IF(G7=\"f\",IF(E7=ARG1_01!E7,\"ü\",\"û\"),\"\"))","v":""},null,null,{"$f":"\"Fila \"&TEXT(ROWS(I$6:I7),\"00\")&\" →\"","v":"Fila 02 →"},{"$f":"PROPER(TEXT(DATE(YEAR(TODAY()),ROWS(J$7:J7),1),\"mmmm\"))","v":"Enero"},{"$f":"ROUND(RANDBETWEEN(100,600)+RAND(),2)","v":298.57},468.34,202.08,164.79]
[null,"►","SIN CELDA DE APOYO",null,null,{"$f":"IF(ARG1_01!E8=\"\",\"\",IF(G8=\"f\",IF(E8=ARG1_01!E8,\"ü\",\"û\"),\"\"))","v":""},null,null,{"$f":"\"Fila \"&TEXT(ROWS(I$6:I8),\"00\")&\" →\"","v":"Fila 03 →"},{"$f":"PROPER(TEXT(DATE(YEAR(TODAY()),ROWS(J$7:J8),1),\"mmmm\"))","v":"Febrero"},347.81,322.59,477.71,324.46]
[null,{"$f":"\"\"","v":""},{"$f":"\"\"","v":""},null,null,{"$f":"IF(ARG1_01!E9=\"\",\"\",IF(G9=\"f\",IF(E9=ARG1_01!E9,\"ü\",\"û\"),\"\"))","v":""},null,null,{"$f":"\"Fila \"&TEXT(ROWS(I$6:I9),\"00\")&\" →\"","v":"Fila 04 →"},{"$f":"PROPER(TEXT(DATE(YEAR(TODAY()),ROWS(J$7:J9),1),\"mmmm\"))","v":"Marzo"},589.17,{"v":164,"d":"164.00"},{"v":573,"d":"573.00"},492.82]
[null,{"$f":"\"\"","v":""},{"$f":"\"¿A cuánto asciende la venta del mes de mayo de la zona Este?\"","v":"¿A cuánto asciende la venta del mes de mayo de la zona Este?"},null,null,{"$f":"IF(ARG1_01!E10=\"\",\"\",IF(G10=\"f\",IF(E10=ARG1_01!E10,\"ü\",\"û\"),\"\"))","v":""},null,null,{"$f":"\"Fila \"&TEXT(ROWS(I$6:I10),\"00\")&\" →\"","v":"Fila 05 →"},{"$f":"PROPER(TEXT(DATE(YEAR(TODAY()),ROWS(J$7:J10),1),\"mmmm\"))","v":"Abril"},470.43,317.97,562.22,452.91]
[null,{"$f":"\"\"","v":""},"Opción 1: BUSCARV",null,{"$f":"VLOOKUP(\"Mayo\",DO_A1_01!J6:N18,4,0)","v":167.44},{"$f":"IF(ARG1_01!E11=\"\",\"\",IF(G11=\"f\",IF(E11=ARG1_01!E11,\"ü\",\"û\"),\"\"))","v":"ü"},"f",null,{"$f":"\"Fila \"&TEXT(ROWS(I$6:I11),\"00\")&\" →\"","v":"Fila 06 →"},{"$f":"PROPER(TEXT(DATE(YEAR(TODAY()),ROWS(J$7:J11),1),\"mmmm\"))","v":"Mayo"},392.69,424.13,167.44,398.17]
[null,{"$f":"\"\"","v":""},{"$f":"IF(_xlfn.ISFORMULA(ARG1_01!E11),_xlfn.FORMULATEXT(ARG1_01!E11),\"\")","v":"=BUSCARV(\"mayo\",J8:N20,4,0)"},null,null,{"$f":"IF(ARG1_01!E12=\"\",\"\",IF(G12=\"f\",IF(E12=ARG1_01!E12,\"ü\",\"û\"),\"\"))","v":""},null,null,{"$f":"\"Fila \"&TEXT(ROWS(I$6:I12),\"00\")&\" →\"","v":"Fila 07 →"},{"$f":"PROPER(TEXT(DATE(YEAR(TODAY()),ROWS(J$7:J12),1),\"mmmm\"))","v":"Junio"},408.46,{"v":461.4,"d":"461.40"},{"v":190,"d":"190.00"},222.53]
[null,{"$f":"\"\"","v":""},{"$f":"\"\"","v":""},null,null,{"$f":"IF(ARG1_01!E13=\"\",\"\",IF(G13=\"f\",IF(E13=ARG1_01!E13,\"ü\",\"û\"),\"\"))","v":""},null,null,{"$f":"\"Fila \"&TEXT(ROWS(I$6:I13),\"00\")&\" →\"","v":"Fila 08 →"},{"$f":"PROPER(TEXT(DATE(YEAR(TODAY()),ROWS(J$7:J13),1),\"mmmm\"))","v":"Julio"},404.11,376.22,434.93,473.94]
[null,{"$f":"\"\"","v":""},"Ejercicio →",null,null,{"$f":"IF(ARG1_01!E14=\"\",\"\",IF(G14=\"f\",IF(E14=ARG1_01!E14,\"ü\",\"û\"),\"\"))","v":""},null,null,{"$f":"\"Fila \"&TEXT(ROWS(I$6:I14),\"00\")&\" →\"","v":"Fila 09 →"},{"$f":"PROPER(TEXT(DATE(YEAR(TODAY()),ROWS(J$7:J14),1),\"mmmm\"))","v":"Agosto"},279.69,220.82,408.23,287.72]
[null,{"$f":"\"\"","v":""},{"$f":"IF(_xlfn.ISFORMULA(ARG1_01!E11),\"Ahora para Norte, evalúa que nro de columna será.\",\"\")","v":"Ahora para Norte, evalúa que nro de columna será."},null,{"$f":"VLOOKUP(\"mayo\",DO_A1_01!J6:N18,2,0)","v":392.69},{"$f":"IF(ARG1_01!E15=\"\",\"\",IF(G15=\"f\",IF(E15=ARG1_01!E15,\"ü\",\"û\"),\"\"))","v":"ü"},"f",null,{"$f":"\"Fila \"&TEXT(ROWS(I$6:I15),\"00\")&\" →\"","v":"Fila 10 →"},{"$f":"PROPER(TEXT(DATE(YEAR(TODAY()),ROWS(J$7:J15),1),\"mmmm\"))","v":"Setiembre"},563.96,328.72,{"v":153.6,"d":"153.60"},148.13]
[null,{"$f":"\"\"","v":""},{"$f":"IF(_xlfn.ISFORMULA(ARG1_01!E15),_xlfn.FORMULATEXT(ARG1_01!E15),\"\")","v":"=BUSCARV(\"mayo\",J8:N20,2,0)"},null,null,{"$f":"IF(ARG1_01!E16=\"\",\"\",IF(G16=\"f\",IF(E16=ARG1_01!E16,\"ü\",\"û\"),\"\"))","v":""},null,null,{"$f":"\"Fila \"&TEXT(ROWS(I$6:I16),\"00\")&\" →\"","v":"Fila 11 →"},{"$f":"PROPER(TEXT(DATE(YEAR(TODAY()),ROWS(J$7:J16),1),\"mmmm\"))","v":"Octubre"},588.53,{"v":510.1,"d":"510.10"},251.11,411.21]
[null,{"$f":"\"\"","v":""},{"$f":"\"\"","v":""},{"$f":"\"\"","v":""},null,{"$f":"IF(ARG1_01!E17=\"\",\"\",IF(G17=\"f\",IF(E17=ARG1_01!E17,\"ü\",\"û\"),\"\"))","v":""},null,null,{"$f":"\"Fila \"&TEXT(ROWS(I$6:I17),\"00\")&\" →\"","v":"Fila 12 →"},{"$f":"PROPER(TEXT(DATE(YEAR(TODAY()),ROWS(J$7:J17),1),\"mmmm\"))","v":"Noviembre"},123.11,280.36,383.39,240.27]
[null,{"$f":"\"\"","v":""},"Opción 2: BUSCARH",null,null,{"$f":"IF(ARG1_01!E18=\"\",\"\",IF(G18=\"f\",IF(E18=ARG1_01!E18,\"ü\",\"û\"),\"\"))","v":""},null,null,{"$f":"\"Fila \"&TEXT(ROWS(I$6:I18),\"00\")&\" →\"","v":"Fila 13 →"},{"$f":"PROPER(TEXT(DATE(YEAR(TODAY()),ROWS(J$7:J18),1),\"mmmm\"))","v":"Diciembre"},472.99,462.96,543.47,189.54]
[null,{"$f":"\"\"","v":""},{"$f":"IF(_xlfn.ISFORMULA(ARG1_01!E19),_xlfn.FORMULATEXT(ARG1_01!E19),\"\")","v":"=BUSCARH(\"este\",J8:N20,6,0)"},null,{"$f":"HLOOKUP(\"este\",DO_A1_01!J6:N18,6,0)","v":167.44},{"$f":"IF(ARG1_01!E19=\"\",\"\",IF(G19=\"f\",IF(E19=ARG1_01!E19,\"ü\",\"û\"),\"\"))","v":"ü"},"f"]
[null,{"$f":"\"\"","v":""},{"$f":"\"\"","v":""},{"$f":"\"\"","v":""},null,{"$f":"IF(ARG1_01!E20=\"\",\"\",IF(G20=\"f\",IF(E20=ARG1_01!E20,\"ü\",\"û\"),\"\"))","v":""}]
[null,{"$f":"\"\"","v":""},"Ejercicio →",null,null,{"$f":"IF(ARG1_01!E21=\"\",\"\",IF(G21=\"f\",IF(E21=ARG1_01!E21,\"ü\",\"û\"),\"\"))","v":""}]
[null,{"$f":"\"\"","v":""},{"$f":"IF(_xlfn.ISFORMULA(ARG1_01!E19),\"Ahora para Octubre, evalúa que nro de fila será.\",\"\")","v":"Ahora para Octubre, evalúa que nro de fila será."},null,{"$f":"HLOOKUP(\"este\",DO_A1_01!J6:N18,11,0)","v":251.11},{"$f":"IF(ARG1_01!E22=\"\",\"\",IF(G22=\"f\",IF(E22=ARG1_01!E22,\"ü\",\"û\"),\"\"))","v":"ü"},"f"]
[null,{"$f":"\"\"","v":""},{"$f":"IF(_xlfn.ISFORMULA(ARG1_01!E22),_xlfn.FORMULATEXT(ARG1_01!E22),\"\")","v":"=BUSCARH(\"este\",J8:N20,11,0)"},null,null,{"$f":"IF(ARG1_01!E23=\"\",\"\",IF(G23=\"f\",IF(E23=ARG1_01!E23,\"ü\",\"û\"),\"\"))","v":""}]
[null,{"$f":"\"\"","v":""},{"$f":"\"\"","v":""},{"$f":"\"\"","v":""},null,{"$f":"IF(ARG1_01!E24=\"\",\"\",IF(G24=\"f\",IF(E24=ARG1_01!E24,\"ü\",\"û\"),\"\"))","v":""}]
[null,"►","CON CELDA DE APOYO",null,null,{"$f":"IF(ARG1_01!E25=\"\",\"\",IF(G25=\"f\",IF(E25=ARG1_01!E25,\"ü\",\"û\"),\"\"))","v":""}]
[null,{"$f":"\"\"","v":""},{"$f":"\"\"","v":""},{"$f":"\"\"","v":""},null,{"$f":"IF(ARG1_01!E26=\"\",\"\",IF(G26=\"f\",IF(E26=ARG1_01!E26,\"ü\",\"û\"),\"\"))","v":""}]
[null,{"$f":"\"\"","v":""},{"$f":"\"¿A cuánto asciende la venta del mes de \"&C29&\" de la zona Este?\"","v":"¿A cuánto asciende la venta del mes de Febrero de la zona Este?"},null,null,{"$f":"IF(ARG1_01!E27=\"\",\"\",IF(G27=\"f\",IF(E27=ARG1_01!E27,\"ü\",\"û\"),\"\"))","v":""}]
[null,{"$f":"\"\"","v":""},"Opción 1: BUSCARV",null,null,{"$f":"IF(ARG1_01!E28=\"\",\"\",IF(G28=\"f\",IF(E28=ARG1_01!E28,\"ü\",\"û\"),\"\"))","v":""}]
[null,{"$f":"\"\"","v":""},{"$f":"INDEX($J$7:$J$18,RANDBETWEEN(1,6)*2)","v":"Febrero"},null,{"$f":"VLOOKUP(C29,DO_A1_01!J6:N18,4,0)","v":477.71},{"$f":"IF(ARG1_01!E29=\"\",\"\",IF(G29=\"f\",IF(E29=ARG1_01!E29,\"ü\",\"û\"),\"\"))","v":"ü"},"f"]
[null,{"$f":"\"\"","v":""},{"$f":"IF(_xlfn.ISFORMULA(ARG1_01!E29),_xlfn.FORMULATEXT(ARG1_01!E29),\"\")","v":"=BUSCARV(C29,J8:N20,4,0)"},null,null,{"$f":"IF(ARG1_01!E30=\"\",\"\",IF(G30=\"f\",IF(E30=ARG1_01!E30,\"ü\",\"û\"),\"\"))","v":""}]
[null,{"$f":"\"\"","v":""},{"$f":"\"\"","v":""},{"$f":"\"\"","v":""},null,{"$f":"IF(ARG1_01!E31=\"\",\"\",IF(G31=\"f\",IF(E31=ARG1_01!E31,\"ü\",\"û\"),\"\"))","v":""}]
[null,{"$f":"\"\"","v":""},"Ejercicio →",null,null,{"$f":"IF(ARG1_01!E32=\"\",\"\",IF(G32=\"f\",IF(E32=ARG1_01!E32,\"ü\",\"û\"),\"\"))","v":""}]
[null,{"$f":"\"\"","v":""},{"$f":"IF(_xlfn.ISFORMULA(ARG1_01!E29),\"Ahora para Sur, evalúa que nro de columna será.\",\"\")","v":"Ahora para Sur, evalúa que nro de columna será."},null,null,{"$f":"IF(ARG1_01!E33=\"\",\"\",IF(G33=\"f\",IF(E33=ARG1_01!E33,\"ü\",\"û\"),\"\"))","v":""}]
[null,{"$f":"\"\"","v":""},{"$f":"INDEX($J$7:$J$18,RANDBETWEEN(1,6)*2-1)","v":"Setiembre"},null,{"$f":"VLOOKUP(C34,DO_A1_01!J6:N18,4,0)","v":153.6},{"$f":"IF(ARG1_01!E34=\"\",\"\",IF(G34=\"f\",IF(E34=ARG1_01!E34,\"ü\",\"û\"),\"\"))","v":"ü"},"f"]
[null,{"$f":"\"\"","v":""},{"$f":"IF(_xlfn.ISFORMULA(ARG1_01!E34),_xlfn.FORMULATEXT(ARG1_01!E34),\"\")","v":"=BUSCARV(C34,J8:N20,4,0)"},null,null,{"$f":"IF(ARG1_01!E35=\"\",\"\",IF(G35=\"f\",IF(E35=ARG1_01!E35,\"ü\",\"û\"),\"\"))","v":""}]
[null,{"$f":"\"\"","v":""},{"$f":"\"\"","v":""},{"$f":"\"\"","v":""},null,{"$f":"IF(ARG1_01!E36=\"\",\"\",IF(G36=\"f\",IF(E36=ARG1_01!E36,\"ü\",\"û\"),\"\"))","v":""}]
[null,{"$f":"\"\"","v":""},{"$f":"\"¿A cuánto asciende la venta del mes de Mayo de la zona \"&C39&\"?\"","v":"¿A cuánto asciende la venta del mes de Mayo de la zona Sur?"},null,null,{"$f":"IF(ARG1_01!E37=\"\",\"\",IF(G37=\"f\",IF(E37=ARG1_01!E37,\"ü\",\"û\"),\"\"))","v":""}]
[null,{"$f":"\"\"","v":""},"Opción 2: BUSCARH",null,null,{"$f":"IF(ARG1_01!E38=\"\",\"\",IF(G38=\"f\",IF(E38=ARG1_01!E38,\"ü\",\"û\"),\"\"))","v":""}]
[null,{"$f":"\"\"","v":""},{"$f":"INDEX($K$6:$N$6,RANDBETWEEN(1,2)*2)","v":"Sur"},null,{"$f":"HLOOKUP(C39,DO_A1_01!J6:N18,6,0)","v":424.13},{"$f":"IF(ARG1_01!E39=\"\",\"\",IF(G39=\"f\",IF(E39=ARG1_01!E39,\"ü\",\"û\"),\"\"))","v":"ü"},"f"]
[null,{"$f":"\"\"","v":""},{"$f":"IF(_xlfn.ISFORMULA(ARG1_01!E39),_xlfn.FORMULATEXT(ARG1_01!E39),\"\")","v":"=BUSCARH(C39,J8:N20,6,0)"},null,null,{"$f":"IF(ARG1_01!E40=\"\",\"\",IF(G40=\"f\",IF(E40=ARG1_01!E40,\"ü\",\"û\"),\"\"))","v":""}]
[null,{"$f":"\"\"","v":""},{"$f":"\"\"","v":""},{"$f":"\"\"","v":""},null,{"$f":"IF(ARG1_01!E41=\"\",\"\",IF(G41=\"f\",IF(E41=ARG1_01!E41,\"ü\",\"û\"),\"\"))","v":""}]
[null,{"$f":"\"\"","v":""},"Ejercicio →",null,null,{"$f":"IF(ARG1_01!E42=\"\",\"\",IF(G42=\"f\",IF(E42=ARG1_01!E42,\"ü\",\"û\"),\"\"))","v":""}]
[null,{"$f":"\"\"","v":""},{"$f":"IF(_xlfn.ISFORMULA(ARG1_01!E44),\"Ahora para marzo, evalúa que nro de fila será.\",\"\")","v":"Ahora para marzo, evalúa que nro de fila será."},null,null,{"$f":"IF(ARG1_01!E43=\"\",\"\",IF(G43=\"f\",IF(E43=ARG1_01!E43,\"ü\",\"û\"),\"\"))","v":""}]
[null,{"$f":"\"\"","v":""},{"$f":"INDEX($K$6:$N$6,RANDBETWEEN(1,2)*2-1)","v":"Norte"},null,{"$f":"HLOOKUP(C44,DO_A1_01!J6:N18,4,0)","v":589.17},{"$f":"IF(ARG1_01!E44=\"\",\"\",IF(G44=\"f\",IF(E44=ARG1_01!E44,\"ü\",\"û\"),\"\"))","v":"ü"},"f"]
[null,{"$f":"\"\"","v":""},{"$f":"IF(_xlfn.ISFORMULA(ARG1_01!E44),_xlfn.FORMULATEXT(ARG1_01!E44),\"\")","v":"=BUSCARH(C44,J8:N20,4,0)"},null,null,{"$f":"IF(ARG1_01!E45=\"\",\"\",IF(G45=\"f\",IF(E45=ARG1_01!E45,\"ü\",\"û\"),\"\"))","v":""}]
[{"$nulls":3},{"$f":"\"\"","v":""}]

{"sheet":"ARG1_01","index":3,"n_rows":45,"n_cols":14,"rows_kept":45,"hidden":true}
[null,"Argumento valor buscado"]
[null,"MOS Expert - CPC Martín Cruz - 998401784"]
[]
[]
[]
[null,{"$f":"lista01.02","v":""},"VALOR BUSCADO",null,null,{"$f":"lista01.03","v":""}]
[null,"","",null,null,"",null,null,{"$f":"lista01.01","v":""},"Columna 01\n ↓","Columna 02\n ↓","Columna 03\n ↓","Columna 04\n ↓","Columna 05\n ↓"]
[null,"►","SIN CELDA DE APOYO",null,null,"",null,null,"Fila 01 →","Meses","Norte","Sur","Este","Oeste"]
[null,"","",null,null,"",null,null,"Fila 02 →","Enero",298.57,468.34,202.08,164.79]
[null,"","¿A cuánto asciende la venta del mes de mayo de la zona Este?",null,null,"",null,null,"Fila 03 →","Febrero",347.81,322.59,477.71,324.46]
[null,"","Opción 1: BUSCARV",null,{"$f":"VLOOKUP(\"mayo\",J8:N20,4,0)","v":167.44},"ü",null,null,"Fila 04 →","Marzo",589.17,{"v":164,"d":"164.00"},{"v":573,"d":"573.00"},492.82]
[null,"","=BUSCARV(\"mayo\",J8:N20,4,0)",null,null,"",null,null,"Fila 05 →","Abril",470.43,317.97,562.22,452.91]
[null,"","",null,null,"",null,null,"Fila 06 →","Mayo",392.69,424.13,167.44,398.17]
[null,"","Ejercicio →",null,null,"",null,null,"Fila 07 →","Junio",408.46,{"v":461.4,"d":"461.40"},{"v":190,"d":"190.00"},222.53]
[null,"","Ahora para Norte, evalúa que nro de columna será.",null,{"$f":"VLOOKUP(\"mayo\",J8:N20,2,0)","v":392.69},"ü",null,null,"Fila 08 →","Julio",404.11,376.22,434.93,473.94]
[null,"","=BUSCARV(\"mayo\",J8:N20,2,0)",null,null,"",null,null,"Fila 09 →","Agosto",279.69,220.82,408.23,287.72]
[null,"","",null,null,"",null,null,"Fila 10 →","Setiembre",563.96,328.72,{"v":153.6,"d":"153.60"},148.13]
[null,"","Opción 2: BUSCARH",null,null,"",null,null,"Fila 11 →","Octubre",588.53,{"v":510.1,"d":"510.10"},251.11,411.21]
[null,"","=BUSCARH(\"este\",J8:N20,6,0)",null,{"$f":"HLOOKUP(\"este\",J8:N20,6,0)","v":167.44},"ü",null,null,"Fila 12 →","Noviembre",123.11,280.36,383.39,240.27]
[null,"","",null,null,"",null,null,"Fila 13 →","Diciembre",472.99,462.96,543.47,189.54]
[null,"","Ejercicio →",null,null,""]
[null,"","Ahora para Octubre, evalúa que nro de fila será.",null,{"$f":"HLOOKUP(\"este\",J8:N20,11,0)","v":251.11},"ü"]
[null,"","=BUSCARH(\"este\",J8:N20,11,0)",null,null,""]
[null,"","",null,null,""]
[null,"►","CON CELDA DE APOYO",null,null,""]
[null,"","",null,null,""]
[null,"","¿A cuánto asciende la venta del mes de Febrero de la zona Este?",null,null,""]
[null,"","Opción 1: BUSCARV",null,null,""]
[null,"","Febrero",null,{"$f":"VLOOKUP(C29,J8:N20,4,0)","v":477.71},"ü"]
[null,"","=BUSCARV(C29,J8:N20,4,0)",null,null,""]
[null,"","",null,null,""]
[null,"","Ejercicio →",null,null,""]
[null,"","Ahora para Sur, evalúa que nro de columna será.",null,null,""]
[null,"","Setiembre",null,{"$f":"VLOOKUP(C34,J8:N20,4,0)","v":153.6},"ü"]
[null,"","=BUSCARV(C34,J8:N20,4,0)",null,null,""]
[null,"","",null,null,""]
[null,"","¿A cuánto asciende la venta del mes de Mayo de la zona Sur?",null,null,""]
[null,"","Opción 2: BUSCARH",null,null,""]
[null,"","Sur",null,{"$f":"HLOOKUP(C39,J8:N20,6,0)","v":424.13},"ü"]
[null,"","=BUSCARH(C39,J8:N20,6,0)",null,null,""]
[null,"","",null,null,""]
[null,"","Ejercicio →",null,null,""]
[null,"","Ahora para marzo, evalúa que nro de fila será.",null,null,""]
[null,"","Norte",null,{"$f":"HLOOKUP(C44,J8:N20,4,0)","v":589.17},"ü"]
[null,"","=BUSCARH(C44,J8:N20,4,0)",null,null,""]

{"sheet":"DO_A1_02","index":4,"n_rows":27,"n_cols":23,"rows_kept":27,"hidden":true}
[]
[]
[]
[]
[]
[null,{"$f":"\"\"","v":""},"VALOR BUSCADO",{"$nulls":5},{"$f":"IF(ARG1_02!H6=\"\",\"\",IF(J6=\"f\",IF(H6=ARG1_02!H6,\"ü\",\"û\"),\"\"))","v":""}]
[null,{"$f":"\"\"","v":""},{"$f":"\"\"","v":""},{"$nulls":5},{"$f":"IF(ARG1_02!H7=\"\",\"\",IF(J7=\"f\",IF(H7=ARG1_02!H7,\"ü\",\"û\"),\"\"))","v":""}]
[null,"►","USO DE COMODINES",{"$nulls":5},{"$f":"IF(ARG1_02!H8=\"\",\"\",IF(J8=\"f\",IF(H8=ARG1_02!H8,\"ü\",\"û\"),\"\"))","v":""},null,null,"Vendedor","Clientes","Ventas","Margen",null,{"$f":"RAND()","v":0.5702787716577566},"Ochoa",0.7461077150205289,"José",{"$f":"VLOOKUP(LARGE($S$8:$S$20,ROWS(U$8:U8)),$S$8:$T$20,2,0)","v":"Oscar"},{"$f":"VLOOKUP(LARGE($Q$8:$Q$20,ROWS(V$8:V8)),$Q$8:$R$20,2,0)","v":"Santos"},{"$f":"U8&\" \"&V8","v":"Oscar Santos"}]
[null,{"$f":"\"\"","v":""},{"$f":"\"\"","v":""},{"$nulls":5},{"$f":"IF(ARG1_02!H9=\"\",\"\",IF(J9=\"f\",IF(H9=ARG1_02!H9,\"ü\",\"û\"),\"\"))","v":""},null,null,{"$f":"W8","v":"Oscar Santos"},{"$f":"RANDBETWEEN(5,15)","v":10},{"$f":"M9*RANDBETWEEN(80,150)","v":830},{"$f":"ROUND(N9*RANDBETWEEN(25,35)%,0)","v":249},null,0.4499097288903632,"Manco",0.1191160667773804,"Alberto",{"$f":"VLOOKUP(LARGE($S$8:$S$20,ROWS(U$8:U9)),$S$8:$T$20,2,0)","v":"Omar"},{"$f":"VLOOKUP(LARGE($Q$8:$Q$20,ROWS(V$8:V9)),$Q$8:$R$20,2,0)","v":"Baca"},"Omar Baca"]
[null,{"$f":"\"\"","v":""},{"$f":"\"¿A cuánto asciende las ventas del vendedor de apellido \"&C12&\"?\"","v":"¿A cuánto asciende las ventas del vendedor de apellido Rodriguez?"},{"$nulls":5},{"$f":"IF(ARG1_02!H10=\"\",\"\",IF(J10=\"f\",IF(H10=ARG1_02!H10,\"ü\",\"û\"),\"\"))","v":""},null,null,"Omar Baca",9,{"v":1080,"d":"1,080"},270,null,0.3631415892836787,"Rodriguez",0.04793606705623954,"Javier",{"$f":"VLOOKUP(LARGE($S$8:$S$20,ROWS(U$8:U10)),$S$8:$T$20,2,0)","v":"Eduardo"},{"$f":"VLOOKUP(LARGE($Q$8:$Q$20,ROWS(V$8:V10)),$Q$8:$R$20,2,0)","v":"Velasquez"},"Eduardo Velasquez"]
[null,{"$f":"\"\"","v":""},"Opción 1:",{"$nulls":5},{"$f":"IF(ARG1_02!H11=\"\",\"\",IF(J11=\"f\",IF(H11=ARG1_02!H11,\"ü\",\"û\"),\"\"))","v":""},null,null,"Eduardo Velasquez",6,840,227,null,0.9445550456601002,"Santos",0.2139330132867424,"Jesús",{"$f":"VLOOKUP(LARGE($S$8:$S$20,ROWS(U$8:U11)),$S$8:$T$20,2,0)","v":"Fabio"},{"$f":"VLOOKUP(LARGE($Q$8:$Q$20,ROWS(V$8:V11)),$Q$8:$R$20,2,0)","v":"Quispe"},"Fabio Quispe"]
[null,{"$f":"\"\"","v":""},{"$f":"INDEX($V$8:$V$17,RANDBETWEEN(1,10))","v":"Rodriguez"},{"$nulls":4},{"$f":"VLOOKUP(\"*\"&C12,$L$8:$O$18,3,0)","v":{"v":1243,"d":"1,243"}},{"$f":"IF(ARG1_02!H12=\"\",\"\",IF(J12=\"f\",IF(H12=ARG1_02!H12,\"ü\",\"û\"),\"\"))","v":""},"f",null,"Fabio Quispe",14,{"v":1624,"d":"1,624"},455,null,0.8467989917460967,"Baca",0.36736653040501044,"Jacob",{"$f":"VLOOKUP(LARGE($S$8:$S$20,ROWS(U$8:U12)),$S$8:$T$20,2,0)","v":"Francisco"},{"$f":"VLOOKUP(LARGE($Q$8:$Q$20,ROWS(V$8:V12)),$Q$8:$R$20,2,0)","v":"Ochoa"},"Francisco Ochoa"]
[null,{"$f":"\"\"","v":""},{"$f":"IF(_xlfn.ISFORMULA(ARG1_02!H12),_xlfn.FORMULATEXT(ARG1_02!H12),\"\")","v":""},{"$nulls":5},{"$f":"IF(ARG1_02!H13=\"\",\"\",IF(J13=\"f\",IF(H13=ARG1_02!H13,\"ü\",\"û\"),\"\"))","v":""},null,null,"Francisco Ochoa",13,{"v":1378,"d":"1,378"},427,null,0.7766777132651866,"Velasquez",0.24860154594186568,"Roger",{"$f":"VLOOKUP(LARGE($S$8:$S$20,ROWS(U$8:U13)),$S$8:$T$20,2,0)","v":"José"},{"$f":"VLOOKUP(LARGE($Q$8:$Q$20,ROWS(V$8:V13)),$Q$8:$R$20,2,0)","v":"Cespedes"},"José Cespedes"]
[null,{"$f":"\"\"","v":""},{"$f":"\"\"","v":""},{"$nulls":5},{"$f":"IF(ARG1_02!H14=\"\",\"\",IF(J14=\"f\",IF(H14=ARG1_02!H14,\"ü\",\"û\"),\"\"))","v":""},null,null,"José Cespedes",6,600,192,null,0.5463831675075433,"Cespedes",0.8889701605137544,"Eduardo",{"$f":"VLOOKUP(LARGE($S$8:$S$20,ROWS(U$8:U14)),$S$8:$T$20,2,0)","v":"Franco"},{"$f":"VLOOKUP(LARGE($Q$8:$Q$20,ROWS(V$8:V14)),$Q$8:$R$20,2,0)","v":"Zegarra"},"Franco Zegarra"]
[null,{"$f":"\"\"","v":""},"Opción 2:",{"$nulls":5},{"$f":"IF(ARG1_02!H15=\"\",\"\",IF(J15=\"f\",IF(H15=ARG1_02!H15,\"ü\",\"û\"),\"\"))","v":""},null,null,"Franco Zegarra",6,534,150,null,0.5030676328246386,"Zegarra",0.268965676357091,"Miguel",{"$f":"VLOOKUP(LARGE($S$8:$S$20,ROWS(U$8:U15)),$S$8:$T$20,2,0)","v":"Jacob"},{"$f":"VLOOKUP(LARGE($Q$8:$Q$20,ROWS(V$8:V15)),$Q$8:$R$20,2,0)","v":"Manco"},"Jacob Manco"]
[null,{"$f":"\"\"","v":""},{"$f":"\"¿Cuántos clientes generó el vendedor de nombre \"&C17&\"?\"","v":"¿Cuántos clientes generó el vendedor de nombre Fabio?"},{"$nulls":5},{"$f":"IF(ARG1_02!H16=\"\",\"\",IF(J16=\"f\",IF(H16=ARG1_02!H16,\"ü\",\"û\"),\"\"))","v":""},null,null,"Jacob Manco",9,936,271,null,0.025639658211045413,"Quiñones",0.7529606776144916,"Francisco",{"$f":"VLOOKUP(LARGE($S$8:$S$20,ROWS(U$8:U16)),$S$8:$T$20,2,0)","v":"Miguel"},{"$f":"VLOOKUP(LARGE($Q$8:$Q$20,ROWS(V$8:V16)),$Q$8:$R$20,2,0)","v":"Rodriguez"},"Miguel Rodriguez"]
[null,{"$f":"\"\"","v":""},{"$f":"INDEX($U$8:$U$17,RANDBETWEEN(1,10))","v":"Fabio"},{"$nulls":4},{"$f":"VLOOKUP(C17&\"*\",$L$8:$O$18,2,0)","v":14},{"$f":"IF(ARG1_02!H17=\"\",\"\",IF(J17=\"f\",IF(H17=ARG1_02!H17,\"ü\",\"û\"),\"\"))","v":""},"f",null,"Miguel Rodriguez",11,{"v":1243,"d":"1,243"},410,null,0.18821414187131336,"Atoche",0.7534671214824584,"Fabio",{"$f":"VLOOKUP(LARGE($S$8:$S$20,ROWS(U$8:U17)),$S$8:$T$20,2,0)","v":"Roger"},{"$f":"VLOOKUP(LARGE($Q$8:$Q$20,ROWS(V$8:V17)),$Q$8:$R$20,2,0)","v":"Atoche"},"Roger Atoche"]
[null,{"$f":"\"\"","v":""},{"$f":"IF(_xlfn.ISFORMULA(ARG1_02!H17),_xlfn.FORMULATEXT(ARG1_02!H17),\"\")","v":""},{"$nulls":5},{"$f":"IF(ARG1_02!H18=\"\",\"\",IF(J18=\"f\",IF(H18=ARG1_02!H18,\"ü\",\"û\"),\"\"))","v":""},null,null,"Roger Atoche",7,854,231,null,0.770885340994957,"Quispe",0.9303561708573924,"Omar",{"$f":"VLOOKUP(LARGE($S$8:$S$20,ROWS(U$8:U18)),$S$8:$T$20,2,0)","v":"Jesús"},{"$f":"VLOOKUP(LARGE($Q$8:$Q$20,ROWS(V$8:V18)),$Q$8:$R$20,2,0)","v":"Miranda"},"Jesús Miranda"]
[null,{"$f":"\"\"","v":""},{"$f":"\"\"","v":""},{"$nulls":5},{"$f":"IF(ARG1_02!H19=\"\",\"\",IF(J19=\"f\",IF(H19=ARG1_02!H19,\"ü\",\"û\"),\"\"))","v":""},{"$nulls":7},0.06742890876033969,"Miranda",0.5349059889346609,"Franco",{"$f":"VLOOKUP(LARGE($S$8:$S$20,ROWS(U$8:U19)),$S$8:$T$20,2,0)","v":"Alberto"},{"$f":"VLOOKUP(LARGE($Q$8:$Q$20,ROWS(V$8:V19)),$Q$8:$R$20,2,0)","v":"Cabello"},"Alberto Cabello"]
[null,{"$f":"\"\"","v":""},"Ejercicio →",{"$nulls":5},{"$f":"IF(ARG1_02!H20=\"\",\"\",IF(J20=\"f\",IF(H20=ARG1_02!H20,\"ü\",\"û\"),\"\"))","v":""},{"$nulls":7},0.045939750010297487,"Cabello",0.9672938450797276,"Oscar",{"$f":"VLOOKUP(LARGE($S$8:$S$20,ROWS(U$8:U20)),$S$8:$T$20,2,0)","v":"Javier"},{"$f":"VLOOKUP(LARGE($Q$8:$Q$20,ROWS(V$8:V20)),$Q$8:$R$20,2,0)","v":"Quiñones"},"Javier Quiñones"]
[null,{"$f":"\"\"","v":""},{"$f":"\"¿A cuánto asciende el margen de ventas del vendedor de nombre \"","v":"¿A cuánto asciende el margen de ventas del vendedor de nombre "},{"$nulls":5},{"$f":"IF(ARG1_02!H21=\"\",\"\",IF(J21=\"f\",IF(H21=ARG1_02!H21,\"ü\",\"û\"),\"\"))","v":""}]
[null,{"$f":"\"\"","v":""},{"$f":"\"tenga sólo 4 letras?\"","v":"tenga sólo 4 letras?"},{"$nulls":4},{"$f":"IFERROR(VLOOKUP(\"???? *\",$L$8:$O$18,4,0),\"No existe\")","v":270},{"$f":"IF(ARG1_02!H22=\"\",\"\",IF(J22=\"f\",IF(H22=ARG1_02!H22,\"ü\",\"û\"),\"\"))","v":""},"f"]
[null,{"$f":"\"\"","v":""},{"$f":"IF(_xlfn.ISFORMULA(ARG1_02!H22),_xlfn.FORMULATEXT(ARG1_02!H22),\"\")","v":""},{"$nulls":5},{"$f":"IF(ARG1_02!H23=\"\",\"\",IF(J23=\"f\",IF(H23=ARG1_02!H23,\"ü\",\"û\"),\"\"))","v":""}]
[null,{"$f":"\"\"","v":""},{"$f":"\"\"","v":""},{"$nulls":5},{"$f":"IF(ARG1_02!H24=\"\",\"\",IF(J24=\"f\",IF(H24=ARG1_02!H24,\"ü\",\"û\"),\"\"))","v":""}]
[null,{"$f":"\"\"","v":""},{"$f":"\"¿A cuánto asciende las ventas del vendedor de nombre \"","v":"¿A cuánto asciende las ventas del vendedor de nombre "},{"$nulls":5},{"$f":"IF(ARG1_02!H25=\"\",\"\",IF(J25=\"f\",IF(H25=ARG1_02!H25,\"ü\",\"û\"),\"\"))","v":""}]
[null,{"$f":"\"\"","v":""},{"$f":"\"tenga sólo 6 letras y que termine con la letra o?\"","v":"tenga sólo 6 letras y que termine con la letra o?"},{"$nulls":4},{"$f":"IFERROR(VLOOKUP(\"?????o *\",$L$8:$O$18,3,0),\"No existe\")","v":534},{"$f":"IF(ARG1_02!H26=\"\",\"\",IF(J26=\"f\",IF(H26=ARG1_02!H26,\"ü\",\"û\"),\"\"))","v":""},"f"]
[null,{"$f":"\"\"","v":""},{"$f":"IF(_xlfn.ISFORMULA(ARG1_02!H26),_xlfn.FORMULATEXT(ARG1_02!H26),\"\")","v":""},{"$nulls":5},{"$f":"IF(ARG1_02!H27=\"\",\"\",IF(J27=\"f\",IF(H27=ARG1_02!H27,\"ü\",\"û\"),\"\"))","v":""}]

{"sheet":"ARG1_02","index":5,"n_rows":27,"n_cols":14,"rows_kept":27,"hidden":true}
[null,"Argumento valor buscado"]
[null,"MOS Expert - CPC Martín Cruz - 998401784"]
[]
[]
[]
[null,{"$f":"lista01.04","v":""},"VALOR BUSCADO",{"$nulls":5},{"$f":"lista01.05","v":""}]
[null,"","",{"$nulls":5},""]
[null,"►","USO DE COMODINES",{"$nulls":5},"",null,{"$f":"lista01.06","v":"Vendedor"},"Clientes","Ventas","Margen"]
[null,"","",{"$nulls":5},"",null,"Oscar Santos",10,830,249]
[null,"","¿A cuánto asciende las ventas del vendedor de apellido Rodriguez?",{"$nulls":5},"",null,"Omar Baca",9,{"v":1080,"d":"1,080"},270]
[null,"","Opción 1:",{"$nulls":5},"",null,"Eduardo Velasquez",6,840,227]
[null,"","Rodriguez",{"$nulls":5},"",null,"Fabio Quispe",14,{"v":1624,"d":"1,624"},455]
[null,"","",{"$nulls":5},"",null,"Francisco Ochoa",13,{"v":1378,"d":"1,378"},427]
[null,"","",{"$nulls":5},"",null,"José Cespedes",6,600,192]
[null,"","Opción 2:",{"$nulls":5},"",null,"Franco Zegarra",6,534,150]
[null,"","¿Cuántos clientes generó el vendedor de nombre Fabio?",{"$nulls":5},"",null,"Jacob Manco",9,936,271]
[null,"","Fabio",{"$nulls":5},"",null,"Miguel Rodriguez",11,{"v":1243,"d":"1,243"},410]
[null,"","",{"$nulls":5},"",null,"Roger Atoche",7,854,231]
[null,"","",{"$nulls":5},""]
[null,"","Ejercicio →",{"$nulls":5},""]
[null,"","¿A cuánto asciende el margen de ventas del vendedor de nombre ",{"$nulls":5},""]
[null,"","tenga sólo 4 letras?",{"$nulls":5},""]
[null,"","",{"$nulls":5},""]
[null,"","",{"$nulls":5},""]
[null,"","¿A cuánto asciende las ventas del vendedor de nombre ",{"$nulls":5},""]
[null,"","tenga sólo 6 letras y que termine con la letra o?",{"$nulls":5},""]
[null,"","",{"$nulls":5},""]

{"sheet":"DO_A1_03","index":6,"n_rows":22,"n_cols":21,"rows_kept":22,"hidden":true}
[]
[]
[]
[]
[]
[null,{"$f":"\"\"","v":""},"VALOR BUSCADO",{"$nulls":5},{"$f":"IF(ARG1_03!H6=\"\",\"\",IF(J6=\"f\",IF(H6=ARG1_03!H6,\"ü\",\"û\"),\"\"))","v":""}]
[null,{"$f":"\"\"","v":""},{"$f":"\"\"","v":""},{"$nulls":5},{"$f":"IF(ARG1_03!H7=\"\",\"\",IF(J7=\"f\",IF(H7=ARG1_03!H7,\"ü\",\"û\"),\"\"))","v":""}]
[null,"►","CORRECCIONES DE DATOS (1)",{"$nulls":5},{"$f":"IF(ARG1_03!H8=\"\",\"\",IF(J8=\"f\",IF(H8=ARG1_03!H8,\"ü\",\"û\"),\"\"))","v":""},null,null,"Código","Nombre","Cantidad","Pedido",null,{"$f":"RAND()","v":0.6621047506647427},"José",{"$f":"VLOOKUP(LARGE($Q$8:$Q$20,ROWS(S$8:S8)),$Q$8:$R$20,2,0)","v":"Roger"},null,"Aceite"]
[null,{"$f":"\"\"","v":""},{"$f":"\"\"","v":""},{"$nulls":5},{"$f":"IF(ARG1_03!H9=\"\",\"\",IF(J9=\"f\",IF(H9=ARG1_03!H9,\"ü\",\"û\"),\"\"))","v":""},null,null,{"$f":"RANDBETWEEN(1000,9000)&IF(MOD(ROWS(L$9:L9),2)=0,\"\",\" \")","v":"3305 "},{"$f":"S8","v":"Roger"},{"$f":"RANDBETWEEN(10,25)","v":15},{"$f":"INDEX($U$8:$U$11,RANDBETWEEN(1,4))","v":"Harina"},null,0.714673948021152,"Alberto",{"$f":"VLOOKUP(LARGE($Q$8:$Q$20,ROWS(S$8:S9)),$Q$8:$R$20,2,0)","v":"Javier"},null,"Harina"]
[null,{"$f":"\"\"","v":""},{"$f":"\"¿A cuánto asciende la cantidad de pedido del código \"&C12&\"?\"","v":"¿A cuánto asciende la cantidad de pedido del código 4727?"},{"$nulls":5},{"$f":"IF(ARG1_03!H10=\"\",\"\",IF(J10=\"f\",IF(H10=ARG1_03!H10,\"ü\",\"û\"),\"\"))","v":""},null,null,{"$f":"RANDBETWEEN(1000,9000)&IF(MOD(ROWS(L$9:L10),2)=0,\"\",\" \")","v":"4727"},"Javier",17,"Galletas",null,0.8804659919905263,"Javier",{"$f":"VLOOKUP(LARGE($Q$8:$Q$20,ROWS(S$8:S10)),$Q$8:$R$20,2,0)","v":"Jacob"},null,"Galletas"]
[null,{"$f":"\"\"","v":""},"Opción 1:",{"$nulls":5},{"$f":"IF(ARG1_03!H11=\"\",\"\",IF(J11=\"f\",IF(H11=ARG1_03!H11,\"ü\",\"û\"),\"\"))","v":""},null,null,{"$f":"RANDBETWEEN(1000,9000)&IF(MOD(ROWS(L$9:L11),2)=0,\"\",\" \")","v":"2702 "},"Jacob",19,"Conservas",null,0.10433959220442679,"Jesús",{"$f":"VLOOKUP(LARGE($Q$8:$Q$20,ROWS(S$8:S11)),$Q$8:$R$20,2,0)","v":"Franco"},null,"Conservas"]
[null,{"$f":"\"\"","v":""},{"$f":"INDEX($L$9:$L$18,RANDBETWEEN(1,5)*2)*1","v":4727},{"$nulls":4},{"$f":"VLOOKUP(C12&\"\",$L$8:$O$18,3,0)","v":17},{"$f":"IF(ARG1_03!H12=\"\",\"\",IF(J12=\"f\",IF(H12=ARG1_03!H12,\"ü\",\"û\"),\"\"))","v":""},"f",null,{"$f":"RANDBETWEEN(1000,9000)&IF(MOD(ROWS(L$9:L12),2)=0,\"\",\" \")","v":"3791"},"Franco",12,"Galletas",null,0.8597702005039014,"Jacob",{"$f":"VLOOKUP(LARGE($Q$8:$Q$20,ROWS(S$8:S12)),$Q$8:$R$20,2,0)","v":"Oscar"}]
[null,{"$f":"\"\"","v":""},{"$f":"IF(_xlfn.ISFORMULA(ARG1_03!H12),_xlfn.FORMULATEXT(ARG1_03!H12),\"\")","v":""},{"$nulls":5},{"$f":"IF(ARG1_03!H13=\"\",\"\",IF(J13=\"f\",IF(H13=ARG1_03!H13,\"ü\",\"û\"),\"\"))","v":""},null,null,{"$f":"RANDBETWEEN(1000,9000)&IF(MOD(ROWS(L$9:L13),2)=0,\"\",\" \")","v":"3626 "},"Oscar",13,"Aceite",null,0.9387350738142096,"Roger",{"$f":"VLOOKUP(LARGE($Q$8:$Q$20,ROWS(S$8:S13)),$Q$8:$R$20,2,0)","v":"Alberto"}]
[null,{"$f":"\"\"","v":""},{"$f":"\"\"","v":""},{"$nulls":5},{"$f":"IF(ARG1_03!H14=\"\",\"\",IF(J14=\"f\",IF(H14=ARG1_03!H14,\"ü\",\"û\"),\"\"))","v":""},null,null,{"$f":"RANDBETWEEN(1000,9000)&IF(MOD(ROWS(L$9:L14),2)=0,\"\",\" \")","v":"6823"},"Alberto",24,"Harina",null,0.22892386861018266,"Eduardo",{"$f":"VLOOKUP(LARGE($Q$8:$Q$20,ROWS(S$8:S14)),$Q$8:$R$20,2,0)","v":"Francisco"}]
[null,{"$f":"\"\"","v":""},{"$f":"IF(I12=\"ü\",\"¿Es NUMERO?\",\"\")","v":""},{"$nulls":4},{"$f":"ISNUMBER(C12)","v":true},{"$f":"IF(ARG1_03!H15=\"\",\"\",IF(J15=\"f\",IF(H15=ARG1_03!H15,\"ü\",\"û\"),\"\"))","v":""},"f",null,{"$f":"RANDBETWEEN(1000,9000)&IF(MOD(ROWS(L$9:L15),2)=0,\"\",\" \")","v":"7261 "},"Francisco",17,"Conservas",null,0.274637997423149,"Miguel",{"$f":"VLOOKUP(LARGE($Q$8:$Q$20,ROWS(S$8:S15)),$Q$8:$R$20,2,0)","v":"José"}]
[null,{"$f":"\"\"","v":""},{"$f":"IF(_xlfn.ISFORMULA(ARG1_03!H15),IF(I12=\"ü\",_xlfn.FORMULATEXT(ARG1_03!H15),\"\"),\"\")","v":""},{"$nulls":5},{"$f":"IF(ARG1_03!H16=\"\",\"\",IF(J16=\"f\",IF(H16=ARG1_03!H16,\"ü\",\"û\"),\"\"))","v":""},null,null,{"$f":"RANDBETWEEN(1000,9000)&IF(MOD(ROWS(L$9:L16),2)=0,\"\",\" \")","v":"1882"},"José",11,"Conservas",null,0.6641642736926133,"Francisco",{"$f":"VLOOKUP(LARGE($Q$8:$Q$20,ROWS(S$8:S16)),$Q$8:$R$20,2,0)","v":"Fabio"}]
[null,{"$f":"\"\"","v":""},{"$f":"IF(I12=\"ü\",\"¿Es TEXTO?\",\"\")","v":""},{"$nulls":4},{"$f":"ISTEXT(C12)","v":false},{"$f":"IF(ARG1_03!H17=\"\",\"\",IF(J17=\"f\",IF(H17=ARG1_03!H17,\"ü\",\"û\"),\"\"))","v":""},"f",null,{"$f":"RANDBETWEEN(1000,9000)&IF(MOD(ROWS(L$9:L17),2)=0,\"\",\" \")","v":"1193 "},"Fabio",20,"Galletas",null,0.6336405856812941,"Fabio",{"$f":"VLOOKUP(LARGE($Q$8:$Q$20,ROWS(S$8:S17)),$Q$8:$R$20,2,0)","v":"Omar"}]
[null,{"$f":"\"\"","v":""},{"$f":"IF(_xlfn.ISFORMULA(ARG1_03!H17),IF(I12=\"ü\",_xlfn.FORMULATEXT(ARG1_03!H17),\"\"),\"\")","v":""},{"$nulls":5},{"$f":"IF(ARG1_03!H18=\"\",\"\",IF(J18=\"f\",IF(H18=ARG1_03!H18,\"ü\",\"û\"),\"\"))","v":""},null,null,{"$f":"RANDBETWEEN(1000,9000)&IF(MOD(ROWS(L$9:L18),2)=0,\"\",\" \")","v":"3783"},"Omar",22,"Galletas",null,0.36004245979556415,"Omar",{"$f":"VLOOKUP(LARGE($Q$8:$Q$20,ROWS(S$8:S18)),$Q$8:$R$20,2,0)","v":"Miguel"}]
[null,{"$f":"\"\"","v":""},{"$f":"\"\"","v":""},{"$nulls":5},{"$f":"IF(ARG1_03!H19=\"\",\"\",IF(J19=\"f\",IF(H19=ARG1_03!H19,\"ü\",\"û\"),\"\"))","v":""},{"$nulls":7},0.8372456111536414,"Franco",{"$f":"VLOOKUP(LARGE($Q$8:$Q$20,ROWS(S$8:S19)),$Q$8:$R$20,2,0)","v":"Eduardo"}]
[null,{"$f":"\"\"","v":""},"Ejercicio →",{"$nulls":5},{"$f":"IF(ARG1_03!H20=\"\",\"\",IF(J20=\"f\",IF(H20=ARG1_03!H20,\"ü\",\"û\"),\"\"))","v":""},{"$nulls":7},0.7316783769822595,"Oscar",{"$f":"VLOOKUP(LARGE($Q$8:$Q$20,ROWS(S$8:S20)),$Q$8:$R$20,2,0)","v":"Jesús"}]
[null,{"$f":"\"\"","v":""},{"$f":"INDEX($L$9:$L$18,RANDBETWEEN(1,5)*2-1)*1","v":2702},{"$nulls":4},{"$f":"VLOOKUP(C21&\" \",$L$8:$O$18,3,0)","v":19},{"$f":"IF(ARG1_03!H21=\"\",\"\",IF(J21=\"f\",IF(H21=ARG1_03!H21,\"ü\",\"û\"),\"\"))","v":""},"f"]
[null,{"$f":"\"\"","v":""},{"$f":"IF(_xlfn.ISFORMULA(ARG1_03!H21),_xlfn.FORMULATEXT(ARG1_03!H21),\"\")","v":""},{"$nulls":5},{"$f":"IF(ARG1_03!H22=\"\",\"\",IF(J22=\"f\",IF(H22=ARG1_03!H22,\"ü\",\"û\"),\"\"))","v":""}]

{"sheet":"ARG1_03","index":7,"n_rows":22,"n_cols":14,"rows_kept":22,"hidden":true}
[null,"Argumento valor buscado"]
[null,"MOS Expert - CPC Martín Cruz - 998401784"]
[]
[]
[]
[null,{"$f":"lista01.07","v":""},"VALOR BUSCADO",{"$nulls":5},{"$f":"lista01.08","v":""}]
[null,"","",{"$nulls":5},""]
[null,"►","CORRECCIONES DE DATOS (1)",{"$nulls":5},"",null,{"$f":"lista01.09","v":"Código"},"Nombre","Cantidad","Pedido"]
[null,"","",{"$nulls":5},"",null,"3305 ","Roger",15,"Harina"]
[null,"","¿A cuánto asciende la cantidad de pedido del código 4727?",{"$nulls":5},"",null,"4727","Javier",17,"Galletas"]
[null,"","Opción 1:",{"$nulls":5},"",null,"2702 ","Jacob",19,"Conservas"]
[null,"",4727,{"$nulls":5},"",null,"3791","Franco",12,"Galletas"]
[null,"","",{"$nulls":5},"",null,"3626 ","Oscar",13,"Aceite"]
[null,"","",{"$nulls":5},"",null,"6823","Alberto",24,"Harina"]
[null,"","",{"$nulls":5},"",null,"7261 ","Francisco",17,"Conservas"]
[null,"","",{"$nulls":5},"",null,"1882","José",11,"Conservas"]
[null,"","",{"$nulls":5},"",null,"1193 ","Fabio",20,"Galletas"]
[null,"","",{"$nulls":5},"",null,"3783","Omar",22,"Galletas"]
[null,"","",{"$nulls":5},""]
[null,"","Ejercicio →",{"$nulls":5},""]
[null,"",2702,{"$nulls":5},""]
[null,"","",{"$nulls":5},""]

{"sheet":"DO_A1_04","index":8,"n_rows":22,"n_cols":21,"rows_kept":22,"hidden":true}
[]
[]
[]
[]
[]
[null,{"$f":"\"\"","v":""},"VALOR BUSCADO",{"$nulls":5},{"$f":"IF(ARG1_04!H6=\"\",\"\",IF(J6=\"f\",IF(H6=ARG1_04!H6,\"ü\",\"û\"),\"\"))","v":""}]
[null,{"$f":"\"\"","v":""},{"$f":"\"\"","v":""},{"$nulls":5},{"$f":"IF(ARG1_04!H7=\"\",\"\",IF(J7=\"f\",IF(H7=ARG1_04!H7,\"ü\",\"û\"),\"\"))","v":""}]
[null,"►","CORRECCIONES DE DATOS (2)",{"$nulls":5},{"$f":"IF(ARG1_04!H8=\"\",\"\",IF(J8=\"f\",IF(H8=ARG1_04!H8,\"ü\",\"û\"),\"\"))","v":""},null,null,"Código","Nombre","Cantidad","Pedido",null,{"$f":"RAND()","v":0.8619785089490013},"José",{"$f":"VLOOKUP(LARGE($Q$8:$Q$20,ROWS(S$8:S8)),$Q$8:$R$20,2,0)","v":"Oscar"},null,"Aceite"]
[null,{"$f":"\"\"","v":""},{"$f":"\"\"","v":""},{"$nulls":5},{"$f":"IF(ARG1_04!H9=\"\",\"\",IF(J9=\"f\",IF(H9=ARG1_04!H9,\"ü\",\"û\"),\"\"))","v":""},null,null,{"$f":"RANDBETWEEN(1000,9000)","v":8131},{"$f":"S8","v":"Oscar"},{"$f":"RANDBETWEEN(10,25)","v":14},{"$f":"INDEX($U$8:$U$11,RANDBETWEEN(1,4))","v":"Galletas"},null,0.84097710824897,"Alberto",{"$f":"VLOOKUP(LARGE($Q$8:$Q$20,ROWS(S$8:S9)),$Q$8:$R$20,2,0)","v":"Jacob"},null,"Harina"]
[null,{"$f":"\"\"","v":""},{"$f":"\"¿Qué producto ha pedido del código \"&C12&\"?\"","v":"¿Qué producto ha pedido del código 7035?"},{"$nulls":5},{"$f":"IF(ARG1_04!H10=\"\",\"\",IF(J10=\"f\",IF(H10=ARG1_04!H10,\"ü\",\"û\"),\"\"))","v":""},null,null,2983,"Jacob",10,"Conservas",null,0.4340834453960021,"Javier",{"$f":"VLOOKUP(LARGE($Q$8:$Q$20,ROWS(S$8:S10)),$Q$8:$R$20,2,0)","v":"José"},null,"Galletas"]
[null,{"$f":"\"\"","v":""},"Opción 1:",{"$nulls":5},{"$f":"IF(ARG1_04!H11=\"\",\"\",IF(J11=\"f\",IF(H11=ARG1_04!H11,\"ü\",\"û\"),\"\"))","v":""},null,null,3307,"José",19,"Aceite",null,0.533135732478822,"Jesús",{"$f":"VLOOKUP(LARGE($Q$8:$Q$20,ROWS(S$8:S11)),$Q$8:$R$20,2,0)","v":"Roger"},null,"Conservas"]
[null,{"$f":"\"\"","v":""},{"$f":"INDEX($L$9:$L$18,RANDBETWEEN(1,5)*2)&\"\"","v":"7035"},{"$nulls":4},{"$f":"VLOOKUP(VALUE(C12),$L$8:$O$18,3,0)","v":12},{"$f":"IF(ARG1_04!H12=\"\",\"\",IF(J12=\"f\",IF(H12=ARG1_04!H12,\"ü\",\"û\"),\"\"))","v":""},"f",null,1786,"Roger",12,"Aceite",null,0.8717779598885,"Jacob",{"$f":"VLOOKUP(LARGE($Q$8:$Q$20,ROWS(S$8:S12)),$Q$8:$R$20,2,0)","v":"Alberto"}]
[null,{"$f":"\"\"","v":""},{"$f":"IF(_xlfn.ISFORMULA(ARG1_04!H12),_xlfn.FORMULATEXT(ARG1_04!H12),\"\")","v":""},{"$nulls":5},{"$f":"IF(ARG1_04!H13=\"\",\"\",IF(J13=\"f\",IF(H13=ARG1_04!H13,\"ü\",\"û\"),\"\"))","v":""},null,null,3853,"Alberto",16,"Conservas",null,0.8597385115433978,"Roger",{"$f":"VLOOKUP(LARGE($Q$8:$Q$20,ROWS(S$8:S13)),$Q$8:$R$20,2,0)","v":"Fabio"}]
[null,{"$f":"\"\"","v":""},{"$f":"\"\"","v":""},{"$nulls":5},{"$f":"IF(ARG1_04!H14=\"\",\"\",IF(J14=\"f\",IF(H14=ARG1_04!H14,\"ü\",\"û\"),\"\"))","v":""},null,null,6785,"Fabio",25,"Aceite",null,0.6621743493063073,"Eduardo",{"$f":"VLOOKUP(LARGE($Q$8:$Q$20,ROWS(S$8:S14)),$Q$8:$R$20,2,0)","v":"Miguel"}]
[null,{"$f":"\"\"","v":""},{"$f":"IF(I12=\"ü\",\"¿Es NUMERO?\",\"\")","v":""},{"$nulls":4},{"$f":"ISNUMBER(C12)","v":false},{"$f":"IF(ARG1_04!H15=\"\",\"\",IF(J15=\"f\",IF(H15=ARG1_04!H15,\"ü\",\"û\"),\"\"))","v":""},"f",null,2066,"Miguel",12,"Conservas",null,0.7815127599974862,"Miguel",{"$f":"VLOOKUP(LARGE($Q$8:$Q$20,ROWS(S$8:S15)),$Q$8:$R$20,2,0)","v":"Eduardo"}]
[null,{"$f":"\"\"","v":""},{"$f":"IF(_xlfn.ISFORMULA(ARG1_04!H15),IF(I12=\"ü\",_xlfn.FORMULATEXT(ARG1_04!H15),\"\"),\"\")","v":""},{"$nulls":5},{"$f":"IF(ARG1_04!H16=\"\",\"\",IF(J16=\"f\",IF(H16=ARG1_04!H16,\"ü\",\"û\"),\"\"))","v":""},null,null,7035,"Eduardo",12,"Conservas",null,0.5931601079615627,"Francisco",{"$f":"VLOOKUP(LARGE($Q$8:$Q$20,ROWS(S$8:S16)),$Q$8:$R$20,2,0)","v":"Francisco"}]
[null,{"$f":"\"\"","v":""},{"$f":"IF(I12=\"ü\",\"¿Es TEXTO?\",\"\")","v":""},{"$nulls":4},{"$f":"ISTEXT(C12)","v":true},{"$f":"IF(ARG1_04!H17=\"\",\"\",IF(J17=\"f\",IF(H17=ARG1_04!H17,\"ü\",\"û\"),\"\"))","v":""},"f",null,4442,"Francisco",15,"Galletas",null,0.8344860717066023,"Fabio",{"$f":"VLOOKUP(LARGE($Q$8:$Q$20,ROWS(S$8:S17)),$Q$8:$R$20,2,0)","v":"Franco"}]
[null,{"$f":"\"\"","v":""},{"$f":"IF(_xlfn.ISFORMULA(ARG1_04!H17),IF(I12=\"ü\",_xlfn.FORMULATEXT(ARG1_04!H17),\"\"),\"\")","v":""},{"$nulls":5},{"$f":"IF(ARG1_04!H18=\"\",\"\",IF(J18=\"f\",IF(H18=ARG1_04!H18,\"ü\",\"û\"),\"\"))","v":""},null,null,4270,"Franco",10,"Galletas",null,0.4434412680466453,"Omar",{"$f":"VLOOKUP(LARGE($Q$8:$Q$20,ROWS(S$8:S18)),$Q$8:$R$20,2,0)","v":"Jesús"}]
[null,{"$f":"\"\"","v":""},{"$f":"\"\"","v":""},{"$nulls":5},{"$f":"IF(ARG1_04!H19=\"\",\"\",IF(J19=\"f\",IF(H19=ARG1_04!H19,\"ü\",\"û\"),\"\"))","v":""},{"$nulls":7},0.5923616824629638,"Franco",{"$f":"VLOOKUP(LARGE($Q$8:$Q$20,ROWS(S$8:S19)),$Q$8:$R$20,2,0)","v":"Omar"}]
[null,{"$f":"\"\"","v":""},"Ejercicio →",{"$nulls":5},{"$f":"IF(ARG1_04!H20=\"\",\"\",IF(J20=\"f\",IF(H20=ARG1_04!H20,\"ü\",\"û\"),\"\"))","v":""},{"$nulls":7},0.9962193558630534,"Oscar",{"$f":"VLOOKUP(LARGE($Q$8:$Q$20,ROWS(S$8:S20)),$Q$8:$R$20,2,0)","v":"Javier"}]
[null,{"$f":"\"\"","v":""},{"$f":"INDEX($L$9:$L$18,RANDBETWEEN(1,5)*2-1)&\" \"","v":"2066 "},{"$nulls":4},{"$f":"VLOOKUP(VALUE(LEFT(C21,4)),$L$8:$O$18,3,0)","v":12},{"$f":"IF(ARG1_04!H21=\"\",\"\",IF(J21=\"f\",IF(H21=ARG1_04!H21,\"ü\",\"û\"),\"\"))","v":""},"f"]
[null,{"$f":"\"\"","v":""},{"$f":"IF(_xlfn.ISFORMULA(ARG1_04!H21),_xlfn.FORMULATEXT(ARG1_04!H21),\"\")","v":""},{"$nulls":5},{"$f":"IF(ARG1_04!H22=\"\",\"\",IF(J22=\"f\",IF(H22=ARG1_04!H22,\"ü\",\"û\"),\"\"))","v":""}]

{"sheet":"ARG1_04","index":9,"n_rows":22,"n_cols":14,"rows_kept":22,"hidden":true}
[null,"Argumento valor buscado"]
[null,"MOS Expert - CPC Martín Cruz - 998401784"]
[]
[]
[]
[null,{"$f":"lista01.10","v":""},"VALOR BUSCADO",{"$nulls":5},{"$f":"lista01.11","v":""}]
[null,"","",{"$nulls":5},""]
[null,"►","CORRECCIONES DE DATOS (2)",{"$nulls":5},"",null,{"$f":"lista01.12","v":"Código"},"Nombre","Cantidad","Pedido"]
[null,"","",{"$nulls":5},"",null,8131,"Oscar",14,"Galletas"]
[null,"","¿Qué producto ha pedido del código 7035?",{"$nulls":5},"",null,2983,"Jacob",10,"Conservas"]
[null,"","Opción 1:",{"$nulls":5},"",null,3307,"José",19,"Aceite"]
[null,"","7035",{"$nulls":5},"",null,1786,"Roger",12,"Aceite"]
[null,"","",{"$nulls":5},"",null,3853,"Alberto",16,"Conservas"]
[null,"","",{"$nulls":5},"",null,6785,"Fabio",25,"Aceite"]
[null,"","",{"$nulls":5},"",null,2066,"Miguel",12,"Conservas"]
[null,"","",{"$nulls":5},"",null,7035,"Eduardo",12,"Conservas"]
[null,"","",{"$nulls":5},"",null,4442,"Francisco",15,"Galletas"]
[null,"","",{"$nulls":5},"",null,4270,"Franco",10,"Galletas"]
[null,"","",{"$nulls":5},""]
[null,"","Ejercicio →",{"$nulls":5},""]
[null,"","2066 ",{"$nulls":5},""]
[null,"","",{"$nulls":5},""]

{"sheet":"DO_A1_05","index":10,"n_rows":21,"n_cols":25,"rows_kept":21,"hidden":true}
[]
[]
[]
[]
[]
[null,{"$f":"\"\"","v":""},"VALOR BUSCADO"]
[null,{"$f":"\"\"","v":""},{"$f":"\"\"","v":""}]
[null,"►","VALORES REPETIDOS",{"$nulls":9},"Unicode","Código","Nombre","Cantidad","Pedido"]
[null,{"$f":"\"\"","v":""},{"$f":"\"\"","v":""},{"$nulls":9},{"$f":"N9&\"-\"&COUNTIF(N$9:N9,N9)","v":"2732-1"},{"$f":"V9","v":2732},{"$f":"W9","v":"Jacob"},{"$f":"RANDBETWEEN(10,25)","v":13},{"$f":"INDEX($Y$9:$Y$12,RANDBETWEEN(1,4))","v":"Aceite"},null,{"$f":"RAND()","v":0.7896420903506034},{"$f":"RANDBETWEEN(1000,9000)","v":4094},"José",{"$f":"INDEX($T$9:$T$21,RANDBETWEEN(1,13))","v":2732},{"$f":"VLOOKUP(V9,$T$9:$U$21,2,0)","v":"Jacob"},null,"Aceite"]
[null,{"$f":"\"\"","v":""},{"$f":"\"¿Cuáles fueron los pedidos del código \"&C12&\"?\"","v":"¿Cuáles fueron los pedidos del código 8015?"},{"$nulls":5},"f","f",null,null,{"$f":"N10&\"-\"&COUNTIF(N$9:N10,N10)","v":"3582-1"},3582,"Roger",10,"Harina",null,0.14508622765846435,2297,"Alberto",{"$f":"INDEX($T$9:$T$21,RANDBETWEEN(1,13))","v":3582},"Roger",null,"Harina"]
[null,{"$f":"\"\"","v":""},"Ejercicio →",{"$nulls":4},{"$f":"IF(ARG1_05!H13=\"\",\"\",IF(H10=\"f\",IF(H13=ARG1_05!H13,\"ü\",\"û\"),\"\"))","v":""},{"$f":"IF(ARG1_05!I13=\"\",\"\",IF(I10=\"f\",IF(I13=ARG1_05!I13,\"ü\",\"û\"),\"\"))","v":""},{"$f":"IF(ARG1_05!J13=\"\",\"\",IF(J10=\"f\",IF(J13=ARG1_05!J13,\"ü\",\"û\"),\"\"))","v":""},null,null,{"$f":"N11&\"-\"&COUNTIF(N$9:N11,N11)","v":"2311-1"},2311,"Omar",22,"Galletas",null,0.8181692972484594,4023,"Javier",2311,"Omar",null,"Galletas"]
[null,{"$f":"\"\"","v":""},{"$f":"INDEX($N$9:$N$18,RANDBETWEEN(1,5)*2)","v":8015},{"$nulls":4},"Nro Pedido","Cantidad","Pedido",null,null,{"$f":"N12&\"-\"&COUNTIF(N$9:N12,N12)","v":"2297-1"},2297,"Alberto",18,"Harina",null,0.7630242929278428,1567,"Jesús",2297,"Alberto",null,"Conservas"]
[null,{"$f":"\"\"","v":""},{"$f":"IF(_xlfn.ISFORMULA(ARG1_05!I17),_xlfn.FORMULATEXT(ARG1_05!I17),\"\")","v":""},{"$nulls":4},1,{"$f":"IFERROR(VLOOKUP($C$12&\"-\"&$H13,$M$8:$Q$18,4,0),\"\")","v":18},{"$f":"IFERROR(VLOOKUP($C$12&\"-\"&$H13,$M$8:$Q$18,5,0),\"\")","v":"Conservas"},null,null,{"$f":"N13&\"-\"&COUNTIF(N$9:N13,N13)","v":"7958-1"},7958,"Eduardo",18,"Galletas",null,0.010312356170796733,2732,"Jacob",7958,"Eduardo"]
[null,{"$f":"\"\"","v":""},{"$f":"IF(_xlfn.ISFORMULA(ARG1_05!J17),_xlfn.FORMULATEXT(ARG1_05!J17),\"\")","v":""},{"$nulls":4},2,{"$f":"IFERROR(VLOOKUP($C$12&\"-\"&$H14,$M$8:$Q$18,4,0),\"\")","v":""},{"$f":"IFERROR(VLOOKUP($C$12&\"-\"&$H14,$M$8:$Q$18,5,0),\"\")","v":""},null,null,{"$f":"N14&\"-\"&COUNTIF(N$9:N14,N14)","v":"2732-2"},2732,"Jacob",18,"Aceite",null,0.8190114115221733,3582,"Roger",2732,"Jacob"]
[null,{"$f":"\"\"","v":""},{"$f":"\"\"","v":""},{"$nulls":4},3,{"$f":"IFERROR(VLOOKUP($C$12&\"-\"&$H15,$M$8:$Q$18,4,0),\"\")","v":""},{"$f":"IFERROR(VLOOKUP($C$12&\"-\"&$H15,$M$8:$Q$18,5,0),\"\")","v":""},null,null,{"$f":"N15&\"-\"&COUNTIF(N$9:N15,N15)","v":"3582-2"},3582,"Roger",15,"Conservas",null,0.9110926013326892,7958,"Eduardo",3582,"Roger"]
[null,{"$f":"\"\"","v":""},{"$f":"\"\"","v":""},{"$nulls":4},4,{"$f":"IFERROR(VLOOKUP($C$12&\"-\"&$H16,$M$8:$Q$18,4,0),\"\")","v":""},{"$f":"IFERROR(VLOOKUP($C$12&\"-\"&$H16,$M$8:$Q$18,5,0),\"\")","v":""},null,null,{"$f":"N16&\"-\"&COUNTIF(N$9:N16,N16)","v":"8180-1"},8180,"Franco",10,"Conservas",null,0.4351672769831273,1957,"Miguel",8180,"Franco"]
[null,{"$f":"\"\"","v":""},{"$f":"\"\"","v":""},{"$nulls":4},5,{"$f":"IFERROR(VLOOKUP($C$12&\"-\"&$H17,$M$8:$Q$18,4,0),\"\")","v":""},{"$f":"IFERROR(VLOOKUP($C$12&\"-\"&$H17,$M$8:$Q$18,5,0),\"\")","v":""},null,null,{"$f":"N17&\"-\"&COUNTIF(N$9:N17,N17)","v":"2311-2"},2311,"Omar",21,"Conservas",null,0.5896155663079669,3951,"Francisco",2311,"Omar"]
[{"$nulls":12},{"$f":"N18&\"-\"&COUNTIF(N$9:N18,N18)","v":"8015-1"},8015,"Oscar",18,"Conservas",null,0.6799944434340303,8085,"Fabio",8015,"Oscar"]
[{"$nulls":18},0.8304119981393934,2311,"Omar"]
[{"$nulls":18},0.3786317042487528,8180,"Franco"]
[{"$nulls":18},0.2934567808727164,8015,"Oscar"]

{"sheet":"ARG1_05","index":11,"n_rows":18,"n_cols":16,"rows_kept":18,"hidden":true}
[null,"Argumento valor buscado"]
[null,"MOS Expert - CPC Martín Cruz - 998401784"]
[]
[]
[]
[null,{"$f":"lista01.13","v":""},"VALOR BUSCADO"]
[null,"",""]
[null,"►","VALORES REPETIDOS",{"$nulls":8},"Unicode",{"$f":"lista01.14","v":"Código"},"Nombre","Cantidad","Pedido"]
[null,"","",{"$nulls":9},2732,"Jacob",13,"Aceite"]
[null,"","¿Cuáles fueron los pedidos del código 8015?",{"$nulls":9},3582,"Roger",10,"Harina"]
[null,"","Ejercicio →",{"$nulls":4},{"$f":"lista01.15","v":""},"","",null,null,2311,"Omar",22,"Galletas"]
[null,"",8015,{"$nulls":4},"Nro Pedido","Cantidad","Pedido",null,null,2297,"Alberto",18,"Harina"]
[null,"","",{"$nulls":4},1,{"$nulls":4},7958,"Eduardo",18,"Galletas"]
[null,"","",{"$nulls":4},2,{"$nulls":4},2732,"Jacob",18,"Aceite"]
[null,"","",{"$nulls":4},3,{"$nulls":4},3582,"Roger",15,"Conservas"]
[null,"","",{"$nulls":4},4,{"$nulls":4},8180,"Franco",10,"Conservas"]
[null,"","",{"$nulls":4},5,{"$nulls":4},2311,"Omar",21,"Conservas"]
[{"$nulls":12},8015,"Oscar",18,"Conservas"]

{"sheet":"DO_A1_06","index":12,"n_rows":21,"n_cols":22,"rows_kept":21,"hidden":true}
[]
[]
[]
[]
[]
[null,{"$f":"\"\"","v":""},"VALOR BUSCADO",{"$nulls":4},{"$f":"IF(ARG1_06!G6=\"\",\"\",IF(I6=\"f\",IF(G6=ARG1_06!G6,\"ü\",\"û\"),\"\"))","v":""}]
[null,{"$f":"\"\"","v":""},{"$f":"\"\"","v":""},{"$nulls":4},{"$f":"IF(ARG1_06!G7=\"\",\"\",IF(I7=\"f\",IF(G7=ARG1_06!G7,\"ü\",\"û\"),\"\"))","v":""}]
[null,"►","APROXIMACION NUMERICA",{"$nulls":4},{"$f":"IF(ARG1_06!G8=\"\",\"\",IF(I8=\"f\",IF(G8=ARG1_06!G8,\"ü\",\"û\"),\"\"))","v":""},null,null,"Nombre","Cantidad","Precio","Venta",null,"Ventas","Categoria","Comisión"]
[null,{"$f":"\"\"","v":""},{"$f":"\"\"","v":""},{"$nulls":4},{"$f":"IF(ARG1_06!G9=\"\",\"\",IF(I9=\"f\",IF(G9=ARG1_06!G9,\"ü\",\"û\"),\"\"))","v":""},null,null,{"$f":"V9","v":"Alberto"},{"$f":"RANDBETWEEN(10,100)","v":46},{"$f":"ROUND(RANDBETWEEN(50,150)+RAND(),2)","v":114.42},{"$f":"ROUND(L9*M9,2)","v":{"v":5263.32,"d":"5,263.32"}},null,0,"Por debajo",0,null,{"$f":"RAND()","v":0.3310619582144745},"José",{"$f":"VLOOKUP(LARGE($T$9:$T$21,ROWS(V$9:V9)),$T$9:$U$21,2,0)","v":"Alberto"}]
[null,{"$f":"\"\"","v":""},{"$f":"\"¿Ha cuanto asciende la comisión del vendedor \"&C12&\"?\"","v":"¿Ha cuanto asciende la comisión del vendedor Jacob?"},{"$nulls":4},{"$f":"IF(ARG1_06!G10=\"\",\"\",IF(I10=\"f\",IF(G10=ARG1_06!G10,\"ü\",\"û\"),\"\"))","v":""},null,null,"Francisco",74,52.42,{"v":3879.08,"d":"3,879.08"},null,1000,"Bajo",20,null,0.9345961588000207,"Alberto",{"$f":"VLOOKUP(LARGE($T$9:$T$21,ROWS(V$9:V10)),$T$9:$U$21,2,0)","v":"Francisco"}]
[null,{"$f":"\"\"","v":""},"Opción 1:",{"$nulls":3},{"$f":"VLOOKUP(C12,$K$8:$N$18,4,0)","v":{"v":1868.48,"d":"1,868.48"}},{"$f":"IF(ARG1_06!G11=\"\",\"\",IF(I11=\"f\",IF(G11=ARG1_06!G11,\"ü\",\"û\"),\"\"))","v":""},"f",null,"Eduardo",70,69.12,{"v":4838.4,"d":"4,838.40"},null,2500,"Por encima",100,null,0.1310872501201461,"Javier",{"$f":"VLOOKUP(LARGE($T$9:$T$21,ROWS(V$9:V11)),$T$9:$U$21,2,0)","v":"Eduardo"}]
[null,{"$f":"\"\"","v":""},{"$f":"INDEX($V$9:$V$18,RANDBETWEEN(1,5)*2)","v":"Jacob"},{"$nulls":3},{"$f":"VLOOKUP(G11,$P$8:$R$13,3,1)","v":20},{"$f":"IF(ARG1_06!G12=\"\",\"\",IF(I12=\"f\",IF(G12=ARG1_06!G12,\"ü\",\"û\"),\"\"))","v":""},"f",null,"Jacob",16,116.78,{"v":1868.48,"d":"1,868.48"},null,7000,"Muy bueno",250,null,0.29521697086028076,"Jesús",{"$f":"VLOOKUP(LARGE($T$9:$T$21,ROWS(V$9:V12)),$T$9:$U$21,2,0)","v":"Jacob"}]
[null,{"$f":"\"\"","v":""},{"$f":"IF(_xlfn.ISFORMULA(ARG1_06!G12),_xlfn.FORMULATEXT(ARG1_06!G12),\"\")","v":""},{"$nulls":4},{"$f":"IF(ARG1_06!G13=\"\",\"\",IF(I13=\"f\",IF(G13=ARG1_06!G13,\"ü\",\"û\"),\"\"))","v":""},null,null,"Fabio",69,{"v":71.6,"d":"71.60"},{"v":4940.4,"d":"4,940.40"},null,10000,"Excelente",700,null,0.6405046284461325,"Jacob",{"$f":"VLOOKUP(LARGE($T$9:$T$21,ROWS(V$9:V13)),$T$9:$U$21,2,0)","v":"Fabio"}]
[null,{"$f":"\"\"","v":""},{"$f":"\"\"","v":""},{"$nulls":4},{"$f":"IF(ARG1_06!G14=\"\",\"\",IF(I14=\"f\",IF(G14=ARG1_06!G14,\"ü\",\"û\"),\"\"))","v":""},null,null,"Omar",11,57.85,636.35,{"$nulls":5},0.07821412039703757,"Roger",{"$f":"VLOOKUP(LARGE($T$9:$T$21,ROWS(V$9:V14)),$T$9:$U$21,2,0)","v":"Omar"}]
[null,{"$f":"\"\"","v":""},{"$f":"\"¿Qué categoria de comisión tiene el vendedor \"&C17&\"?\"","v":"¿Qué categoria de comisión tiene el vendedor Fabio?"},{"$nulls":4},{"$f":"IF(ARG1_06!G15=\"\",\"\",IF(I15=\"f\",IF(G15=ARG1_06!G15,\"ü\",\"û\"),\"\"))","v":""},null,null,"Oscar",17,{"v":63.3,"d":"63.30"},{"v":1076.1,"d":"1,076.10"},{"$nulls":5},0.7114796149023783,"Eduardo",{"$f":"VLOOKUP(LARGE($T$9:$T$21,ROWS(V$9:V15)),$T$9:$U$21,2,0)","v":"Oscar"}]
[null,{"$f":"\"\"","v":""},"Ejercicio →",{"$nulls":3},{"$f":"VLOOKUP(C17,$K$8:$N$18,4,0)","v":{"v":4940.4,"d":"4,940.40"}},{"$f":"IF(ARG1_06!G16=\"\",\"\",IF(I16=\"f\",IF(G16=ARG1_06!G16,\"ü\",\"û\"),\"\"))","v":""},"f",null,"José",88,109.43,{"v":9629.84,"d":"9,629.84"},{"$nulls":5},0.2028451514067232,"Miguel",{"$f":"VLOOKUP(LARGE($T$9:$T$21,ROWS(V$9:V16)),$T$9:$U$21,2,0)","v":"José"}]
[null,{"$f":"\"\"","v":""},{"$f":"INDEX($V$9:$V$18,RANDBETWEEN(1,5)*2-1)","v":"Fabio"},{"$nulls":3},{"$f":"VLOOKUP(G16,$P$8:$R$13,2,1)","v":"Por encima"},{"$f":"IF(ARG1_06!G17=\"\",\"\",IF(I17=\"f\",IF(G17=ARG1_06!G17,\"ü\",\"û\"),\"\"))","v":""},"f",null,"Jesús",10,94.45,{"v":944.5,"d":"944.50"},{"$nulls":5},0.9088856233586539,"Francisco",{"$f":"VLOOKUP(LARGE($T$9:$T$21,ROWS(V$9:V17)),$T$9:$U$21,2,0)","v":"Jesús"}]
[null,{"$f":"\"\"","v":""},{"$f":"IF(_xlfn.ISFORMULA(ARG1_06!G17),_xlfn.FORMULATEXT(ARG1_06!G17),\"\")","v":""},{"$nulls":4},{"$f":"IF(ARG1_06!G18=\"\",\"\",IF(I18=\"f\",IF(G18=ARG1_06!G18,\"ü\",\"û\"),\"\"))","v":""},null,null,"Franco",69,51.07,{"v":3523.83,"d":"3,523.83"},{"$nulls":5},0.5978244773860317,"Fabio",{"$f":"VLOOKUP(LARGE($T$9:$T$21,ROWS(V$9:V18)),$T$9:$U$21,2,0)","v":"Franco"}]
[{"$nulls":19},0.5796826563762499,"Omar"]
[{"$nulls":19},0.221297652429861,"Franco"]
[{"$nulls":19},0.5397297785372367,"Oscar"]

{"sheet":"ARG1_06","index":13,"n_rows":18,"n_cols":17,"rows_kept":18,"hidden":true}
[null,"Argumento valor buscado"]
[null,"MOS Expert - CPC Martín Cruz - 998401784"]
[]
[]
[]
[null,{"$f":"lista01.16","v":""},"VALOR BUSCADO",{"$nulls":4},{"$f":"lista01.19","v":""}]
[null,"","",{"$nulls":4},""]
[null,"►","APROXIMACION NUMERICA",{"$nulls":4},"",null,{"$f":"lista01.17","v":"Nombre"},"Cantidad","Precio","Venta",null,{"$f":"lista01.18","v":"Ventas"},"Categoria","Comisión"]
[null,"","",{"$nulls":4},"",null,"Alberto",46,114.42,{"v":5263.32,"d":"5,263.32"},null,0,"Por debajo",0]
[null,"","¿Ha cuanto asciende la comisión del vendedor Jacob?",{"$nulls":4},"",null,"Francisco",74,52.42,{"v":3879.08,"d":"3,879.08"},null,1000,"Bajo",20]
[null,"","Opción 1:",{"$nulls":4},"",null,"Eduardo",70,69.12,{"v":4838.4,"d":"4,838.40"},null,2500,"Por encima",100]
[null,"","Jacob",{"$nulls":4},"",null,"Jacob",16,116.78,{"v":1868.48,"d":"1,868.48"},null,7000,"Muy bueno",250]
[null,"","",{"$nulls":4},"",null,"Fabio",69,{"v":71.6,"d":"71.60"},{"v":4940.4,"d":"4,940.40"},null,10000,"Excelente",700]
[null,"","",{"$nulls":4},"",null,"Omar",11,57.85,636.35]
[null,"","¿Qué categoria de comisión tiene el vendedor Fabio?",{"$nulls":4},"",null,"Oscar",17,{"v":63.3,"d":"63.30"},{"v":1076.1,"d":"1,076.10"}]
[null,"","Ejercicio →",{"$nulls":4},"",null,"José",88,109.43,{"v":9629.84,"d":"9,629.84"}]
[null,"","Fabio",{"$nulls":4},"",null,"Jesús",10,94.45,{"v":944.5,"d":"944.50"}]
[null,"","",{"$nulls":4},"",null,"Franco",69,51.07,{"v":3523.83,"d":"3,523.83"}]

{"sheet":"DO_A3_01","index":14,"n_rows":119,"n_cols":20,"rows_kept":119,"hidden":true}
[]
[]
[]
[]
[]
[null,{"$f":"\"\"","v":""},"INDICADOR DE COLUMNA - INDICADOR DE FILA",{"$nulls":5},{"$f":"IF(ARG3_01!H6=\"\",\"\",IF(J6=\"f\",IF(H6=ARG3_01!H6,\"ü\",\"û\"),\"\"))","v":""}]
[null,{"$f":"\"\"","v":""},{"$f":"\"\"","v":""},{"$nulls":5},{"$f":"IF(ARG3_01!H7=\"\",\"\",IF(J7=\"f\",IF(H7=ARG3_01!H7,\"ü\",\"û\"),\"\"))","v":""},null,null,"Meses","Norte","Sur","Este","Oeste"]
[null,"►","COLUMNA O FILA FIJA",{"$nulls":5},{"$f":"IF(ARG3_01!H8=\"\",\"\",IF(J8=\"f\",IF(H8=ARG3_01!H8,\"ü\",\"û\"),\"\"))","v":""},null,null,{"$f":"PROPER(TEXT(DATE(YEAR(TODAY()),ROWS(L$8:L8),1),\"mmmm\"))","v":"Enero"},{"$f":"ROUND(RANDBETWEEN(100,600)+RAND(),2)","v":210.32},220.54,326.91,{"v":578.6,"d":"578.60"},null,{"$f":"RAND()","v":0.29804721106509424},{"$f":"TRANSPOSE(M7:P7)","v":"Norte"},{"$f":"VLOOKUP(LARGE($R$8:$R$11,ROWS(T$8:T8)),$R$8:$S$11,2,0)","v":"Este"}]
[null,{"$f":"\"\"","v":""},{"$f":"\"\"","v":""},{"$nulls":5},{"$f":"IF(ARG3_01!H9=\"\",\"\",IF(J9=\"f\",IF(H9=ARG3_01!H9,\"ü\",\"û\"),\"\"))","v":""},null,null,{"$f":"PROPER(TEXT(DATE(YEAR(TODAY()),ROWS(L$8:L9),1),\"mmmm\"))","v":"Febrero"},128.27,116.31,410.67,465.84,null,0.4120063995131358,"Sur",{"$f":"VLOOKUP(LARGE($R$8:$R$11,ROWS(T$8:T9)),$R$8:$S$11,2,0)","v":"Sur"}]
[null,{"$f":"\"\"","v":""},{"$f":"\"¿A cuánto asciende la venta del mes de \"&C12&\" de la zona Norte?\"","v":"¿A cuánto asciende la venta del mes de Abril de la zona Norte?"},{"$nulls":5},{"$f":"IF(ARG3_01!H10=\"\",\"\",IF(J10=\"f\",IF(H10=ARG3_01!H10,\"ü\",\"û\"),\"\"))","v":""},null,null,{"$f":"PROPER(TEXT(DATE(YEAR(TODAY()),ROWS(L$8:L10),1),\"mmmm\"))","v":"Marzo"},475.69,119.64,{"v":356.3,"d":"356.30"},301.94,null,0.7282339049184716,"Este",{"$f":"VLOOKUP(LARGE($R$8:$R$11,ROWS(T$8:T10)),$R$8:$S$11,2,0)","v":"Norte"}]
[null,{"$f":"\"\"","v":""},"Opción 1: BUSCARV",{"$nulls":5},{"$f":"IF(ARG3_01!H11=\"\",\"\",IF(J11=\"f\",IF(H11=ARG3_01!H11,\"ü\",\"û\"),\"\"))","v":""},null,null,{"$f":"PROPER(TEXT(DATE(YEAR(TODAY()),ROWS(L$8:L11),1),\"mmmm\"))","v":"Abril"},103.31,372.66,{"v":257.5,"d":"257.50"},439.48,null,0.28372281110137676,"Oeste",{"$f":"VLOOKUP(LARGE($R$8:$R$11,ROWS(T$8:T11)),$R$8:$S$11,2,0)","v":"Oeste"}]
[null,{"$f":"\"\"","v":""},{"$f":"INDEX($L$8:$L$19,RANDBETWEEN(1,12))","v":"Abril"},{"$nulls":4},{"$f":"VLOOKUP(C12,$L$7:$P$19,2,0)","v":103.31},{"$f":"IF(ARG3_01!H12=\"\",\"\",IF(J12=\"f\",IF(H12=ARG3_01!H12,\"ü\",\"û\"),\"\"))","v":"ü"},"f",null,{"$f":"PROPER(TEXT(DATE(YEAR(TODAY()),ROWS(L$8:L12),1),\"mmmm\"))","v":"Mayo"},128.04,336.61,{"v":439.8,"d":"439.80"},144.35]
[null,{"$f":"\"\"","v":""},{"$f":"IF(_xlfn.ISFORMULA(ARG3_01!H12),_xlfn.FORMULATEXT(ARG3_01!H12),\"\")","v":"=BUSCARV(C12,$K$8:$O$20,2,0)"},{"$nulls":5},{"$f":"IF(ARG3_01!H13=\"\",\"\",IF(J13=\"f\",IF(H13=ARG3_01!H13,\"ü\",\"û\"),\"\"))","v":""},null,null,{"$f":"PROPER(TEXT(DATE(YEAR(TODAY()),ROWS(L$8:L13),1),\"mmmm\"))","v":"Junio"},472.26,299.55,186.03,350.33]
[null,{"$f":"\"\"","v":""},{"$f":"\"\"","v":""},{"$nulls":5},{"$f":"IF(ARG3_01!H14=\"\",\"\",IF(J14=\"f\",IF(H14=ARG3_01!H14,\"ü\",\"û\"),\"\"))","v":""},null,null,{"$f":"PROPER(TEXT(DATE(YEAR(TODAY()),ROWS(L$8:L14),1),\"mmmm\"))","v":"Julio"},554.29,{"v":413.3,"d":"413.30"},229.49,333.28]
[null,{"$f":"\"\"","v":""},{"$f":"\"¿A cuánto asciende la venta del mes de Mayo de la zona \"&C17&\"?\"","v":"¿A cuánto asciende la venta del mes de Mayo de la zona Oeste?"},{"$nulls":5},{"$f":"IF(ARG3_01!H15=\"\",\"\",IF(J15=\"f\",IF(H15=ARG3_01!H15,\"ü\",\"û\"),\"\"))","v":""},null,null,{"$f":"PROPER(TEXT(DATE(YEAR(TODAY()),ROWS(L$8:L15),1),\"mmmm\"))","v":"Agosto"},416.17,246.85,522.31,{"v":173.4,"d":"173.40"}]
[null,{"$f":"\"\"","v":""},"Opción 2: BUSCARH",{"$nulls":5},{"$f":"IF(ARG3_01!H16=\"\",\"\",IF(J16=\"f\",IF(H16=ARG3_01!H16,\"ü\",\"û\"),\"\"))","v":""},null,null,{"$f":"PROPER(TEXT(DATE(YEAR(TODAY()),ROWS(L$8:L16),1),\"mmmm\"))","v":"Setiembre"},{"v":329.3,"d":"329.30"},531.87,516.83,427.04]
[null,{"$f":"\"\"","v":""},{"$f":"INDEX($M$7:$P$7,RANDBETWEEN(1,4))","v":"Oeste"},{"$nulls":4},{"$f":"HLOOKUP(C17,$L$7:$P$19,6,0)","v":144.35},{"$f":"IF(ARG3_01!H17=\"\",\"\",IF(J17=\"f\",IF(H17=ARG3_01!H17,\"ü\",\"û\"),\"\"))","v":"ü"},"f",null,{"$f":"PROPER(TEXT(DATE(YEAR(TODAY()),ROWS(L$8:L17),1),\"mmmm\"))","v":"Octubre"},160.43,268.61,{"v":534.1,"d":"534.10"},409.35]
[null,{"$f":"\"\"","v":""},{"$f":"IF(_xlfn.ISFORMULA(ARG3_01!H17),_xlfn.FORMULATEXT(ARG3_01!H17),\"\")","v":"=BUSCARH(C17,$K$8:$O$20,6,0)"},{"$nulls":5},{"$f":"IF(ARG3_01!H18=\"\",\"\",IF(J18=\"f\",IF(H18=ARG3_01!H18,\"ü\",\"û\"),\"\"))","v":""},null,null,{"$f":"PROPER(TEXT(DATE(YEAR(TODAY()),ROWS(L$8:L18),1),\"mmmm\"))","v":"Noviembre"},432.32,435.01,183.47,120.47]
[null,{"$f":"\"\"","v":""},{"$f":"\"\"","v":""},{"$nulls":5},{"$f":"IF(ARG3_01!H19=\"\",\"\",IF(J19=\"f\",IF(H19=ARG3_01!H19,\"ü\",\"û\"),\"\"))","v":""},null,null,{"$f":"PROPER(TEXT(DATE(YEAR(TODAY()),ROWS(L$8:L19),1),\"mmmm\"))","v":"Diciembre"},122.43,346.33,414.56,155.76]
[null,"►","COLUMNA O FILA CALCULADA - CON CELDA DE APOYO (1)",{"$nulls":5},{"$f":"IF(ARG3_01!H20=\"\",\"\",IF(J20=\"f\",IF(H20=ARG3_01!H20,\"ü\",\"û\"),\"\"))","v":""}]
[null,{"$f":"\"\"","v":""},{"$f":"\"\"","v":""},{"$nulls":5},{"$f":"IF(ARG3_01!H21=\"\",\"\",IF(J21=\"f\",IF(H21=ARG3_01!H21,\"ü\",\"û\"),\"\"))","v":""}]
[null,{"$f":"\"\"","v":""},{"$f":"\"¿A cuánto asciende la venta del mes de \"&C24&\" de la zona \"&C25&\"?\"","v":"¿A cuánto asciende la venta del mes de Diciembre de la zona Oeste?"},{"$nulls":5},{"$f":"IF(ARG3_01!H22=\"\",\"\",IF(J22=\"f\",IF(H22=ARG3_01!H22,\"ü\",\"û\"),\"\"))","v":""}]
[null,{"$f":"\"\"","v":""},"Opción 1: BUSCARV",{"$nulls":5},{"$f":"IF(ARG3_01!H23=\"\",\"\",IF(J23=\"f\",IF(H23=ARG3_01!H23,\"ü\",\"û\"),\"\"))","v":""}]
[null,{"$f":"\"\"","v":""},{"$f":"INDEX($L$8:$L$19,RANDBETWEEN(1,6)*2)","v":"Diciembre"},{"$nulls":4},{"$f":"VLOOKUP(C24,$L$7:$P$19,MATCH(C25,$L$7:$P$7,0),0)","v":155.76},{"$f":"IF(ARG3_01!H24=\"\",\"\",IF(J24=\"f\",IF(H24=ARG3_01!H24,\"ü\",\"û\"),\"\"))","v":""},"f"]
[null,{"$f":"\"\"","v":""},{"$f":"INDEX($M$7:$P$7,RANDBETWEEN(1,2)*2)","v":"Oeste"},{"$nulls":5},{"$f":"IF(ARG3_01!H25=\"\",\"\",IF(J25=\"f\",IF(H25=ARG3_01!H25,\"ü\",\"û\"),\"\"))","v":""}]
[null,{"$f":"\"\"","v":""},{"$f":"IF(_xlfn.ISFORMULA(ARG3_01!H24),_xlfn.FORMULATEXT(ARG3_01!H24),\"\")","v":""},{"$nulls":5},{"$f":"IF(ARG3_01!H26=\"\",\"\",IF(J26=\"f\",IF(H26=ARG3_01!H26,\"ü\",\"û\"),\"\"))","v":""}]
[null,{"$f":"\"\"","v":""},{"$f":"\"\"","v":""},{"$nulls":5},{"$f":"IF(ARG3_01!H27=\"\",\"\",IF(J27=\"f\",IF(H27=ARG3_01!H27,\"ü\",\"û\"),\"\"))","v":""}]
[null,{"$f":"\"\"","v":""},"Ejercicio →",{"$nulls":5},{"$f":"IF(ARG3_01!H28=\"\",\"\",IF(J28=\"f\",IF(H28=ARG3_01!H28,\"ü\",\"û\"),\"\"))","v":""}]
[null,{"$f":"\"\"","v":""},{"$f":"INDEX($L$8:$L$19,RANDBETWEEN(1,6)*2-1)","v":"Marzo"},{"$nulls":4},{"$f":"VLOOKUP(C29,$L$7:$P$19,MATCH(C30,$L$7:$P$7,0),0)","v":475.69},{"$f":"IF(ARG3_01!H29=\"\",\"\",IF(J29=\"f\",IF(H29=ARG3_01!H29,\"ü\",\"û\"),\"\"))","v":""},"f"]
[null,{"$f":"\"\"","v":""},{"$f":"INDEX($M$7:$P$7,RANDBETWEEN(1,2)*2-1)","v":"Norte"},{"$nulls":5},{"$f":"IF(ARG3_01!H30=\"\",\"\",IF(J30=\"f\",IF(H30=ARG3_01!H30,\"ü\",\"û\"),\"\"))","v":""}]
[null,{"$f":"\"\"","v":""},{"$f":"IF(_xlfn.ISFORMULA(ARG3_01!H29),_xlfn.FORMULATEXT(ARG3_01!H29),\"\")","v":""},{"$nulls":5},{"$f":"IF(ARG3_01!H31=\"\",\"\",IF(J31=\"f\",IF(H31=ARG3_01!H31,\"ü\",\"û\"),\"\"))","v":""}]
[null,{"$f":"\"\"","v":""},{"$f":"\"\"","v":""},{"$nulls":5},{"$f":"IF(ARG3_01!H32=\"\",\"\",IF(J32=\"f\",IF(H32=ARG3_01!H32,\"ü\",\"û\"),\"\"))","v":""}]
[null,{"$f":"\"\"","v":""},{"$f":"\"¿A cuánto asciende la venta de la zona \"&C35&\" del mes de \"&C36&\"?\"","v":"¿A cuánto asciende la venta de la zona Sur del mes de Abril?"},{"$nulls":5},{"$f":"IF(ARG3_01!H33=\"\",\"\",IF(J33=\"f\",IF(H33=ARG3_01!H33,\"ü\",\"û\"),\"\"))","v":""}]
[null,{"$f":"\"\"","v":""},"Opción 2: BUSCARH",{"$nulls":5},{"$f":"IF(ARG3_01!H34=\"\",\"\",IF(J34=\"f\",IF(H34=ARG3_01!H34,\"ü\",\"û\"),\"\"))","v":""}]
[null,{"$f":"\"\"","v":""},{"$f":"INDEX($M$7:$P$7,RANDBETWEEN(1,2)*2)","v":"Sur"},{"$nulls":4},{"$f":"HLOOKUP(C35,$L$7:$P$19,MATCH(C36,$L$7:$L$19,0),0)","v":372.66},{"$f":"IF(ARG3_01!H35=\"\",\"\",IF(J35=\"f\",IF(H35=ARG3_01!H35,\"ü\",\"û\"),\"\"))","v":""},"f"]
[null,{"$f":"\"\"","v":""},{"$f":"INDEX($L$8:$L$19,RANDBETWEEN(1,6)*2)","v":"Abril"},{"$nulls":5},{"$f":"IF(ARG3_01!H36=\"\",\"\",IF(J36=\"f\",IF(H36=ARG3_01!H36,\"ü\",\"û\"),\"\"))","v":""}]
[null,{"$f":"\"\"","v":""},{"$f":"IF(_xlfn.ISFORMULA(ARG3_01!H35),_xlfn.FORMULATEXT(ARG3_01!H35),\"\")","v":""},{"$nulls":5},{"$f":"IF(ARG3_01!H37=\"\",\"\",IF(J37=\"f\",IF(H37=ARG3_01!H37,\"ü\",\"û\"),\"\"))","v":""}]
[null,{"$f":"\"\"","v":""},{"$f":"\"\"","v":""},{"$nulls":5},{"$f":"IF(ARG3_01!H38=\"\",\"\",IF(J38=\"f\",IF(H38=ARG3_01!H38,\"ü\",\"û\"),\"\"))","v":""}]
[null,{"$f":"\"\"","v":""},"Ejercicio →",{"$nulls":5},{"$f":"IF(ARG3_01!H39=\"\",\"\",IF(J39=\"f\",IF(H39=ARG3_01!H39,\"ü\",\"û\"),\"\"))","v":""}]
[null,{"$f":"\"\"","v":""},{"$f":"INDEX($M$7:$P$7,RANDBETWEEN(1,2)*2-1)","v":"Norte"},{"$nulls":4},{"$f":"HLOOKUP(C40,$L$7:$P$19,MATCH(C41,$L$7:$L$19,0),0)","v":128.04},{"$f":"IF(ARG3_01!H40=\"\",\"\",IF(J40=\"f\",IF(H40=ARG3_01!H40,\"ü\",\"û\"),\"\"))","v":""},"f"]
[null,{"$f":"\"\"","v":""},{"$f":"INDEX($L$8:$L$19,RANDBETWEEN(1,6)*2-1)","v":"Mayo"},{"$nulls":5},{"$f":"IF(ARG3_01!H41=\"\",\"\",IF(J41=\"f\",IF(H41=ARG3_01!H41,\"ü\",\"û\"),\"\"))","v":""}]
[null,{"$f":"\"\"","v":""},{"$f":"IF(_xlfn.ISFORMULA(ARG3_01!H40),_xlfn.FORMULATEXT(ARG3_01!H40),\"\")","v":""},{"$nulls":5},{"$f":"IF(ARG3_01!H42=\"\",\"\",IF(J42=\"f\",IF(H42=ARG3_01!H42,\"ü\",\"û\"),\"\"))","v":""}]
[null,{"$f":"\"\"","v":""},{"$f":"\"\"","v":""},{"$nulls":5},{"$f":"IF(ARG3_01!H43=\"\",\"\",IF(J43=\"f\",IF(H43=ARG3_01!H43,\"ü\",\"û\"),\"\"))","v":""}]
[null,"►","COLUMNA O FILA CALCULADA - SIN CELDA DE APOYO",{"$nulls":5},{"$f":"IF(ARG3_01!H44=\"\",\"\",IF(J44=\"f\",IF(H44=ARG3_01!H44,\"ü\",\"û\"),\"\"))","v":""}]
[null,{"$f":"\"\"","v":""},{"$f":"\"\"","v":""},{"$nulls":5},{"$f":"IF(ARG3_01!H45=\"\",\"\",IF(J45=\"f\",IF(H45=ARG3_01!H45,\"ü\",\"û\"),\"\"))","v":""}]
[null,{"$f":"\"\"","v":""},{"$f":"\"¿A cuánto asciende la venta del mes de \"&C48&\" de todas las zonas?\"","v":"¿A cuánto asciende la venta del mes de Agosto de todas las zonas?"},{"$nulls":5},{"$f":"IF(ARG3_01!H46=\"\",\"\",IF(J46=\"f\",IF(H46=ARG3_01!H46,\"ü\",\"û\"),\"\"))","v":""}]
[null,{"$f":"\"\"","v":""},"Opción 1: BUSCARV",{"$nulls":5},{"$f":"IF(ARG3_01!H47=\"\",\"\",IF(J47=\"f\",IF(H47=ARG3_01!H47,\"ü\",\"û\"),\"\"))","v":""}]
[null,{"$f":"\"\"","v":""},{"$f":"INDEX($L$8:$L$19,RANDBETWEEN(1,6)*2)","v":"Agosto"},{"$nulls":5},{"$f":"IF(ARG3_01!H48=\"\",\"\",IF(J48=\"f\",IF(H48=ARG3_01!H48,\"ü\",\"û\"),\"\"))","v":""}]
[null,{"$f":"\"\"","v":""},{"$f":"\"Zona \"&TRANSPOSE(M7:N7)","v":"Zona Norte"},{"$nulls":4},{"$f":"VLOOKUP($C$48,$L$7:$P$19,ROWS(H$48:H49),0)","v":416.17},{"$f":"IF(ARG3_01!H49=\"\",\"\",IF(J49=\"f\",IF(H49=ARG3_01!H49,\"ü\",\"û\"),\"\"))","v":""},"f"]
[null,{"$f":"\"\"","v":""},"Zona Sur",{"$nulls":4},{"$f":"VLOOKUP($C$48,$L$7:$P$19,ROWS(H$48:H50),0)","v":246.85},{"$f":"IF(ARG3_01!H50=\"\",\"\",IF(J50=\"f\",IF(H50=ARG3_01!H50,\"ü\",\"û\"),\"\"))","v":""},"f"]
[null,{"$f":"\"\"","v":""},{"$f":"IF(_xlfn.ISFORMULA(ARG3_01!H49),_xlfn.FORMULATEXT(ARG3_01!H49),\"\")","v":""},{"$nulls":5},{"$f":"IF(ARG3_01!H51=\"\",\"\",IF(J51=\"f\",IF(H51=ARG3_01!H51,\"ü\",\"û\"),\"\"))","v":""}]
[null,{"$f":"\"\"","v":""},{"$f":"\"\"","v":""},{"$nulls":5},{"$f":"IF(ARG3_01!H52=\"\",\"\",IF(J52=\"f\",IF(H52=ARG3_01!H52,\"ü\",\"û\"),\"\"))","v":""}]
[null,{"$f":"\"\"","v":""},"Opción 2: BUSCARV",{"$nulls":5},{"$f":"IF(ARG3_01!H53=\"\",\"\",IF(J53=\"f\",IF(H53=ARG3_01!H53,\"ü\",\"û\"),\"\"))","v":""}]
[null,{"$f":"\"\"","v":""},{"$f":"C48","v":"Agosto"},{"$f":"\"\"","v":""},{"$nulls":4},{"$f":"IF(ARG3_01!H54=\"\",\"\",IF(J54=\"f\",IF(H54=ARG3_01!H54,\"ü\",\"û\"),\"\"))","v":""}]
[null,{"$f":"\"\"","v":""},{"$f":"TRANSPOSE(C49:C50)","v":"Zona Norte"},"Zona Sur",null,null,{"$f":"VLOOKUP($C54,$L$7:$P$19,COLUMNS($F$55:G$55),0)","v":416.17},{"$f":"VLOOKUP($C54,$L$7:$P$19,COLUMNS($F$55:H$55),0)","v":246.85},{"$f":"IF(ARG3_01!H55=\"\",\"\",IF(J55=\"f\",IF(H55=ARG3_01!H55,\"ü\",\"û\"),\"\"))","v":""},"f"]
[null,{"$f":"\"\"","v":""},{"$f":"IF(_xlfn.ISFORMULA(ARG3_01!H55),_xlfn.FORMULATEXT(ARG3_01!H55),\"\")","v":""},{"$nulls":5},{"$f":"IF(ARG3_01!H56=\"\",\"\",IF(J56=\"f\",IF(H56=ARG3_01!H56,\"ü\",\"û\"),\"\"))","v":""}]
[null,{"$f":"\"\"","v":""},{"$f":"\"\"","v":""},{"$nulls":5},{"$f":"IF(ARG3_01!H57=\"\",\"\",IF(J57=\"f\",IF(H57=ARG3_01!H57,\"ü\",\"û\"),\"\"))","v":""}]
[null,{"$f":"\"\"","v":""},"Ejercicio →",{"$nulls":5},{"$f":"IF(ARG3_01!H58=\"\",\"\",IF(J58=\"f\",IF(H58=ARG3_01!H58,\"ü\",\"û\"),\"\"))","v":""}]
[null,{"$f":"\"\"","v":""},{"$f":"INDEX($L$8:$L$19,RANDBETWEEN(1,6)*2-1)","v":"Julio"},{"$nulls":5},{"$f":"IF(ARG3_01!H59=\"\",\"\",IF(J59=\"f\",IF(H59=ARG3_01!H59,\"ü\",\"û\"),\"\"))","v":""}]
[null,{"$f":"\"\"","v":""},{"$f":"\"Zona \"&TRANSPOSE(O7:P7)","v":"Zona Este"},{"$nulls":4},{"$f":"VLOOKUP($C$59,$L$7:$P$19,ROWS(H$59:H60)+2,0)","v":229.49},{"$f":"IF(ARG3_01!H60=\"\",\"\",IF(J60=\"f\",IF(H60=ARG3_01!H60,\"ü\",\"û\"),\"\"))","v":""},"f"]
[null,{"$f":"\"\"","v":""},"Zona Oeste",{"$nulls":4},{"$f":"VLOOKUP($C$59,$L$7:$P$19,ROWS(H$59:H61)+2,0)","v":333.28},{"$f":"IF(ARG3_01!H61=\"\",\"\",IF(J61=\"f\",IF(H61=ARG3_01!H61,\"ü\",\"û\"),\"\"))","v":""},"f"]
[null,{"$f":"\"\"","v":""},{"$f":"IF(_xlfn.ISFORMULA(ARG3_01!H60),_xlfn.FORMULATEXT(ARG3_01!H60),\"\")","v":""},{"$nulls":5},{"$f":"IF(ARG3_01!H62=\"\",\"\",IF(J62=\"f\",IF(H62=ARG3_01!H62,\"ü\",\"û\"),\"\"))","v":""}]
[null,{"$f":"\"\"","v":""},{"$f":"\"\"","v":""},{"$nulls":5},{"$f":"IF(ARG3_01!H63=\"\",\"\",IF(J63=\"f\",IF(H63=ARG3_01!H63,\"ü\",\"û\"),\"\"))","v":""}]
[null,{"$f":"\"\"","v":""},"Ejercicio →",{"$nulls":5},{"$f":"IF(ARG3_01!H64=\"\",\"\",IF(J64=\"f\",IF(H64=ARG3_01!H64,\"ü\",\"û\"),\"\"))","v":""}]
[null,{"$f":"\"\"","v":""},{"$f":"C59","v":"Julio"},{"$f":"\"\"","v":""},{"$nulls":4},{"$f":"IF(ARG3_01!H65=\"\",\"\",IF(J65=\"f\",IF(H65=ARG3_01!H65,\"ü\",\"û\"),\"\"))","v":""}]
[null,{"$f":"\"\"","v":""},{"$f":"TRANSPOSE(C60:C61)","v":"Zona Este"},"Zona Oeste",null,null,{"$f":"VLOOKUP($C65,$L$7:$P$19,COLUMNS($F$66:G$66)+2,0)","v":229.49},{"$f":"VLOOKUP($C65,$L$7:$P$19,COLUMNS($F$66:H$66)+2,0)","v":333.28},{"$f":"IF(ARG3_01!H66=\"\",\"\",IF(J66=\"f\",IF(H66=ARG3_01!H66,\"ü\",\"û\"),\"\"))","v":""},"f"]
[null,{"$f":"\"\"","v":""},{"$f":"IF(_xlfn.ISFORMULA(ARG3_01!H66),_xlfn.FORMULATEXT(ARG3_01!H66),\"\")","v":""},{"$nulls":5},{"$f":"IF(ARG3_01!H67=\"\",\"\",IF(J67=\"f\",IF(H67=ARG3_01!H67,\"ü\",\"û\"),\"\"))","v":""}]
[null,{"$f":"\"\"","v":""},{"$f":"\"\"","v":""},{"$nulls":5},{"$f":"IF(ARG3_01!H68=\"\",\"\",IF(J68=\"f\",IF(H68=ARG3_01!H68,\"ü\",\"û\"),\"\"))","v":""}]
[null,"►","COLUMNA O FILA CALCULADA - CON CELDA DE APOYO (2)",{"$nulls":5},{"$f":"IF(ARG3_01!H69=\"\",\"\",IF(J69=\"f\",IF(H69=ARG3_01!H69,\"ü\",\"û\"),\"\"))","v":""}]
[null,{"$f":"\"\"","v":""},{"$f":"\"¿A cuánto asciende la venta del mes de \"&C72&\" de todas las zonas?\"","v":"¿A cuánto asciende la venta del mes de Noviembre de todas las zonas?"},{"$nulls":5},{"$f":"IF(ARG3_01!H70=\"\",\"\",IF(J70=\"f\",IF(H70=ARG3_01!H70,\"ü\",\"û\"),\"\"))","v":""}]
[null,{"$f":"\"\"","v":""},"Opción 1: BUSCARV",{"$nulls":5},{"$f":"IF(ARG3_01!H71=\"\",\"\",IF(J71=\"f\",IF(H71=ARG3_01!H71,\"ü\",\"û\"),\"\"))","v":""}]
[null,{"$f":"\"\"","v":""},{"$f":"INDEX($L$8:$L$19,RANDBETWEEN(1,6)*2-1)","v":"Noviembre"},{"$nulls":5},{"$f":"IF(ARG3_01!H72=\"\",\"\",IF(J72=\"f\",IF(H72=ARG3_01!H72,\"ü\",\"û\"),\"\"))","v":""}]
[null,{"$f":"\"\"","v":""},{"$f":"$T$8:$T$11","v":"Este"},{"$nulls":4},{"$f":"VLOOKUP(C$72,$L$7:$P$19,MATCH(C73,$L$7:$P$7,0),0)","v":183.47},{"$f":"IF(ARG3_01!H73=\"\",\"\",IF(J73=\"f\",IF(H73=ARG3_01!H73,\"ü\",\"û\"),\"\"))","v":""},"f"]
[null,{"$f":"\"\"","v":""},"Sur",{"$nulls":4},{"$f":"VLOOKUP(C$72,$L$7:$P$19,MATCH(C74,$L$7:$P$7,0),0)","v":435.01},{"$f":"IF(ARG3_01!H74=\"\",\"\",IF(J74=\"f\",IF(H74=ARG3_01!H74,\"ü\",\"û\"),\"\"))","v":""},"f"]
[null,{"$f":"\"\"","v":""},"Norte",{"$nulls":4},{"$f":"VLOOKUP(C$72,$L$7:$P$19,MATCH(C75,$L$7:$P$7,0),0)","v":432.32},{"$f":"IF(ARG3_01!H75=\"\",\"\",IF(J75=\"f\",IF(H75=ARG3_01!H75,\"ü\",\"û\"),\"\"))","v":""},"f"]
[null,{"$f":"\"\"","v":""},"Oeste",{"$nulls":4},{"$f":"VLOOKUP(C$72,$L$7:$P$19,MATCH(C76,$L$7:$P$7,0),0)","v":120.47},{"$f":"IF(ARG3_01!H76=\"\",\"\",IF(J76=\"f\",IF(H76=ARG3_01!H76,\"ü\",\"û\"),\"\"))","v":""},"f"]
[null,{"$f":"\"\"","v":""},{"$f":"IF(_xlfn.ISFORMULA(ARG3_01!H73),_xlfn.FORMULATEXT(ARG3_01!H73),\"\")","v":""},{"$nulls":5},{"$f":"IF(ARG3_01!H77=\"\",\"\",IF(J77=\"f\",IF(H77=ARG3_01!H77,\"ü\",\"û\"),\"\"))","v":""}]
[null,{"$f":"\"\"","v":""},{"$f":"\"\"","v":""},{"$nulls":5},{"$f":"IF(ARG3_01!H78=\"\",\"\",IF(J78=\"f\",IF(H78=ARG3_01!H78,\"ü\",\"û\"),\"\"))","v":""}]
[null,{"$f":"\"\"","v":""},"Opción 2: BUSCARH",{"$nulls":5},{"$f":"IF(ARG3_01!H79=\"\",\"\",IF(J79=\"f\",IF(H79=ARG3_01!H79,\"ü\",\"û\"),\"\"))","v":""}]
[null,{"$f":"\"\"","v":""},{"$f":"C72","v":"Noviembre"},{"$nulls":5},{"$f":"IF(ARG3_01!H80=\"\",\"\",IF(J80=\"f\",IF(H80=ARG3_01!H80,\"ü\",\"û\"),\"\"))","v":""}]
[null,{"$f":"\"\"","v":""},{"$f":"$T$8:$T$11","v":"Este"},{"$nulls":4},{"$f":"HLOOKUP(C81,$L$7:$P$19,MATCH($C$80,$L$7:$L$19,0),0)","v":183.47},{"$f":"IF(ARG3_01!H81=\"\",\"\",IF(J81=\"f\",IF(H81=ARG3_01!H81,\"ü\",\"û\"),\"\"))","v":""},"f"]
[null,{"$f":"\"\"","v":""},"Sur",{"$nulls":4},{"$f":"HLOOKUP(C82,$L$7:$P$19,MATCH($C$80,$L$7:$L$19,0),0)","v":435.01},{"$f":"IF(ARG3_01!H82=\"\",\"\",IF(J82=\"f\",IF(H82=ARG3_01!H82,\"ü\",\"û\"),\"\"))","v":""},"f"]
[null,{"$f":"\"\"","v":""},"Norte",{"$nulls":4},{"$f":"HLOOKUP(C83,$L$7:$P$19,MATCH($C$80,$L$7:$L$19,0),0)","v":432.32},{"$f":"IF(ARG3_01!H83=\"\",\"\",IF(J83=\"f\",IF(H83=ARG3_01!H83,\"ü\",\"û\"),\"\"))","v":""},"f"]
[null,{"$f":"\"\"","v":""},"Oeste",{"$nulls":4},{"$f":"HLOOKUP(C84,$L$7:$P$19,MATCH($C$80,$L$7:$L$19,0),0)","v":120.47},{"$f":"IF(ARG3_01!H84=\"\",\"\",IF(J84=\"f\",IF(H84=ARG3_01!H84,\"ü\",\"û\"),\"\"))","v":""},"f"]
[null,{"$f":"\"\"","v":""},{"$f":"IF(_xlfn.ISFORMULA(ARG3_01!H81),_xlfn.FORMULATEXT(ARG3_01!H81),\"\")","v":""},{"$nulls":5},{"$f":"IF(ARG3_01!H85=\"\",\"\",IF(J85=\"f\",IF(H85=ARG3_01!H85,\"ü\",\"û\"),\"\"))","v":""}]
[null,{"$f":"\"\"","v":""},{"$f":"\"\"","v":""},{"$nulls":5},{"$f":"IF(ARG3_01!H86=\"\",\"\",IF(J86=\"f\",IF(H86=ARG3_01!H86,\"ü\",\"û\"),\"\"))","v":""}]
[null,{"$f":"\"\"","v":""},{"$f":"\"¿A cuánto asciende la venta de los últimos meses de los 4 trimestres de la zona \"&C89&\"?\"","v":"¿A cuánto asciende la venta de los últimos meses de los 4 trimestres de la zona Este?"},{"$nulls":5},{"$f":"IF(ARG3_01!H87=\"\",\"\",IF(J87=\"f\",IF(H87=ARG3_01!H87,\"ü\",\"û\"),\"\"))","v":""}]
[null,{"$f":"\"\"","v":""},"Ejercicio →",{"$nulls":5},{"$f":"IF(ARG3_01!H88=\"\",\"\",IF(J88=\"f\",IF(H88=ARG3_01!H88,\"ü\",\"û\"),\"\"))","v":""}]
[null,{"$f":"\"\"","v":""},{"$f":"INDEX($M$7:$P$7,RANDBETWEEN(1,4))","v":"Este"},{"$nulls":5},{"$f":"IF(ARG3_01!H89=\"\",\"\",IF(J89=\"f\",IF(H89=ARG3_01!H89,\"ü\",\"û\"),\"\"))","v":""}]
[null,{"$f":"\"\"","v":""},{"$f":"TEXT(DATE(YEAR(TODAY()),3*(ROW()-ROW($C$90)+1),1),\"mmmm\")","v":"Marzo"},{"$nulls":4},{"$f":"VLOOKUP(C90,$L$7:$P$19,MATCH($C$89,$L$7:$P$7,0),0)","v":{"v":356.3,"d":"356.30"}},{"$f":"IF(ARG3_01!H90=\"\",\"\",IF(J90=\"f\",IF(H90=ARG3_01!H90,\"ü\",\"û\"),\"\"))","v":""},"f"]
[null,{"$f":"\"\"","v":""},{"$f":"TEXT(DATE(YEAR(TODAY()),3*(ROW()-ROW($C$90)+1),1),\"mmmm\")","v":"Junio"},{"$nulls":4},{"$f":"VLOOKUP(C91,$L$7:$P$19,MATCH($C$89,$L$7:$P$7,0),0)","v":186.03},{"$f":"IF(ARG3_01!H91=\"\",\"\",IF(J91=\"f\",IF(H91=ARG3_01!H91,\"ü\",\"û\"),\"\"))","v":""},"f"]
[null,{"$f":"\"\"","v":""},"Setiembre",{"$nulls":4},{"$f":"VLOOKUP(C92,$L$7:$P$19,MATCH($C$89,$L$7:$P$7,0),0)","v":516.83},{"$f":"IF(ARG3_01!H92=\"\",\"\",IF(J92=\"f\",IF(H92=ARG3_01!H92,\"ü\",\"û\"),\"\"))","v":""},"f"]
[null,{"$f":"\"\"","v":""},"Diciembre",{"$nulls":4},{"$f":"VLOOKUP(C93,$L$7:$P$19,MATCH($C$89,$L$7:$P$7,0),0)","v":414.56},{"$f":"IF(ARG3_01!H93=\"\",\"\",IF(J93=\"f\",IF(H93=ARG3_01!H93,\"ü\",\"û\"),\"\"))","v":""},"f"]
[null,{"$f":"\"\"","v":""},{"$f":"IF(_xlfn.ISFORMULA(ARG3_01!H90),_xlfn.FORMULATEXT(ARG3_01!H90),\"\")","v":""},{"$nulls":5},{"$f":"IF(ARG3_01!H94=\"\",\"\",IF(J94=\"f\",IF(H94=ARG3_01!H94,\"ü\",\"û\"),\"\"))","v":""}]
[null,{"$f":"\"\"","v":""},{"$f":"\"\"","v":""},{"$nulls":5},{"$f":"IF(ARG3_01!H95=\"\",\"\",IF(J95=\"f\",IF(H95=ARG3_01!H95,\"ü\",\"û\"),\"\"))","v":""}]
[null,{"$f":"\"\"","v":""},"Ejercicio →",{"$nulls":5},{"$f":"IF(ARG3_01!H96=\"\",\"\",IF(J96=\"f\",IF(H96=ARG3_01!H96,\"ü\",\"û\"),\"\"))","v":""}]
[null,{"$f":"\"\"","v":""},{"$f":"C89","v":"Este"},{"$nulls":5},{"$f":"IF(ARG3_01!H97=\"\",\"\",IF(J97=\"f\",IF(H97=ARG3_01!H97,\"ü\",\"û\"),\"\"))","v":""}]
[null,{"$f":"\"\"","v":""},{"$f":"TEXT(DATE(YEAR(TODAY()),3*ROW(D1),1),\"mmmm\")","v":"Marzo"},{"$nulls":4},{"$f":"HLOOKUP($C$97,$L$7:$P$19,MATCH(C98,$L$7:$L$19,0),0)","v":{"v":356.3,"d":"356.30"}},{"$f":"IF(ARG3_01!H98=\"\",\"\",IF(J98=\"f\",IF(H98=ARG3_01!H98,\"ü\",\"û\"),\"\"))","v":""},"f"]
[null,{"$f":"\"\"","v":""},{"$f":"TEXT(DATE(YEAR(TODAY()),3*ROW(D2),1),\"mmmm\")","v":"Junio"},{"$nulls":4},{"$f":"HLOOKUP($C$97,$L$7:$P$19,MATCH(C99,$L$7:$L$19,0),0)","v":186.03},{"$f":"IF(ARG3_01!H99=\"\",\"\",IF(J99=\"f\",IF(H99=ARG3_01!H99,\"ü\",\"û\"),\"\"))","v":""},"f"]
[null,{"$f":"\"\"","v":""},{"$f":"TEXT(DATE(YEAR(TODAY()),3*ROW(D3),1),\"mmmm\")","v":"Setiembre"},{"$nulls":4},{"$f":"HLOOKUP($C$97,$L$7:$P$19,MATCH(C100,$L$7:$L$19,0),0)","v":516.83},{"$f":"IF(ARG3_01!H100=\"\",\"\",IF(J100=\"f\",IF(H100=ARG3_01!H100,\"ü\",\"û\"),\"\"))","v":""},"f"]
[null,{"$f":"\"\"","v":""},{"$f":"TEXT(DATE(YEAR(TODAY()),3*ROW(D4),1),\"mmmm\")","v":"Diciembre"},{"$nulls":4},{"$f":"HLOOKUP($C$97,$L$7:$P$19,MATCH(C101,$L$7:$L$19,0),0)","v":414.56},{"$f":"IF(ARG3_01!H101=\"\",\"\",IF(J101=\"f\",IF(H101=ARG3_01!H101,\"ü\",\"û\"),\"\"))","v":""},"f"]
[null,{"$f":"\"\"","v":""},{"$f":"IF(_xlfn.ISFORMULA(ARG3_01!H98),_xlfn.FORMULATEXT(ARG3_01!H98),\"\")","v":""},{"$nulls":5},{"$f":"IF(ARG3_01!H102=\"\",\"\",IF(J102=\"f\",IF(H102=ARG3_01!H102,\"ü\",\"û\"),\"\"))","v":""}]
[null,{"$f":"\"\"","v":""},{"$f":"\"\"","v":""},{"$nulls":5},{"$f":"IF(ARG3_01!H103=\"\",\"\",IF(J103=\"f\",IF(H103=ARG3_01!H103,\"ü\",\"û\"),\"\"))","v":""}]
[null,"►","COLUMNA O FILA CALCULADA - SIN CELDA DE APOYO (2)",{"$nulls":5},{"$f":"IF(ARG3_01!H104=\"\",\"\",IF(J104=\"f\",IF(H104=ARG3_01!H104,\"ü\",\"û\"),\"\"))","v":""}]
[null,{"$f":"\"\"","v":""},{"$f":"\"¿A cuánto asciende la venta de los últimos meses de los 4 trimestres de la zona \"&C107&\"?\"","v":"¿A cuánto asciende la venta de los últimos meses de los 4 trimestres de la zona Sur?"},{"$nulls":5},{"$f":"IF(ARG3_01!H105=\"\",\"\",IF(J105=\"f\",IF(H105=ARG3_01!H105,\"ü\",\"û\"),\"\"))","v":""}]
[null,{"$f":"\"\"","v":""},"Opción 1: BUSCARH",{"$nulls":5},{"$f":"IF(ARG3_01!H106=\"\",\"\",IF(J106=\"f\",IF(H106=ARG3_01!H106,\"ü\",\"û\"),\"\"))","v":""}]
[null,{"$f":"\"\"","v":""},{"$f":"INDEX($M$7:$P$7,RANDBETWEEN(1,4))","v":"Sur"},{"$nulls":5},{"$f":"IF(ARG3_01!H107=\"\",\"\",IF(J107=\"f\",IF(H107=ARG3_01!H107,\"ü\",\"û\"),\"\"))","v":""}]
[null,{"$f":"\"\"","v":""},{"$f":"C90","v":"Marzo"},{"$nulls":4},{"$f":"HLOOKUP($C$107,$L$7:$P$19,3*(ROW()-ROW($H$108)+1)+1,0)","v":119.64},{"$f":"IF(ARG3_01!H108=\"\",\"\",IF(J108=\"f\",IF(H108=ARG3_01!H108,\"ü\",\"û\"),\"\"))","v":""},"f"]
[null,{"$f":"\"\"","v":""},"Junio",{"$nulls":4},{"$f":"HLOOKUP($C$107,$L$7:$P$19,3*(ROW()-ROW($H$108)+1)+1,0)","v":299.55},{"$f":"IF(ARG3_01!H109=\"\",\"\",IF(J109=\"f\",IF(H109=ARG3_01!H109,\"ü\",\"û\"),\"\"))","v":""},"f"]
[null,{"$f":"\"\"","v":""},"Setiembre",{"$nulls":4},{"$f":"HLOOKUP($C$107,$L$7:$P$19,3*(ROW()-ROW($H$108)+1)+1,0)","v":531.87},{"$f":"IF(ARG3_01!H110=\"\",\"\",IF(J110=\"f\",IF(H110=ARG3_01!H110,\"ü\",\"û\"),\"\"))","v":""},"f"]
[null,{"$f":"\"\"","v":""},"Diciembre",{"$nulls":4},{"$f":"HLOOKUP($C$107,$L$7:$P$19,3*(ROW()-ROW($H$108)+1)+1,0)","v":346.33},{"$f":"IF(ARG3_01!H111=\"\",\"\",IF(J111=\"f\",IF(H111=ARG3_01!H111,\"ü\",\"û\"),\"\"))","v":""},"f"]
[null,{"$f":"\"\"","v":""},{"$f":"IF(_xlfn.ISFORMULA(ARG3_01!H108),_xlfn.FORMULATEXT(ARG3_01!H108),\"\")","v":""},{"$nulls":5},{"$f":"IF(ARG3_01!H112=\"\",\"\",IF(J112=\"f\",IF(H112=ARG3_01!H112,\"ü\",\"û\"),\"\"))","v":""}]
[null,{"$f":"\"\"","v":""},{"$f":"\"\"","v":""},{"$nulls":5},{"$f":"IF(ARG3_01!H113=\"\",\"\",IF(J113=\"f\",IF(H113=ARG3_01!H113,\"ü\",\"û\"),\"\"))","v":""}]
[null,{"$f":"\"\"","v":""},"Ejercicio →",{"$nulls":5},{"$f":"IF(ARG3_01!H114=\"\",\"\",IF(J114=\"f\",IF(H114=ARG3_01!H114,\"ü\",\"û\"),\"\"))","v":""}]
[null,{"$f":"\"\"","v":""},{"$f":"C107","v":"Sur"},{"$nulls":5},{"$f":"IF(ARG3_01!H115=\"\",\"\",IF(J115=\"f\",IF(H115=ARG3_01!H115,\"ü\",\"û\"),\"\"))","v":""}]
[null,{"$f":"\"\"","v":""},{"$f":"TEXT(DATE(YEAR(TODAY()),4*ROWS(C$116:C116),1),\"mmmm\")","v":"Abril"},{"$nulls":4},{"$f":"HLOOKUP(C$115,$L$7:$P$19,(ROW()-ROW($H$116)+1)*4+1,0)","v":372.66},{"$f":"IF(ARG3_01!H116=\"\",\"\",IF(J116=\"f\",IF(H116=ARG3_01!H116,\"ü\",\"û\"),\"\"))","v":""},"f"]
[null,{"$f":"\"\"","v":""},{"$f":"TEXT(DATE(YEAR(TODAY()),4*ROWS(C$116:C117),1),\"mmmm\")","v":"Agosto"},{"$nulls":4},{"$f":"HLOOKUP(C$115,$L$7:$P$19,(ROW()-ROW($H$116)+1)*4+1,0)","v":246.85},{"$f":"IF(ARG3_01!H117=\"\",\"\",IF(J117=\"f\",IF(H117=ARG3_01!H117,\"ü\",\"û\"),\"\"))","v":""},"f"]
[null,{"$f":"\"\"","v":""},{"$f":"TEXT(DATE(YEAR(TODAY()),4*ROWS(C$116:C118),1),\"mmmm\")","v":"Diciembre"},{"$nulls":4},{"$f":"HLOOKUP(C$115,$L$7:$P$19,(ROW()-ROW($H$116)+1)*4+1,0)","v":346.33},{"$f":"IF(ARG3_01!H118=\"\",\"\",IF(J118=\"f\",IF(H118=ARG3_01!H118,\"ü\",\"û\"),\"\"))","v":""},"f"]
[null,{"$f":"\"\"","v":""},{"$f":"IF(_xlfn.ISFORMULA(ARG3_01!H116),_xlfn.FORMULATEXT(ARG3_01!H116),\"\")","v":""},{"$nulls":5},{"$f":"IF(ARG3_01!H119=\"\",\"\",IF(J119=\"f\",IF(H119=ARG3_01!H119,\"ü\",\"û\"),\"\"))","v":""}]

{"sheet":"DO_A1_07","index":15,"n_rows":18,"n_cols":13,"rows_kept":18,"hidden":true}
[]
[]
[]
[]
[]
[null,{"$f":"\"\"","v":""},"VALOR BUSCADO",{"$nulls":4},{"$f":"IF(ARG1_07!G6=\"\",\"\",IF(I6=\"f\",IF(G6=ARG1_07!G6,\"ü\",\"û\"),\"\"))","v":""}]
[null,{"$f":"\"\"","v":""},{"$f":"\"\"","v":""},{"$nulls":4},{"$f":"IF(ARG1_07!G7=\"\",\"\",IF(I7=\"f\",IF(G7=ARG1_07!G7,\"ü\",\"û\"),\"\"))","v":""}]
[null,"►","APROXIMACION DE FECHAS",{"$nulls":4},{"$f":"IF(ARG1_07!G8=\"\",\"\",IF(I8=\"f\",IF(G8=ARG1_07!G8,\"ü\",\"û\"),\"\"))","v":""},null,null,"Fecha","Nro Semana","Nro Turnos"]
[null,{"$f":"\"\"","v":""},{"$f":"\"\"","v":""},{"$nulls":4},{"$f":"IF(ARG1_07!G9=\"\",\"\",IF(I9=\"f\",IF(G9=ARG1_07!G9,\"ü\",\"û\"),\"\"))","v":""},null,null,{"$f":"SUM(EOMONTH(TODAY(),-1),-WEEKDAY(EOMONTH(TODAY(),-1),2),1,(ROWS(K$9:K9)-1)*7)","v":"2020-03-30"},{"$f":"\"Semana \"&WEEKNUM(K9,13)","v":"Semana 13"},{"$f":"RANDBETWEEN(1,3)","v":3}]
[null,{"$f":"\"\"","v":""},{"$f":"\"¿A qué número de semana pertenece la fecha del \"&TEXT(C12,\"dd/mm/\")&YEAR(C12)&\"?\"","v":"¿A qué número de semana pertenece la fecha del 06/04/2020?"},{"$nulls":4},{"$f":"IF(ARG1_07!G10=\"\",\"\",IF(I10=\"f\",IF(G10=ARG1_07!G10,\"ü\",\"û\"),\"\"))","v":""},null,null,{"$f":"SUM(EOMONTH(TODAY(),-1),-WEEKDAY(EOMONTH(TODAY(),-1),2),1,(ROWS(K$9:K10)-1)*7)","v":"2020-04-06"},{"$f":"\"Semana \"&WEEKNUM(K10,13)","v":"Semana 14"},3]
[null,{"$f":"\"\"","v":""},"Opción 1:",{"$nulls":4},{"$f":"IF(ARG1_07!G11=\"\",\"\",IF(I11=\"f\",IF(G11=ARG1_07!G11,\"ü\",\"û\"),\"\"))","v":""},null,null,{"$f":"SUM(EOMONTH(TODAY(),-1),-WEEKDAY(EOMONTH(TODAY(),-1),2),1,(ROWS(K$9:K11)-1)*7)","v":"2020-04-13"},{"$f":"\"Semana \"&WEEKNUM(K11,13)","v":"Semana 15"},3]
[null,{"$f":"\"\"","v":""},{"$f":"RANDBETWEEN(K9,K13)","v":"2020-04-06"},{"$nulls":3},{"$f":"VLOOKUP(C12,$K$9:$M$13,2,1)","v":"Semana 14"},{"$f":"IF(ARG1_07!G12=\"\",\"\",IF(I12=\"f\",IF(G12=ARG1_07!G12,\"ü\",\"û\"),\"\"))","v":""},"f",null,{"$f":"SUM(EOMONTH(TODAY(),-1),-WEEKDAY(EOMONTH(TODAY(),-1),2),1,(ROWS(K$9:K12)-1)*7)","v":"2020-04-20"},{"$f":"\"Semana \"&WEEKNUM(K12,13)","v":"Semana 16"},1]
[null,{"$f":"\"\"","v":""},{"$f":"IF(_xlfn.ISFORMULA(ARG1_07!G12),_xlfn.FORMULATEXT(ARG1_07!G12),\"\")","v":""},{"$nulls":4},{"$f":"IF(ARG1_07!G13=\"\",\"\",IF(I13=\"f\",IF(G13=ARG1_07!G13,\"ü\",\"û\"),\"\"))","v":""},null,null,{"$f":"SUM(EOMONTH(TODAY(),-1),-WEEKDAY(EOMONTH(TODAY(),-1),2),1,(ROWS(K$9:K13)-1)*7)","v":"2020-04-27"},{"$f":"\"Semana \"&WEEKNUM(K13,13)","v":"Semana 17"},1]
[null,{"$f":"\"\"","v":""},{"$f":"\"\"","v":""},{"$nulls":4},{"$f":"IF(ARG1_07!G14=\"\",\"\",IF(I14=\"f\",IF(G14=ARG1_07!G14,\"ü\",\"û\"),\"\"))","v":""}]
[null,{"$f":"\"\"","v":""},{"$f":"\"¿Cuántos turnos de trabajo tuvo la semana \"&C17&\"?\"","v":"¿Cuántos turnos de trabajo tuvo la semana 16?"},{"$nulls":4},{"$f":"IF(ARG1_07!G15=\"\",\"\",IF(I15=\"f\",IF(G15=ARG1_07!G15,\"ü\",\"û\"),\"\"))","v":""}]
[null,{"$f":"\"\"","v":""},"Ejercicio →",{"$nulls":4},{"$f":"IF(ARG1_07!G16=\"\",\"\",IF(I16=\"f\",IF(G16=ARG1_07!G16,\"ü\",\"û\"),\"\"))","v":""}]
[null,{"$f":"\"\"","v":""},{"$f":"SUBSTITUTE(INDEX($L$9:$L$13,RANDBETWEEN(1,5)),\"Semana \",\"\")","v":"16"},{"$nulls":3},{"$f":"VLOOKUP(\"Semana \"&C17,$L$8:$M$13,2,0)","v":1},{"$f":"IF(ARG1_07!G17=\"\",\"\",IF(I17=\"f\",IF(G17=ARG1_07!G17,\"ü\",\"û\"),\"\"))","v":""},"f"]
[null,{"$f":"\"\"","v":""},{"$f":"IF(_xlfn.ISFORMULA(ARG1_07!G17),_xlfn.FORMULATEXT(ARG1_07!G17),\"\")","v":""},{"$nulls":4},{"$f":"IF(ARG1_07!G18=\"\",\"\",IF(I18=\"f\",IF(G18=ARG1_07!G18,\"ü\",\"û\"),\"\"))","v":""}]

{"sheet":"ARG1_07","index":16,"n_rows":18,"n_cols":12,"rows_kept":18,"hidden":true}
[null,"Argumento valor buscado"]
[null,"MOS Expert - CPC Martín Cruz - 998401784"]
[]
[]
[]
[null,{"$f":"lista01.20","v":""},"VALOR BUSCADO",{"$nulls":4},{"$f":"lista01.22","v":""}]
[null,"","",{"$nulls":4},""]
[null,"►","APROXIMACION DE FECHAS",{"$nulls":4},"",null,{"$f":"lista01.21","v":"Fecha"},"Nro Semana","Nro Turnos"]
[null,"","",{"$nulls":4},"",null,"2020-03-30","Semana 13",3]
[null,"","¿A qué número de semana pertenece la fecha del 06/04/2020?",{"$nulls":4},"",null,"2020-04-06","Semana 14",3]
[null,"","Opción 1:",{"$nulls":4},"",null,"2020-04-13","Semana 15",3]
[null,"","2020-04-06",{"$nulls":4},"",null,"2020-04-20","Semana 16",1]
[null,"","",{"$nulls":4},"",null,"2020-04-27","Semana 17",1]
[null,"","",{"$nulls":4},""]
[null,"","¿Cuántos turnos de trabajo tuvo la semana 16?",{"$nulls":4},""]
[null,"","Ejercicio →",{"$nulls":4},""]
[null,"","16",{"$nulls":4},""]
[null,"","",{"$nulls":4},""]

{"sheet":"DO_A1_08","index":17,"n_rows":18,"n_cols":16,"rows_kept":18,"hidden":true}
[]
[]
[]
[]
[]
[null,{"$f":"\"\"","v":""},"VALOR BUSCADO",{"$nulls":4},{"$f":"IF(ARG1_08!G6=\"\",\"\",IF(I6=\"f\",IF(G6=ARG1_08!G6,\"ü\",\"û\"),\"\"))","v":""}]
[null,{"$f":"\"\"","v":""},{"$f":"\"\"","v":""},{"$nulls":4},{"$f":"IF(ARG1_08!G7=\"\",\"\",IF(I7=\"f\",IF(G7=ARG1_08!G7,\"ü\",\"û\"),\"\"))","v":""}]
[null,"►","APROXIMACION DE TEXTO",{"$nulls":4},{"$f":"IF(ARG1_08!G8=\"\",\"\",IF(I8=\"f\",IF(G8=ARG1_08!G8,\"ü\",\"û\"),\"\"))","v":""},null,null,"Razón Social","R.U.C."]
[null,{"$f":"\"\"","v":""},{"$f":"\"\"","v":""},{"$nulls":4},{"$f":"IF(ARG1_08!G9=\"\",\"\",IF(I9=\"f\",IF(G9=ARG1_08!G9,\"ü\",\"û\"),\"\"))","v":""},null,null,"Agricola Alaska EIRL",20449241887,null,{"$f":"RAND()","v":0.4550292738098918},{"$f":"K9","v":"Agricola Alaska EIRL"},{"$f":"SUBSTITUTE(SUBSTITUTE(SUBSTITUTE(K9,\" EIRL\",\"\"),\" SAC\",\"\"),\" SRL\",\"\")","v":"Agricola Alaska"}]
[null,{"$f":"\"\"","v":""},{"$f":"\"¿Indique el RUC de \"&UPPER(C12)&\"?\"","v":"¿Indique el RUC de AGRICOLA ALTO VALLE SAC?"},{"$nulls":4},{"$f":"IF(ARG1_08!G10=\"\",\"\",IF(I10=\"f\",IF(G10=ARG1_08!G10,\"ü\",\"û\"),\"\"))","v":""},null,null,"Agricola Alto Valle SAC",20407876661,null,0.7039015287384219,"Agricola Alto Valle SAC","Agricola Alto Valle"]
[null,{"$f":"\"\"","v":""},"Opción 1:",{"$nulls":4},{"$f":"IF(ARG1_08!G11=\"\",\"\",IF(I11=\"f\",IF(G11=ARG1_08!G11,\"ü\",\"û\"),\"\"))","v":""},null,null,"Botica Maranatha SRL",20481440395,null,0.810456987614541,"Botica Maranatha SRL","Botica Maranatha"]
[null,{"$f":"\"\"","v":""},{"$f":"INDEX($K$9:$K$18,RANDBETWEEN(1,5)*2)","v":"Agricola Alto Valle SAC"},{"$nulls":3},{"$f":"VLOOKUP(C12,$K$9:$L$18,2,1)","v":20407876661},{"$f":"IF(ARG1_08!G12=\"\",\"\",IF(I12=\"f\",IF(G12=ARG1_08!G12,\"ü\",\"û\"),\"\"))","v":""},"f",null,"Botica Municipal EIRL",20105149914,null,0.6869882429162877,"Botica Municipal EIRL","Botica Municipal"]
[null,{"$f":"\"\"","v":""},{"$f":"IF(_xlfn.ISFORMULA(ARG1_08!G12),_xlfn.FORMULATEXT(ARG1_08!G12),\"\")","v":""},{"$nulls":4},{"$f":"IF(ARG1_08!G13=\"\",\"\",IF(I13=\"f\",IF(G13=ARG1_08!G13,\"ü\",\"û\"),\"\"))","v":""},null,null,"Casapan Perú SAC",20515633449,null,0.6464556458649958,"Casapan Perú SAC","Casapan Perú"]
[null,{"$f":"\"\"","v":""},{"$f":"\"\"","v":""},{"$nulls":4},{"$f":"IF(ARG1_08!G14=\"\",\"\",IF(I14=\"f\",IF(G14=ARG1_08!G14,\"ü\",\"û\"),\"\"))","v":""},null,null,"Casinos América SAC",20481357901,null,0.826743109332418,"Casinos América SAC","Casinos América"]
[null,{"$f":"\"\"","v":""},{"$f":"\"¿Cuántos turnos de trabajo tuvo la semana \"&C17&\"?\"","v":"¿Cuántos turnos de trabajo tuvo la semana Agricola Alto Valle?"},{"$nulls":4},{"$f":"IF(ARG1_08!G15=\"\",\"\",IF(I15=\"f\",IF(G15=ARG1_08!G15,\"ü\",\"û\"),\"\"))","v":""},null,null,"Chifa Casa Oriental SAC",20517054675,null,0.14282757894806464,"Chifa Casa Oriental SAC","Chifa Casa Oriental"]
[null,{"$f":"\"\"","v":""},"Ejercicio →",{"$nulls":4},{"$f":"IF(ARG1_08!G16=\"\",\"\",IF(I16=\"f\",IF(G16=ARG1_08!G16,\"ü\",\"û\"),\"\"))","v":""},null,null,"Chifa Continental SRL",20452306515,null,0.4402713787395103,"Chifa Continental SRL","Chifa Continental"]
[null,{"$f":"\"\"","v":""},{"$f":"VLOOKUP(C12,$O$9:$P$18,2,0)","v":"Agricola Alto Valle"},{"$nulls":3},{"$f":"VLOOKUP(C17,$K$9:$L$18,2,1)","v":20449241887},{"$f":"IF(ARG1_08!G17=\"\",\"\",IF(I17=\"f\",IF(G17=ARG1_08!G17,\"ü\",\"û\"),\"\"))","v":""},"f",null,"Distribuciones CMP EIRL",20455312877,null,0.10531088880018469,"Distribuciones CMP EIRL","Distribuciones CMP"]
[null,{"$f":"\"\"","v":""},{"$f":"IF(_xlfn.ISFORMULA(ARG1_08!G17),_xlfn.FORMULATEXT(ARG1_08!G17),\"\")","v":""},{"$nulls":4},{"$f":"IF(ARG1_08!G18=\"\",\"\",IF(I18=\"f\",IF(G18=ARG1_08!G18,\"ü\",\"û\"),\"\"))","v":""},null,null,"Distribuciones DAN SRL",20482213279,null,0.9528746170113491,"Distribuciones DAN SRL","Distribuciones DAN"]

{"sheet":"ARG1_08","index":18,"n_rows":18,"n_cols":11,"rows_kept":18,"hidden":true}
[null,"Argumento valor buscado"]
[null,"MOS Expert - CPC Martín Cruz - 998401784"]
[]
[]
[]
[null,{"$f":"lista01.23","v":""},"VALOR BUSCADO",{"$nulls":4},{"$f":"lista01.25","v":""}]
[null,"","",{"$nulls":4},""]
[null,"►","APROXIMACION DE TEXTO",{"$nulls":4},"",null,{"$f":"lista01.24","v":"Razón Social"},"R.U.C."]
[null,"","",{"$nulls":4},"",null,"Agricola Alaska EIRL",20449241887]
[null,"","¿Indique el RUC de AGRICOLA ALTO VALLE SAC?",{"$nulls":4},"",null,"Agricola Alto Valle SAC",20407876661]
[null,"","Opción 1:",{"$nulls":4},"",null,"Botica Maranatha SRL",20481440395]
[null,"","Agricola Alto Valle SAC",{"$nulls":4},"",null,"Botica Municipal EIRL",20105149914]
[null,"","",{"$nulls":4},"",null,"Casapan Perú SAC",20515633449]
[null,"","",{"$nulls":4},"",null,"Casinos América SAC",20481357901]
[null,"","¿Cuántos turnos de trabajo tuvo la semana Agricola Alto Valle?",{"$nulls":4},"",null,"Chifa Casa Oriental SAC",20517054675]
[null,"","Ejercicio →",{"$nulls":4},"",null,"Chifa Continental SRL",20452306515]
[null,"","Agricola Alto Valle",{"$nulls":4},"",null,"Distribuciones CMP EIRL",20455312877]
[null,"","",{"$nulls":4},"",null,"Distribuciones DAN SRL",20482213279]

{"sheet":"DO_A1_09","index":19,"n_rows":40,"n_cols":10,"rows_kept":40,"hidden":true}
[]
[]
[]
[]
[]
[null,null,{"$f":"\"\"","v":""},"VALOR BUSCADO"]
[null,null,{"$f":"\"\"","v":""},{"$f":"\"\"","v":""}]
[null,null,"►","APROXIMACION TEXTO (2)"]
[]
[{"$nulls":3},"Razón Social",null,null,"Razón Social","Razón Social","R.U.C.","Similarity"]
[{"$nulls":3},"Botica Maranatha",6,null,"Botica Maranatha","Botica Maranatha SRL",20481440395,{"v":0.96,"d":"0.9600"}]
[{"$nulls":3},"Botica Municipal",6,null,"Botica Municipal","Botica Municipal EIRL",20105149914,{"v":0.96,"d":"0.9600"}]
[{"$nulls":3},"Casapan Perú",6,null,"Casapan Perú","Casapan Perú SAC",20515633449,{"v":0.96,"d":"0.9600"}]
[{"$nulls":3},"Chifa Casa Oriental",6,null,"Chifa Casa Oriental","Chifa Casa Oriental SAC",20517054675,{"v":0.9714285714285714,"d":"0.9714"}]
[{"$nulls":3},"Agricola Alto Valle",6]
[]
[{"$nulls":3},"Razón Social","R.U.C.",null,"Razón Social","Razón Social","R.U.C.","Similarity"]
[{"$nulls":3},"Agricola Alaska EIRL",20449241887,null,"Botica Maranatha","Botica Maranatha SRL",20481440395,{"v":0.96,"d":"0.9600"}]
[{"$nulls":3},"Agricola Alto Valle SAC",20407876661,null,"Botica Municipal","Botica Municipal EIRL",20105149914,{"v":0.96,"d":"0.9600"}]
[{"$nulls":3},"Agricola Alto Valle SRL",20407876662,null,"Casapan Perú","Casapan Perú SAC",20515633449,{"v":0.96,"d":"0.9600"}]
[{"$nulls":3},"Botica Maranatha SRL",20481440395,null,"Chifa Casa Oriental","Chifa Casa Oriental SAC",20517054675,{"v":0.9714285714285714,"d":"0.9714"}]
[{"$nulls":3},"Botica Municipal EIRL",20105149914,null,"Agricola Alto Valle","Agricola Alto Valle SAC",20407876661,{"v":0.9666666666666667,"d":"0.9667"}]
[{"$nulls":3},"Casapan Perú SAC",20515633449]
[{"$nulls":3},"Casinos América SAC",20481357901,null,"Razón Social","Razón Social","R.U.C.","Similarity"]
[{"$nulls":3},"Chifa Casa Oriental SAC",20517054675,null,"Botica Maranatha","Botica Maranatha SRL",20481440395,{"v":0.96,"d":"0.9600"}]
[{"$nulls":3},"Chifa Continental SRL",20452306515,null,"Botica Municipal","Botica Municipal EIRL",20105149914,{"v":0.96,"d":"0.9600"}]
[{"$nulls":3},"Distribuciones CMP EIRL",20455312877,null,"Casapan Perú","Casapan Perú SAC",20515633449,{"v":0.96,"d":"0.9600"}]
[{"$nulls":3},"Distribuciones DAN SRL",20482213279,null,"Chifa Casa Oriental","Chifa Casa Oriental SAC",20517054675,{"v":0.9714285714285714,"d":"0.9714"}]
[{"$nulls":6},"Agricola Alto Valle","Agricola Alto Valle SAC",20407876661,{"v":0.9666666666666667,"d":"0.9667"}]
[{"$nulls":6},"Agricola Alto Valle","Agricola Alto Valle SRL",20407876662,{"v":0.9666666666666667,"d":"0.9667"}]
[{"$nulls":3},"Agricola Alaska"]
[{"$nulls":3},"Agricola Alto Valle"]
[{"$nulls":3},"Botica Maranatha"]
[{"$nulls":3},"Botica Municipal"]
[{"$nulls":3},"Casapan Perú"]
[{"$nulls":3},"Casinos América"]
[{"$nulls":3},"Chifa Casa Oriental"]
[{"$nulls":3},"Chifa Continental"]
[{"$nulls":3},"Distribuciones CMP"]
[{"$nulls":3},"Distribuciones DAN"]

{"sheet":"ARG1_09","index":20,"n_rows":40,"n_cols":5,"rows_kept":40,"hidden":true}
[null,"Argumento valor buscado"]
[null,"MOS Expert - CPC Martín Cruz - 998401784"]
[]
[]
[]
[null,null,{"$f":"\"\"","v":""},"VALOR BUSCADO"]
[null,null,{"$f":"\"\"","v":""},{"$f":"\"\"","v":""}]
[null,null,"►","APROXIMACION DE TEXTO (2)"]
[]
[{"$nulls":3},"Razón Social"]
[{"$nulls":3},"Botica Maranatha",6]
[{"$nulls":3},"Botica Municipal",6]
[{"$nulls":3},"Casapan Perú",6]
[{"$nulls":3},"Chifa Casa Oriental",6]
[{"$nulls":3},"Agricola Alto Valle",6]
[]
[{"$nulls":3},"Razón Social","R.U.C."]
[{"$nulls":3},"Agricola Alaska EIRL",20449241887]
[{"$nulls":3},"Agricola Alto Valle SAC",20407876661]
[{"$nulls":3},"Agricola Alto Valle SRL",20407876662]
[{"$nulls":3},"Botica Maranatha SRL",20481440395]
[{"$nulls":3},"Botica Municipal EIRL",20105149914]
[{"$nulls":3},"Casapan Perú SAC",20515633449]
[{"$nulls":3},"Casinos América SAC",20481357901]
[{"$nulls":3},"Chifa Casa Oriental SAC",20517054675]
[{"$nulls":3},"Chifa Continental SRL",20452306515]
[{"$nulls":3},"Distribuciones CMP EIRL",20455312877]
[{"$nulls":3},"Distribuciones DAN SRL",20482213279]
[]
[]
[{"$nulls":3},"Agricola Alaska"]
[{"$nulls":3},"Agricola Alto Valle"]
[{"$nulls":3},"Botica Maranatha"]
[{"$nulls":3},"Botica Municipal"]
[{"$nulls":3},"Casapan Perú"]
[{"$nulls":3},"Casinos América"]
[{"$nulls":3},"Chifa Casa Oriental"]
[{"$nulls":3},"Chifa Continental"]
[{"$nulls":3},"Distribuciones CMP"]
[{"$nulls":3},"Distribuciones DAN"]

{"sheet":"ARG3_01","index":21,"n_rows":119,"n_cols":15,"rows_kept":119,"hidden":true}
[null,"Argumento indicador de columna - fila"]
[null,"MOS Expert - CPC Martín Cruz - 998401784"]
[]
[]
[]
[null,{"$f":"lista03.02","v":""},"INDICADOR DE COLUMNA - INDICADOR DE FILA",{"$nulls":5},{"$f":"lista03.05","v":""}]
[null,"","",{"$nulls":5},""]
[null,"►","COLUMNA O FILA FIJA",{"$nulls":5},"",null,{"$f":"lista03.01","v":"Meses"},"Norte","Sur","Este","Oeste"]
[null,"","",{"$nulls":5},"",null,"Enero",210.32,220.54,326.91,{"v":578.6,"d":"578.60"}]
[null,"","¿A cuánto asciende la venta del mes de Abril de la zona Norte?",{"$nulls":5},"",null,"Febrero",128.27,116.31,410.67,465.84]
[null,"","Opción 1: BUSCARV",{"$nulls":5},"",null,"Marzo",475.69,119.64,{"v":356.3,"d":"356.30"},301.94]
[null,"","Abril",{"$nulls":4},{"$f":"VLOOKUP(C12,$K$8:$O$20,2,0)","v":103.31},"ü",null,"Abril",103.31,372.66,{"v":257.5,"d":"257.50"},439.48]
[null,"","=BUSCARV(C12,$K$8:$O$20,2,0)",{"$nulls":5},"",null,"Mayo",128.04,336.61,{"v":439.8,"d":"439.80"},144.35]
[null,"","",{"$nulls":5},"",null,"Junio",472.26,299.55,186.03,350.33]
[null,"","¿A cuánto asciende la venta del mes de Mayo de la zona Oeste?",{"$nulls":5},"",null,"Julio",554.29,{"v":413.3,"d":"413.30"},229.49,333.28]
[null,"","Opción 2: BUSCARH",{"$nulls":5},"",null,"Agosto",416.17,246.85,522.31,{"v":173.4,"d":"173.40"}]
[null,"","Oeste",{"$nulls":4},{"$f":"HLOOKUP(C17,$K$8:$O$20,6,0)","v":144.35},"ü",null,"Setiembre",{"v":329.3,"d":"329.30"},531.87,516.83,427.04]
[null,"","=BUSCARH(C17,$K$8:$O$20,6,0)",{"$nulls":5},"",null,"Octubre",160.43,268.61,{"v":534.1,"d":"534.10"},409.35]
[null,"","",{"$nulls":5},"",null,"Noviembre",432.32,435.01,183.47,120.47]
[null,"►","COLUMNA O FILA CALCULADA - CON CELDA DE APOYO (1)",{"$nulls":5},"",null,"Diciembre",122.43,346.33,414.56,155.76]
[null,"","",{"$nulls":5},""]
[null,"","¿A cuánto asciende la venta del mes de Diciembre de la zona Oeste?",{"$nulls":5},""]
[null,"","Opción 1: BUSCARV",{"$nulls":5},""]
[null,"","Diciembre",{"$nulls":5},""]
[null,"","Oeste",{"$nulls":5},""]
[null,"","",{"$nulls":5},""]
[null,"","",{"$nulls":5},""]
[null,"","Ejercicio →",{"$nulls":5},""]
[null,"","Marzo",{"$nulls":5},""]
[null,"","Norte",{"$nulls":5},""]
[null,"","",{"$nulls":5},""]
[null,"","",{"$nulls":5},""]
[null,"","¿A cuánto asciende la venta de la zona Sur del mes de Abril?",{"$nulls":5},""]
[null,"","Opción 2: BUSCARH",{"$nulls":5},""]
[null,"","Sur",{"$nulls":5},""]
[null,"","Abril",{"$nulls":5},""]
[null,"","",{"$nulls":5},""]
[null,"","",{"$nulls":5},""]
[null,"","Ejercicio →",{"$nulls":5},""]
[null,"","Norte",{"$nulls":5},""]
[null,"","Mayo",{"$nulls":5},""]
[null,"","",{"$nulls":5},""]
[null,"","",{"$nulls":5},""]
[null,"►","COLUMNA O FILA CALCULADA - SIN CELDA DE APOYO",{"$nulls":5},""]
[null,"","",{"$nulls":5},""]
[null,"","¿A cuánto asciende la venta del mes de Agosto de todas las zonas?",{"$nulls":5},""]
[null,"","Opción 1: BUSCARV",{"$nulls":5},""]
[null,"","Agosto",{"$nulls":5},""]
[null,"","Zona Norte",{"$nulls":5},""]
[null,"","Zona Sur",{"$nulls":5},""]
[null,"","",{"$nulls":5},""]
[null,"","",{"$nulls":5},""]
[null,"","Opción 2: BUSCARV",{"$nulls":5},""]
[null,"","Agosto",{"$f":"lista03.03","v":""},{"$nulls":4},""]
[null,"","Zona Norte","Zona Sur",{"$nulls":4},""]
[null,"","",{"$nulls":5},""]
[null,"","",{"$nulls":5},""]
[null,"","Ejercicio →",{"$nulls":5},""]
[null,"","Julio",{"$nulls":5},""]
[null,"","Zona Este",{"$nulls":5},""]
[null,"","Zona Oeste",{"$nulls":5},""]
[null,"","",{"$nulls":5},""]
[null,"","",{"$nulls":5},""]
[null,"","Ejercicio →",{"$nulls":5},""]
[null,"","Julio",{"$f":"lista03.04","v":""},{"$nulls":4},""]
[null,"","Zona Este","Zona Oeste",{"$nulls":4},""]
[null,"","",{"$nulls":5},""]
[null,"","",{"$nulls":5},""]
[null,"►","COLUMNA O FILA CALCULADA - CON CELDA DE APOYO (2)",{"$nulls":5},""]
[null,"","¿A cuánto asciende la venta del mes de Noviembre de todas las zonas?",{"$nulls":5},""]
[null,"","Opción 1: BUSCARV",{"$nulls":5},""]
[null,"","Noviembre",{"$nulls":5},""]
[null,"","Este",{"$nulls":5},""]
[null,"","Sur",{"$nulls":5},""]
[null,"","Norte",{"$nulls":5},""]
[null,"","Oeste",{"$nulls":5},""]
[null,"","",{"$nulls":5},""]
[null,"","",{"$nulls":5},""]
[null,"","Opción 2: BUSCARH",{"$nulls":5},""]
[null,"","Noviembre",{"$nulls":5},""]
[null,"","Este",{"$nulls":5},""]
[null,"","Sur",{"$nulls":5},""]
[null,"","Norte",{"$nulls":5},""]
[null,"","Oeste",{"$nulls":5},""]
[null,"","",{"$nulls":5},""]
[null,"","",{"$nulls":5},""]
[null,"","¿A cuánto asciende la venta de los últimos meses de los 4 trimestres de la zona Este?",{"$nulls":5},""]
[null,"","Ejercicio →",{"$nulls":5},""]
[null,"","Este",{"$nulls":5},""]
[null,"","Marzo",{"$nulls":5},""]
[null,"","Junio",{"$nulls":5},""]
[null,"","Setiembre",{"$nulls":5},""]
[null,"","Diciembre",{"$nulls":5},""]
[null,"","",{"$nulls":5},""]
[null,"","",{"$nulls":5},""]
[null,"","Ejercicio →",{"$nulls":5},""]
[null,"","Este",{"$nulls":5},""]
[null,"","Marzo",{"$nulls":5},""]
[null,"","Junio",{"$nulls":5},""]
[null,"","Setiembre",{"$nulls":5},""]
[null,"","Diciembre",{"$nulls":5},""]
[null,"","",{"$nulls":5},""]
[null,"","",{"$nulls":5},""]
[null,"►","COLUMNA O FILA CALCULADA - SIN CELDA DE APOYO (2)",{"$nulls":5},""]
[null,"","¿A cuánto asciende la venta de los últimos meses de los 4 trimestres de la zona Sur?",{"$nulls":5},""]
[null,"","Opción 1: BUSCARH",{"$nulls":5},""]
[null,"","Sur",{"$nulls":5},""]
[null,"","Marzo",{"$nulls":5},""]
[null,"","Junio",{"$nulls":5},""]
[null,"","Setiembre",{"$nulls":5},""]
[null,"","Diciembre",{"$nulls":5},""]
[null,"","",{"$nulls":5},""]
[null,"","",{"$nulls":5},""]
[null,"","Ejercicio →",{"$nulls":5},""]
[null,"","Sur",{"$nulls":5},""]
[null,"","Abril",{"$nulls":5},""]
[null,"","Agosto",{"$nulls":5},""]
[null,"","Diciembre",{"$nulls":5},""]
[null,"","",{"$nulls":5},""]

{"sheet":"DO_A3_02","index":22,"n_rows":28,"n_cols":21,"rows_kept":28,"hidden":true}
[]
[]
[]
[]
[]
[null,{"$f":"\"\"","v":""},"INDICADOR DE COLUMNA - INDICADOR DE FILA",{"$nulls":5},{"$f":"IF(ARG3_02!H6=\"\",\"\",IF(J6=\"f\",IF(H6=ARG3_02!H6,\"ü\",\"û\"),\"\"))","v":""}]
[null,{"$f":"\"\"","v":""},{"$f":"\"\"","v":""},{"$nulls":5},{"$f":"IF(ARG3_02!H7=\"\",\"\",IF(J7=\"f\",IF(H7=ARG3_02!H7,\"ü\",\"û\"),\"\"))","v":""},null,null,"Meses","Norte","Sur","Este","Oeste"]
[null,"►","COLUMNA O FILA CALCULADA - CON CELDA DE APOYO CASO ESPECIAL (1)",{"$nulls":5},{"$f":"IF(ARG3_02!H8=\"\",\"\",IF(J8=\"f\",IF(H8=ARG3_02!H8,\"ü\",\"û\"),\"\"))","v":""},null,null,{"$f":"PROPER(TEXT(DATE(YEAR(TODAY()),ROWS(L$8:L8),1),\"mmmm\"))","v":"Enero"},{"$f":"ROUND(RANDBETWEEN(100,600)+RAND(),2)","v":287.59},{"v":498.3,"d":"498.30"},136.59,455.44,null,null,{"$f":"RAND()","v":0.8286906553918316},{"$f":"LEFT(L8,3)","v":"Ene"},{"$f":"VLOOKUP(LARGE($S$8:$S$19,ROWS(U$8:U8)),$S$8:$T$19,2,0)","v":"Ene"}]
[null,{"$f":"\"\"","v":""},{"$f":"\"¿A cuánto asciende la venta de los meses indicados de la zona \"&C11&\"?\"","v":"¿A cuánto asciende la venta de los meses indicados de la zona Norte?"},{"$nulls":5},{"$f":"IF(ARG3_02!H9=\"\",\"\",IF(J9=\"f\",IF(H9=ARG3_02!H9,\"ü\",\"û\"),\"\"))","v":""},null,null,{"$f":"PROPER(TEXT(DATE(YEAR(TODAY()),ROWS(L$8:L9),1),\"mmmm\"))","v":"Febrero"},224.65,208.58,423.87,182.99,null,null,0.8209010518252514,"Feb",{"$f":"VLOOKUP(LARGE($S$8:$S$19,ROWS(U$8:U9)),$S$8:$T$19,2,0)","v":"Feb"}]
[null,{"$f":"\"\"","v":""},"Ejercicio →",{"$nulls":5},{"$f":"IF(ARG3_02!H10=\"\",\"\",IF(J10=\"f\",IF(H10=ARG3_02!H10,\"ü\",\"û\"),\"\"))","v":""},null,null,{"$f":"PROPER(TEXT(DATE(YEAR(TODAY()),ROWS(L$8:L10),1),\"mmmm\"))","v":"Marzo"},292.28,478.66,{"v":371.1,"d":"371.10"},466.37,null,null,0.1951460941965606,"Mar",{"$f":"VLOOKUP(LARGE($S$8:$S$19,ROWS(U$8:U10)),$S$8:$T$19,2,0)","v":"May"}]
[null,{"$f":"\"\"","v":""},{"$f":"INDEX($M$7:$P$7,RANDBETWEEN(1,4))","v":"Norte"},{"$nulls":5},{"$f":"IF(ARG3_02!H11=\"\",\"\",IF(J11=\"f\",IF(H11=ARG3_02!H11,\"ü\",\"û\"),\"\"))","v":""},null,null,{"$f":"PROPER(TEXT(DATE(YEAR(TODAY()),ROWS(L$8:L11),1),\"mmmm\"))","v":"Abril"},304.83,279.09,491.11,551.13,null,null,0.25022744320268975,"Abr",{"$f":"VLOOKUP(LARGE($S$8:$S$19,ROWS(U$8:U11)),$S$8:$T$19,2,0)","v":"Jul"}]
[null,{"$f":"\"\"","v":""},{"$f":"TEXT(DATE(YEAR(TODAY()),(ROWS(C$12:C12)-1)*2+1,1),\"mmm\")","v":"Ene"},{"$nulls":4},{"$f":"HLOOKUP($C$11,$L$7:$P$19,ROWS(H$12:H12)*2,0)","v":287.59},{"$f":"IF(ARG3_02!H12=\"\",\"\",IF(J12=\"f\",IF(H12=ARG3_02!H12,\"ü\",\"û\"),\"\"))","v":""},"f",null,{"$f":"PROPER(TEXT(DATE(YEAR(TODAY()),ROWS(L$8:L12),1),\"mmmm\"))","v":"Mayo"},383.05,529.74,138.29,{"v":511.2,"d":"511.20"},null,null,0.6606377920406351,"May",{"$f":"VLOOKUP(LARGE($S$8:$S$19,ROWS(U$8:U12)),$S$8:$T$19,2,0)","v":"Nov"}]
[null,{"$f":"\"\"","v":""},{"$f":"TEXT(DATE(YEAR(TODAY()),(ROWS(C$12:C13)-1)*2+1,1),\"mmm\")","v":"Mar"},{"$nulls":4},{"$f":"HLOOKUP($C$11,$L$7:$P$19,ROWS(H$12:H13)*2,0)","v":292.28},{"$f":"IF(ARG3_02!H13=\"\",\"\",IF(J13=\"f\",IF(H13=ARG3_02!H13,\"ü\",\"û\"),\"\"))","v":""},"f",null,{"$f":"PROPER(TEXT(DATE(YEAR(TODAY()),ROWS(L$8:L13),1),\"mmmm\"))","v":"Junio"},146.02,477.27,190.68,506.04,null,null,0.3309372802264394,"Jun",{"$f":"VLOOKUP(LARGE($S$8:$S$19,ROWS(U$8:U13)),$S$8:$T$19,2,0)","v":"Ago"}]
[null,{"$f":"\"\"","v":""},{"$f":"TEXT(DATE(YEAR(TODAY()),(ROWS(C$12:C14)-1)*2+1,1),\"mmm\")","v":"May"},{"$nulls":4},{"$f":"HLOOKUP($C$11,$L$7:$P$19,ROWS(H$12:H14)*2,0)","v":383.05},{"$f":"IF(ARG3_02!H14=\"\",\"\",IF(J14=\"f\",IF(H14=ARG3_02!H14,\"ü\",\"û\"),\"\"))","v":""},"f",null,{"$f":"PROPER(TEXT(DATE(YEAR(TODAY()),ROWS(L$8:L14),1),\"mmmm\"))","v":"Julio"},140.42,558.67,148.05,502.13,null,null,0.6301477502861111,"Jul",{"$f":"VLOOKUP(LARGE($S$8:$S$19,ROWS(U$8:U14)),$S$8:$T$19,2,0)","v":"Jun"}]
[null,{"$f":"\"\"","v":""},{"$f":"TEXT(DATE(YEAR(TODAY()),(ROWS(C$12:C15)-1)*2+1,1),\"mmm\")","v":"Jul"},{"$nulls":4},{"$f":"HLOOKUP($C$11,$L$7:$P$19,ROWS(H$12:H15)*2,0)","v":140.42},{"$f":"IF(ARG3_02!H15=\"\",\"\",IF(J15=\"f\",IF(H15=ARG3_02!H15,\"ü\",\"û\"),\"\"))","v":""},"f",null,{"$f":"PROPER(TEXT(DATE(YEAR(TODAY()),ROWS(L$8:L15),1),\"mmmm\"))","v":"Agosto"},484.79,555.69,398.44,395.24,null,null,0.41411979289384737,"Ago",{"$f":"VLOOKUP(LARGE($S$8:$S$19,ROWS(U$8:U15)),$S$8:$T$19,2,0)","v":"Abr"}]
[null,{"$f":"\"\"","v":""},{"$f":"TEXT(DATE(YEAR(TODAY()),(ROWS(C$12:C16)-1)*2+1,1),\"mmm\")","v":"Set"},{"$nulls":4},{"$f":"HLOOKUP($C$11,$L$7:$P$19,ROWS(H$12:H16)*2,0)","v":237.06},{"$f":"IF(ARG3_02!H16=\"\",\"\",IF(J16=\"f\",IF(H16=ARG3_02!H16,\"ü\",\"û\"),\"\"))","v":""},"f",null,{"$f":"PROPER(TEXT(DATE(YEAR(TODAY()),ROWS(L$8:L16),1),\"mmmm\"))","v":"Setiembre"},237.06,262.36,189.75,141.62,null,null,0.04041923129034264,"Set",{"$f":"VLOOKUP(LARGE($S$8:$S$19,ROWS(U$8:U16)),$S$8:$T$19,2,0)","v":"Mar"}]
[null,{"$f":"\"\"","v":""},{"$f":"TEXT(DATE(YEAR(TODAY()),(ROWS(C$12:C17)-1)*2+1,1),\"mmm\")","v":"Nov"},{"$nulls":4},{"$f":"HLOOKUP($C$11,$L$7:$P$19,ROWS(H$12:H17)*2,0)","v":241.46},{"$f":"IF(ARG3_02!H17=\"\",\"\",IF(J17=\"f\",IF(H17=ARG3_02!H17,\"ü\",\"û\"),\"\"))","v":""},"f",null,{"$f":"PROPER(TEXT(DATE(YEAR(TODAY()),ROWS(L$8:L17),1),\"mmmm\"))","v":"Octubre"},{"v":497.7,"d":"497.70"},370.88,381.99,437.81,null,null,0.029468024419306738,"Oct",{"$f":"VLOOKUP(LARGE($S$8:$S$19,ROWS(U$8:U17)),$S$8:$T$19,2,0)","v":"Dic"}]
[null,{"$f":"\"\"","v":""},{"$f":"IF(_xlfn.ISFORMULA(ARG3_02!H17),_xlfn.FORMULATEXT(ARG3_02!H17),\"\")","v":""},{"$nulls":5},{"$f":"IF(ARG3_02!H18=\"\",\"\",IF(J18=\"f\",IF(H18=ARG3_02!H18,\"ü\",\"û\"),\"\"))","v":""},null,null,{"$f":"PROPER(TEXT(DATE(YEAR(TODAY()),ROWS(L$8:L18),1),\"mmmm\"))","v":"Noviembre"},241.46,{"v":528.9,"d":"528.90"},{"v":224.5,"d":"224.50"},433.41,null,null,0.5208228630775928,"Nov",{"$f":"VLOOKUP(LARGE($S$8:$S$19,ROWS(U$8:U18)),$S$8:$T$19,2,0)","v":"Set"}]
[null,{"$f":"\"\"","v":""},{"$f":"\"\"","v":""},{"$nulls":5},{"$f":"IF(ARG3_02!H19=\"\",\"\",IF(J19=\"f\",IF(H19=ARG3_02!H19,\"ü\",\"û\"),\"\"))","v":""},null,null,{"$f":"PROPER(TEXT(DATE(YEAR(TODAY()),ROWS(L$8:L19),1),\"mmmm\"))","v":"Diciembre"},{"v":485.8,"d":"485.80"},549.56,211.07,554.85,null,null,0.06036265530700324,"Dic",{"$f":"VLOOKUP(LARGE($S$8:$S$19,ROWS(U$8:U19)),$S$8:$T$19,2,0)","v":"Oct"}]
[null,{"$f":"\"\"","v":""},"Opción 1: BUSCARH",{"$nulls":5},{"$f":"IF(ARG3_02!H20=\"\",\"\",IF(J20=\"f\",IF(H20=ARG3_02!H20,\"ü\",\"û\"),\"\"))","v":""}]
[null,{"$f":"\"\"","v":""},{"$f":"C11","v":"Norte"},{"$nulls":5},{"$f":"IF(ARG3_02!H21=\"\",\"\",IF(J21=\"f\",IF(H21=ARG3_02!H21,\"ü\",\"û\"),\"\"))","v":""}]
[null,{"$f":"\"\"","v":""},{"$f":"U8","v":"Ene"},{"$nulls":4},{"$f":"HLOOKUP(C$21,$L$7:$P$19,MATCH(C22&\"*\",$L$7:$L$19,0),0)","v":287.59},{"$f":"IF(ARG3_02!H22=\"\",\"\",IF(J22=\"f\",IF(H22=ARG3_02!H22,\"ü\",\"û\"),\"\"))","v":""},"f"]
[null,{"$f":"\"\"","v":""},"Feb",{"$nulls":4},{"$f":"HLOOKUP(C$21,$L$7:$P$19,MATCH(C23&\"*\",$L$7:$L$19,0),0)","v":224.65},{"$f":"IF(ARG3_02!H23=\"\",\"\",IF(J23=\"f\",IF(H23=ARG3_02!H23,\"ü\",\"û\"),\"\"))","v":""},"f"]
[null,{"$f":"\"\"","v":""},"May",{"$nulls":4},383.05,{"$f":"IF(ARG3_02!H24=\"\",\"\",IF(J24=\"f\",IF(H24=ARG3_02!H24,\"ü\",\"û\"),\"\"))","v":""},"f"]
[null,{"$f":"\"\"","v":""},"Jul",{"$nulls":4},140.42,{"$f":"IF(ARG3_02!H25=\"\",\"\",IF(J25=\"f\",IF(H25=ARG3_02!H25,\"ü\",\"û\"),\"\"))","v":""},"f"]
[null,{"$f":"\"\"","v":""},"Nov",{"$nulls":4},241.46,{"$f":"IF(ARG3_02!H26=\"\",\"\",IF(J26=\"f\",IF(H26=ARG3_02!H26,\"ü\",\"û\"),\"\"))","v":""},"f"]
[null,{"$f":"\"\"","v":""},"Ago",{"$nulls":4},484.79,{"$f":"IF(ARG3_02!H27=\"\",\"\",IF(J27=\"f\",IF(H27=ARG3_02!H27,\"ü\",\"û\"),\"\"))","v":""},"f"]
[null,{"$f":"\"\"","v":""},{"$f":"IF(_xlfn.ISFORMULA(ARG3_02!H27),_xlfn.FORMULATEXT(ARG3_02!H27),\"\")","v":""},{"$nulls":5},{"$f":"IF(ARG3_02!H28=\"\",\"\",IF(J28=\"f\",IF(H28=ARG3_02!H28,\"ü\",\"û\"),\"\"))","v":""}]

{"sheet":"ARG3_02","index":23,"n_rows":28,"n_cols":15,"rows_kept":28,"hidden":true}
[null,"Argumento indicador de columna - fila"]
[null,"MOS Expert - CPC Martín Cruz - 998401784"]
[]
[]
[]
[null,{"$f":"lista03.06","v":""},"INDICADOR DE COLUMNA - INDICADOR DE FILA",{"$nulls":5},{"$f":"lista03.07","v":""}]
[null,"","",{"$nulls":5},""]
[null,"►","COLUMNA O FILA CALCULADA - CON CELDA DE APOYO CASO ESPECIAL (1)",{"$nulls":5},"",null,{"$f":"lista03.08","v":"Meses"},"Norte","Sur","Este","Oeste"]
[null,"","¿A cuánto asciende la venta de los meses indicados de la zona Norte?",{"$nulls":5},"",null,"Enero",287.59,{"v":498.3,"d":"498.30"},136.59,455.44]
[null,"","Ejercicio →",{"$nulls":5},"",null,"Febrero",224.65,208.58,423.87,182.99]
[null,"","Norte",{"$nulls":5},"",null,"Marzo",292.28,478.66,{"v":371.1,"d":"371.10"},466.37]
[null,"","Ene",{"$nulls":5},"",null,"Abril",304.83,279.09,491.11,551.13]
[null,"","Mar",{"$nulls":5},"",null,"Mayo",383.05,529.74,138.29,{"v":511.2,"d":"511.20"}]
[null,"","May",{"$nulls":5},"",null,"Junio",146.02,477.27,190.68,506.04]
[null,"","Jul",{"$nulls":5},"",null,"Julio",140.42,558.67,148.05,502.13]
[null,"","Set",{"$nulls":5},"",null,"Agosto",484.79,555.69,398.44,395.24]
[null,"","Nov",{"$nulls":5},"",null,"Setiembre",237.06,262.36,189.75,141.62]
[null,"","",{"$nulls":5},"",null,"Octubre",{"v":497.7,"d":"497.70"},370.88,381.99,437.81]
[null,"","",{"$nulls":5},"",null,"Noviembre",241.46,{"v":528.9,"d":"528.90"},{"v":224.5,"d":"224.50"},433.41]
[null,"","Opción 1: BUSCARH",{"$nulls":5},"",null,"Diciembre",{"v":485.8,"d":"485.80"},549.56,211.07,554.85]
[null,"","Norte",{"$nulls":5},""]
[null,"","Ene",{"$nulls":5},""]
[null,"","Feb",{"$nulls":5},""]
[null,"","May",{"$nulls":5},""]
[null,"","Jul",{"$nulls":5},""]
[null,"","Nov",{"$nulls":5},""]
[null,"","Ago",{"$nulls":5},""]
[null,"","",{"$nulls":5},""]

{"sheet":"DO_A3_03","index":24,"n_rows":18,"n_cols":21,"rows_kept":18,"hidden":true}
[]
[]
[]
[]
[]
[null,{"$f":"\"\"","v":""},"INDICADOR DE COLUMNA - INDICADOR DE FILA",{"$nulls":6},{"$f":"IF(ARG3_03!I6=\"\",\"\",IF(K6=\"f\",IF(I6=ARG3_03!I6,\"ü\",\"û\"),\"\"))","v":""},null,null,"Meses","Norte","Sur","Este","Oeste"]
[null,{"$f":"\"\"","v":""},{"$f":"\"\"","v":""},{"$nulls":6},{"$f":"IF(ARG3_03!I7=\"\",\"\",IF(K7=\"f\",IF(I7=ARG3_03!I7,\"ü\",\"û\"),\"\"))","v":""},null,null,{"$f":"PROPER(TEXT(DATE(YEAR(TODAY()),ROWS(M$7:M7),1),\"mmm\"))","v":"Ene"},{"$f":"ROUND(RANDBETWEEN(100,600)+RAND(),2)","v":313.15},{"v":176.5,"d":"176.50"},529.11,155.63,null,{"$f":"RAND()","v":0.030684327374528975},{"$f":"PROPER(TEXT(DATE(YEAR(TODAY()),ROWS(M$7:M7),1),\"mmmm\"))","v":"Enero"},{"$f":"VLOOKUP(LARGE($S$7:$S$18,ROWS(U$7:U7)),$S$7:$T$18,2,0)","v":"Octubre"}]
[null,"►","COLUMNA O FILA CALCULADA - CON CELDA DE APOYO CASO ESPECIAL (2)",{"$nulls":6},{"$f":"IF(ARG3_03!I8=\"\",\"\",IF(K8=\"f\",IF(I8=ARG3_03!I8,\"ü\",\"û\"),\"\"))","v":""},null,null,{"$f":"PROPER(TEXT(DATE(YEAR(TODAY()),ROWS(M$7:M8),1),\"mmm\"))","v":"Feb"},282.39,126.34,434.55,528.49,null,0.4029041709523725,{"$f":"PROPER(TEXT(DATE(YEAR(TODAY()),ROWS(M$7:M8),1),\"mmmm\"))","v":"Febrero"},{"$f":"VLOOKUP(LARGE($S$7:$S$18,ROWS(U$7:U8)),$S$7:$T$18,2,0)","v":"Abril"}]
[null,{"$f":"\"\"","v":""},{"$f":"\"¿A cuánto asciende la venta de los meses indicados de la zona \"&C11&\"?\"","v":"¿A cuánto asciende la venta de los meses indicados de la zona Norte?"},{"$nulls":6},{"$f":"IF(ARG3_03!I9=\"\",\"\",IF(K9=\"f\",IF(I9=ARG3_03!I9,\"ü\",\"û\"),\"\"))","v":""},null,null,{"$f":"PROPER(TEXT(DATE(YEAR(TODAY()),ROWS(M$7:M9),1),\"mmm\"))","v":"Mar"},533.03,170.76,295.75,243.29,null,0.07949539830494923,{"$f":"PROPER(TEXT(DATE(YEAR(TODAY()),ROWS(M$7:M9),1),\"mmmm\"))","v":"Marzo"},{"$f":"VLOOKUP(LARGE($S$7:$S$18,ROWS(U$7:U9)),$S$7:$T$18,2,0)","v":"Noviembre"}]
[null,{"$f":"\"\"","v":""},"Ejercicio →",{"$nulls":6},{"$f":"IF(ARG3_03!I10=\"\",\"\",IF(K10=\"f\",IF(I10=ARG3_03!I10,\"ü\",\"û\"),\"\"))","v":""},null,null,{"$f":"PROPER(TEXT(DATE(YEAR(TODAY()),ROWS(M$7:M10),1),\"mmm\"))","v":"Abr"},515.57,556.29,{"v":430.3,"d":"430.30"},{"v":518.9,"d":"518.90"},null,0.7527351947509203,{"$f":"PROPER(TEXT(DATE(YEAR(TODAY()),ROWS(M$7:M10),1),\"mmmm\"))","v":"Abril"},{"$f":"VLOOKUP(LARGE($S$7:$S$18,ROWS(U$7:U10)),$S$7:$T$18,2,0)","v":"Diciembre"}]
[null,{"$f":"\"\"","v":""},{"$f":"INDEX($N$6:$Q$6,RANDBETWEEN(1,4))","v":"Norte"},{"$f":"TEXT(DATE(YEAR(TODAY()),(COLUMNS($D$11:D$11)-1)*2+1,1),\"mmmm\")","v":"Enero"},{"$f":"TEXT(DATE(YEAR(TODAY()),(COLUMNS($D$11:E$11)-1)*2+1,1),\"mmmm\")","v":"Marzo"},{"$f":"TEXT(DATE(YEAR(TODAY()),(COLUMNS($D$11:F$11)-1)*2+1,1),\"mmmm\")","v":"Mayo"},{"$f":"TEXT(DATE(YEAR(TODAY()),(COLUMNS($D$11:G$11)-1)*2+1,1),\"mmmm\")","v":"Julio"},{"$f":"TEXT(DATE(YEAR(TODAY()),(COLUMNS($D$11:H$11)-1)*2+1,1),\"mmmm\")","v":"Setiembre"},{"$f":"TEXT(DATE(YEAR(TODAY()),(COLUMNS($D$11:I$11)-1)*2+1,1),\"mmmm\")","v":"Noviembre"},{"$f":"IF(ARG3_03!I11=\"\",\"\",IF(K11=\"f\",IF(I11=ARG3_03!I11,\"ü\",\"û\"),\"\"))","v":""},null,null,{"$f":"PROPER(TEXT(DATE(YEAR(TODAY()),ROWS(M$7:M11),1),\"mmm\"))","v":"May"},152.35,111.26,425.44,564.07,null,0.40351845274853204,{"$f":"PROPER(TEXT(DATE(YEAR(TODAY()),ROWS(M$7:M11),1),\"mmmm\"))","v":"Mayo"},{"$f":"VLOOKUP(LARGE($S$7:$S$18,ROWS(U$7:U11)),$S$7:$T$18,2,0)","v":"Julio"}]
[null,{"$f":"\"\"","v":""},{"$f":"\"\"","v":""},{"$f":"HLOOKUP($C$11,$M$6:$Q$18,COLUMNS($D12:D12)*2,0)","v":313.15},{"$f":"HLOOKUP($C$11,$M$6:$Q$18,COLUMNS($D12:E12)*2,0)","v":533.03},{"$f":"HLOOKUP($C$11,$M$6:$Q$18,COLUMNS($D12:F12)*2,0)","v":152.35},{"$f":"HLOOKUP($C$11,$M$6:$Q$18,COLUMNS($D12:G12)*2,0)","v":511.98},{"$f":"HLOOKUP($C$11,$M$6:$Q$18,COLUMNS($D12:H12)*2,0)","v":501.46},{"$f":"HLOOKUP($C$11,$M$6:$Q$18,COLUMNS($D12:I12)*2,0)","v":457.25},{"$f":"IF(ARG3_03!I12=\"\",\"\",IF(K12=\"f\",IF(I12=ARG3_03!I12,\"ü\",\"û\"),\"\"))","v":""},"f",null,{"$f":"PROPER(TEXT(DATE(YEAR(TODAY()),ROWS(M$7:M12),1),\"mmm\"))","v":"Jun"},460.88,451.84,433.78,370.97,null,0.3130088658052542,{"$f":"PROPER(TEXT(DATE(YEAR(TODAY()),ROWS(M$7:M12),1),\"mmmm\"))","v":"Junio"},{"$f":"VLOOKUP(LARGE($S$7:$S$18,ROWS(U$7:U12)),$S$7:$T$18,2,0)","v":"Mayo"}]
[null,{"$f":"\"\"","v":""},{"$f":"IF(_xlfn.ISFORMULA(ARG3_03!I12),_xlfn.FORMULATEXT(ARG3_03!I12),\"\")","v":""},{"$nulls":6},{"$f":"IF(ARG3_03!I13=\"\",\"\",IF(K13=\"f\",IF(I13=ARG3_03!I13,\"ü\",\"û\"),\"\"))","v":""},null,null,{"$f":"PROPER(TEXT(DATE(YEAR(TODAY()),ROWS(M$7:M13),1),\"mmm\"))","v":"Jul"},511.98,177.83,513.68,471.61,null,0.5043062241029219,{"$f":"PROPER(TEXT(DATE(YEAR(TODAY()),ROWS(M$7:M13),1),\"mmmm\"))","v":"Julio"},{"$f":"VLOOKUP(LARGE($S$7:$S$18,ROWS(U$7:U13)),$S$7:$T$18,2,0)","v":"Febrero"}]
[null,{"$f":"\"\"","v":""},{"$f":"\"\"","v":""},{"$nulls":6},{"$f":"IF(ARG3_03!I14=\"\",\"\",IF(K14=\"f\",IF(I14=ARG3_03!I14,\"ü\",\"û\"),\"\"))","v":""},null,null,{"$f":"PROPER(TEXT(DATE(YEAR(TODAY()),ROWS(M$7:M14),1),\"mmm\"))","v":"Ago"},464.95,179.83,299.14,346.06,null,0.23571658527687167,{"$f":"PROPER(TEXT(DATE(YEAR(TODAY()),ROWS(M$7:M14),1),\"mmmm\"))","v":"Agosto"},{"$f":"VLOOKUP(LARGE($S$7:$S$18,ROWS(U$7:U14)),$S$7:$T$18,2,0)","v":"Junio"}]
[null,{"$f":"\"\"","v":""},"Opción 1: BUSCARH",{"$nulls":6},{"$f":"IF(ARG3_03!I15=\"\",\"\",IF(K15=\"f\",IF(I15=ARG3_03!I15,\"ü\",\"û\"),\"\"))","v":""},null,null,{"$f":"PROPER(TEXT(DATE(YEAR(TODAY()),ROWS(M$7:M15),1),\"mmm\"))","v":"Set"},501.46,562.83,143.54,504.69,null,0.3079939810829514,{"$f":"PROPER(TEXT(DATE(YEAR(TODAY()),ROWS(M$7:M15),1),\"mmmm\"))","v":"Setiembre"},{"$f":"VLOOKUP(LARGE($S$7:$S$18,ROWS(U$7:U15)),$S$7:$T$18,2,0)","v":"Setiembre"}]
[null,{"$f":"\"\"","v":""},{"$f":"C11","v":"Norte"},{"$f":"TRANSPOSE(lista03.09)","v":"Octubre"},"Abril","Noviembre","Diciembre","Julio","Mayo",{"$f":"IF(ARG3_03!I16=\"\",\"\",IF(K16=\"f\",IF(I16=ARG3_03!I16,\"ü\",\"û\"),\"\"))","v":""},null,null,{"$f":"PROPER(TEXT(DATE(YEAR(TODAY()),ROWS(M$7:M16),1),\"mmm\"))","v":"Oct"},481.51,573.38,205.11,459.58,null,0.910853336013113,{"$f":"PROPER(TEXT(DATE(YEAR(TODAY()),ROWS(M$7:M16),1),\"mmmm\"))","v":"Octubre"},{"$f":"VLOOKUP(LARGE($S$7:$S$18,ROWS(U$7:U16)),$S$7:$T$18,2,0)","v":"Agosto"}]
[null,{"$f":"\"\"","v":""},{"$f":"\"\"","v":""},{"$f":"HLOOKUP($C16,$M$6:$Q$18,MATCH(LEFT(D16,3),$M$6:$M$18,0),0)","v":481.51},515.57,457.25,427.66,511.98,152.35,{"$f":"IF(ARG3_03!I17=\"\",\"\",IF(K17=\"f\",IF(I17=ARG3_03!I17,\"ü\",\"û\"),\"\"))","v":""},"f",null,{"$f":"PROPER(TEXT(DATE(YEAR(TODAY()),ROWS(M$7:M17),1),\"mmm\"))","v":"Nov"},457.25,581.02,576.13,210.72,null,0.6007781301016619,{"$f":"PROPER(TEXT(DATE(YEAR(TODAY()),ROWS(M$7:M17),1),\"mmmm\"))","v":"Noviembre"},{"$f":"VLOOKUP(LARGE($S$7:$S$18,ROWS(U$7:U17)),$S$7:$T$18,2,0)","v":"Marzo"}]
[null,{"$f":"\"\"","v":""},{"$f":"IF(_xlfn.ISFORMULA(ARG3_03!I17),_xlfn.FORMULATEXT(ARG3_03!I17),\"\")","v":""},{"$nulls":6},{"$f":"IF(ARG3_03!I18=\"\",\"\",IF(K18=\"f\",IF(I18=ARG3_03!I18,\"ü\",\"û\"),\"\"))","v":""},null,null,{"$f":"PROPER(TEXT(DATE(YEAR(TODAY()),ROWS(M$7:M18),1),\"mmm\"))","v":"Dic"},427.66,368.94,273.82,270.41,null,0.5740012461669342,{"$f":"PROPER(TEXT(DATE(YEAR(TODAY()),ROWS(M$7:M18),1),\"mmmm\"))","v":"Diciembre"},{"$f":"VLOOKUP(LARGE($S$7:$S$18,ROWS(U$7:U18)),$S$7:$T$18,2,0)","v":"Enero"}]

{"sheet":"ARG3_03","index":25,"n_rows":20,"n_cols":16,"rows_kept":20,"hidden":true}
[null,"Argumento indicador de columna - fila"]
[null,"MOS Expert - CPC Martín Cruz - 998401784"]
[]
[]
[]
[null,{"$f":"lista03.10","v":""},"INDICADOR DE COLUMNA - INDICADOR DE FILA",{"$nulls":6},{"$f":"lista03.13","v":""}]
[null,"","",{"$nulls":6},""]
[null,"►","COLUMNA O FILA CALCULADA - CON CELDA DE APOYO CASO ESPECIAL (2)",{"$nulls":6},"",null,"Meses","Norte","Sur","Este","Oeste"]
[null,"","¿A cuánto asciende la venta de los meses indicados de la zona Norte?",{"$nulls":6},"",null,{"$f":"PROPER(TEXT(DATE(YEAR(TODAY()),ROWS(L$9:L9),1),\"mmm\"))","v":"Ene"},{"$f":"ROUND(RANDBETWEEN(100,600)+RAND(),2)","v":260.75},225.72,263.49,529.33]
[null,"","Ejercicio →",{"$nulls":6},"",null,{"$f":"PROPER(TEXT(DATE(YEAR(TODAY()),ROWS(L$9:L10),1),\"mmm\"))","v":"Feb"},547.02,525.37,507.33,551.82]
[null,"","Norte",{"$f":"lista03.11","v":"Enero"},"Marzo","Mayo","Julio","Setiembre","Noviembre","",null,{"$f":"PROPER(TEXT(DATE(YEAR(TODAY()),ROWS(L$9:L11),1),\"mmm\"))","v":"Mar"},472.71,225.96,478.55,{"v":340.7,"d":"340.70"}]
[null,"","",{"$nulls":6},"",null,{"$f":"PROPER(TEXT(DATE(YEAR(TODAY()),ROWS(L$9:L12),1),\"mmm\"))","v":"Abr"},517.65,210.01,385.85,127.87]
[null,"","",{"$nulls":6},"",null,{"$f":"PROPER(TEXT(DATE(YEAR(TODAY()),ROWS(L$9:L13),1),\"mmm\"))","v":"May"},481.91,564.08,197.72,326.66]
[null,"","",{"$nulls":6},"",null,{"$f":"PROPER(TEXT(DATE(YEAR(TODAY()),ROWS(L$9:L14),1),\"mmm\"))","v":"Jun"},290.52,508.09,411.07,516.14]
[null,"","Opción 1: BUSCARH",{"$nulls":6},"",null,{"$f":"PROPER(TEXT(DATE(YEAR(TODAY()),ROWS(L$9:L15),1),\"mmm\"))","v":"Jul"},371.22,131.89,522.03,219.58]
[null,"","Norte",{"$f":"lista03.12","v":"Octubre"},"Abril","Noviembre","Diciembre","Julio","Mayo","",null,{"$f":"PROPER(TEXT(DATE(YEAR(TODAY()),ROWS(L$9:L16),1),\"mmm\"))","v":"Ago"},{"v":493.1,"d":"493.10"},183.54,118.68,175.85]
[null,"","",{"$nulls":6},"",null,{"$f":"PROPER(TEXT(DATE(YEAR(TODAY()),ROWS(L$9:L17),1),\"mmm\"))","v":"Set"},236.06,209.52,381.81,172.45]
[null,"","",{"$nulls":6},"",null,{"$f":"PROPER(TEXT(DATE(YEAR(TODAY()),ROWS(L$9:L18),1),\"mmm\"))","v":"Oct"},298.98,180.51,510.79,301.17]
[{"$nulls":11},{"$f":"PROPER(TEXT(DATE(YEAR(TODAY()),ROWS(L$9:L19),1),\"mmm\"))","v":"Nov"},221.23,538.34,483.55,570.78]
[{"$nulls":11},{"$f":"PROPER(TEXT(DATE(YEAR(TODAY()),ROWS(L$9:L20),1),\"mmm\"))","v":"Dic"},167.98,487.81,{"v":288.8,"d":"288.80"},535.25]

{"sheet":"DO_A2_01","index":26,"n_rows":37,"n_cols":13,"rows_kept":37,"hidden":true}
[]
[]
[]
[]
[]
[null,{"$f":"\"\"","v":""},"MATRIZ BUSCAR EN",{"$nulls":4},{"$f":"IF(ARG2_01!G6=\"\",\"\",IF(I6=\"f\",IF(G6=ARG2_01!G6,\"ü\",\"û\"),\"\"))","v":""}]
[null,{"$f":"\"\"","v":""},{"$f":"\"\"","v":""},{"$nulls":4},{"$f":"IF(ARG2_01!G7=\"\",\"\",IF(I7=\"f\",IF(G7=ARG2_01!G7,\"ü\",\"û\"),\"\"))","v":""},null,null,"Meses","Norte","Sur"]
[null,"►","MATRIZ SIN CELDAS DE APOYO",{"$nulls":4},{"$f":"IF(ARG2_01!G8=\"\",\"\",IF(I8=\"f\",IF(G8=ARG2_01!G8,\"ü\",\"û\"),\"\"))","v":""},null,null,"Enero",490,230]
[null,{"$f":"\"\"","v":""},{"$f":"\"¿A cuánto asciende la venta del mes de mayo de la zona Sur?\"","v":"¿A cuánto asciende la venta del mes de mayo de la zona Sur?"},{"$nulls":4},{"$f":"IF(ARG2_01!G9=\"\",\"\",IF(I9=\"f\",IF(G9=ARG2_01!G9,\"ü\",\"û\"),\"\"))","v":""},null,null,"Febrero",226,564]
[null,{"$f":"\"\"","v":""},"Opción 1: BUSCARV",{"$nulls":3},{"$f":"VLOOKUP(\"mayo\",\n{\"Meses\",\"Norte\",\"Sur\";\"Enero\",490,230;\"Febrero\",226,564;\"Marzo\",175,598;\"Abril\",152,487;\"Mayo\",228,513;\"Junio\",526,407;\"Julio\",183,338;\"Agosto\",540,105;\"Setiembre\",112,140;\"Octubre\",288,507;\"Noviembre\",462,161;\"Diciembre\",142,122},3,0)","v":513},{"$f":"IF(ARG2_01!G10=\"\",\"\",IF(I10=\"f\",IF(G10=ARG2_01!G10,\"ü\",\"û\"),\"\"))","v":""},"f",null,"Marzo",175,598]
[null,{"$f":"\"\"","v":""},{"$f":"IF(_xlfn.ISFORMULA(ARG2_01!$G$10),MID(_xlfn.FORMULATEXT(ARG2_01!$G$10),1+60*(ROWS(C$11:C11)-1),60),\"\")","v":""},{"$nulls":4},{"$f":"IF(ARG2_01!G11=\"\",\"\",IF(I11=\"f\",IF(G11=ARG2_01!G11,\"ü\",\"û\"),\"\"))","v":""},null,null,"Abril",152,487]
[null,{"$f":"\"\"","v":""},{"$f":"IF(_xlfn.ISFORMULA(ARG2_01!$G$10),MID(_xlfn.FORMULATEXT(ARG2_01!$G$10),1+60*(ROWS(C$11:C12)-1),60),\"\")","v":""},{"$nulls":4},{"$f":"IF(ARG2_01!G12=\"\",\"\",IF(I12=\"f\",IF(G12=ARG2_01!G12,\"ü\",\"û\"),\"\"))","v":""},null,null,"Mayo",228,513]
[null,{"$f":"\"\"","v":""},{"$f":"IF(_xlfn.ISFORMULA(ARG2_01!$G$10),MID(_xlfn.FORMULATEXT(ARG2_01!$G$10),1+60*(ROWS(C$11:C13)-1),60),\"\")","v":""},{"$nulls":4},{"$f":"IF(ARG2_01!G13=\"\",\"\",IF(I13=\"f\",IF(G13=ARG2_01!G13,\"ü\",\"û\"),\"\"))","v":""},null,null,"Junio",526,407]
[null,{"$f":"\"\"","v":""},{"$f":"IF(_xlfn.ISFORMULA(ARG2_01!$G$10),MID(_xlfn.FORMULATEXT(ARG2_01!$G$10),1+60*(ROWS(C$11:C14)-1),60),\"\")","v":""},{"$nulls":4},{"$f":"IF(ARG2_01!G14=\"\",\"\",IF(I14=\"f\",IF(G14=ARG2_01!G14,\"ü\",\"û\"),\"\"))","v":""},null,null,"Julio",183,338]
[null,{"$f":"\"\"","v":""},{"$f":"IF(_xlfn.ISFORMULA(ARG2_01!$G$10),MID(_xlfn.FORMULATEXT(ARG2_01!$G$10),1+60*(ROWS(C$11:C15)-1),60),\"\")","v":""},{"$nulls":4},{"$f":"IF(ARG2_01!G15=\"\",\"\",IF(I15=\"f\",IF(G15=ARG2_01!G15,\"ü\",\"û\"),\"\"))","v":""},null,null,"Agosto",540,105]
[null,{"$f":"\"\"","v":""},{"$f":"\"\"","v":""},{"$nulls":4},{"$f":"IF(ARG2_01!G16=\"\",\"\",IF(I16=\"f\",IF(G16=ARG2_01!G16,\"ü\",\"û\"),\"\"))","v":""},null,null,"Setiembre",112,140]
[null,{"$f":"\"\"","v":""},{"$f":"IF(_xlfn.ISFORMULA(ARG2_01!G10),\"Ahora para Norte, evalúa que nro de columna será.\",\"\")","v":""},{"$nulls":4},{"$f":"IF(ARG2_01!G17=\"\",\"\",IF(I17=\"f\",IF(G17=ARG2_01!G17,\"ü\",\"û\"),\"\"))","v":""},null,null,"Octubre",288,507]
[null,{"$f":"\"\"","v":""},"Ejercicio →",{"$nulls":3},{"$f":"VLOOKUP(\"mayo\",\n{\"Meses\",\"Norte\",\"Sur\";\"Enero\",490,230;\"Febrero\",226,564;\"Marzo\",175,598;\"Abril\",152,487;\"Mayo\",228,513;\"Junio\",526,407;\"Julio\",183,338;\"Agosto\",540,105;\"Setiembre\",112,140;\"Octubre\",288,507;\"Noviembre\",462,161;\"Diciembre\",142,122},2,0)","v":228},{"$f":"IF(ARG2_01!G18=\"\",\"\",IF(I18=\"f\",IF(G18=ARG2_01!G18,\"ü\",\"û\"),\"\"))","v":""},"f",null,"Noviembre",462,161]
[null,{"$f":"\"\"","v":""},{"$f":"IF(_xlfn.ISFORMULA(ARG2_01!$G$18),MID(_xlfn.FORMULATEXT(ARG2_01!$G$18),1+60*(ROWS(C$19:C19)-1),60),\"\")","v":""},{"$nulls":4},{"$f":"IF(ARG2_01!G19=\"\",\"\",IF(I19=\"f\",IF(G19=ARG2_01!G19,\"ü\",\"û\"),\"\"))","v":""},null,null,"Diciembre",142,122]
[null,{"$f":"\"\"","v":""},{"$f":"IF(_xlfn.ISFORMULA(ARG2_01!$G$18),MID(_xlfn.FORMULATEXT(ARG2_01!$G$18),1+60*(ROWS(C$19:C20)-1),60),\"\")","v":""},{"$nulls":4},{"$f":"IF(ARG2_01!G20=\"\",\"\",IF(I20=\"f\",IF(G20=ARG2_01!G20,\"ü\",\"û\"),\"\"))","v":""}]
[null,{"$f":"\"\"","v":""},{"$f":"IF(_xlfn.ISFORMULA(ARG2_01!$G$18),MID(_xlfn.FORMULATEXT(ARG2_01!$G$18),1+60*(ROWS(C$19:C21)-1),60),\"\")","v":""},{"$nulls":4},{"$f":"IF(ARG2_01!G21=\"\",\"\",IF(I21=\"f\",IF(G21=ARG2_01!G21,\"ü\",\"û\"),\"\"))","v":""}]
[null,{"$f":"\"\"","v":""},{"$f":"IF(_xlfn.ISFORMULA(ARG2_01!$G$18),MID(_xlfn.FORMULATEXT(ARG2_01!$G$18),1+60*(ROWS(C$19:C22)-1),60),\"\")","v":""},{"$nulls":4},{"$f":"IF(ARG2_01!G22=\"\",\"\",IF(I22=\"f\",IF(G22=ARG2_01!G22,\"ü\",\"û\"),\"\"))","v":""}]
[null,{"$f":"\"\"","v":""},{"$f":"IF(_xlfn.ISFORMULA(ARG2_01!$G$18),MID(_xlfn.FORMULATEXT(ARG2_01!$G$18),1+60*(ROWS(C$19:C23)-1),60),\"\")","v":""},{"$nulls":4},{"$f":"IF(ARG2_01!G23=\"\",\"\",IF(I23=\"f\",IF(G23=ARG2_01!G23,\"ü\",\"û\"),\"\"))","v":""}]
[null,{"$f":"\"\"","v":""},{"$f":"\"\"","v":""},{"$nulls":4},{"$f":"IF(ARG2_01!G24=\"\",\"\",IF(I24=\"f\",IF(G24=ARG2_01!G24,\"ü\",\"û\"),\"\"))","v":""}]
[null,{"$f":"\"\"","v":""},"Opción 2: BUSCARH",{"$nulls":3},{"$f":"HLOOKUP(\"sur\",\n{\"Meses\",\"Norte\",\"Sur\";\"Enero\",490,230;\"Febrero\",226,564;\"Marzo\",175,598;\"Abril\",152,487;\"Mayo\",228,513;\"Junio\",526,407;\"Julio\",183,338;\"Agosto\",540,105;\"Setiembre\",112,140;\"Octubre\",288,507;\"Noviembre\",462,161;\"Diciembre\",142,122},6,0)","v":513},{"$f":"IF(ARG2_01!G25=\"\",\"\",IF(I25=\"f\",IF(G25=ARG2_01!G25,\"ü\",\"û\"),\"\"))","v":""},"f"]
[null,{"$f":"\"\"","v":""},{"$f":"IF(_xlfn.ISFORMULA(ARG2_01!$G$25),MID(_xlfn.FORMULATEXT(ARG2_01!$G$25),1+60*(ROWS(C$26:C26)-1),60),\"\")","v":""},{"$nulls":4},{"$f":"IF(ARG2_01!G26=\"\",\"\",IF(I26=\"f\",IF(G26=ARG2_01!G26,\"ü\",\"û\"),\"\"))","v":""}]
[null,{"$f":"\"\"","v":""},{"$f":"IF(_xlfn.ISFORMULA(ARG2_01!$G$25),MID(_xlfn.FORMULATEXT(ARG2_01!$G$25),1+60*(ROWS(C$26:C27)-1),60),\"\")","v":""},{"$nulls":4},{"$f":"IF(ARG2_01!G27=\"\",\"\",IF(I27=\"f\",IF(G27=ARG2_01!G27,\"ü\",\"û\"),\"\"))","v":""}]
[null,{"$f":"\"\"","v":""},{"$f":"IF(_xlfn.ISFORMULA(ARG2_01!$G$25),MID(_xlfn.FORMULATEXT(ARG2_01!$G$25),1+60*(ROWS(C$26:C28)-1),60),\"\")","v":""},{"$nulls":4},{"$f":"IF(ARG2_01!G28=\"\",\"\",IF(I28=\"f\",IF(G28=ARG2_01!G28,\"ü\",\"û\"),\"\"))","v":""}]
[null,{"$f":"\"\"","v":""},{"$f":"IF(_xlfn.ISFORMULA(ARG2_01!$G$25),MID(_xlfn.FORMULATEXT(ARG2_01!$G$25),1+60*(ROWS(C$26:C29)-1),60),\"\")","v":""},{"$nulls":4},{"$f":"IF(ARG2_01!G29=\"\",\"\",IF(I29=\"f\",IF(G29=ARG2_01!G29,\"ü\",\"û\"),\"\"))","v":""}]
[null,{"$f":"\"\"","v":""},{"$f":"IF(_xlfn.ISFORMULA(ARG2_01!$G$25),MID(_xlfn.FORMULATEXT(ARG2_01!$G$25),1+60*(ROWS(C$26:C30)-1),60),\"\")","v":""},{"$nulls":4},{"$f":"IF(ARG2_01!G30=\"\",\"\",IF(I30=\"f\",IF(G30=ARG2_01!G30,\"ü\",\"û\"),\"\"))","v":""}]
[null,{"$f":"\"\"","v":""},{"$f":"\"\"","v":""},{"$f":"IF(_xlfn.ISFORMULA(D27),\"Ahora para Octubre, evalúa que nro de fila será\",\"\")","v":""},{"$nulls":3},{"$f":"IF(ARG2_01!G31=\"\",\"\",IF(I31=\"f\",IF(G31=ARG2_01!G31,\"ü\",\"û\"),\"\"))","v":""}]
[null,{"$f":"\"\"","v":""},"Ejercicio →",{"$nulls":3},{"$f":"HLOOKUP(\"norte\",\n{\"Meses\",\"Norte\",\"Sur\";\"Enero\",490,230;\"Febrero\",226,564;\"Marzo\",175,598;\"Abril\",152,487;\"Mayo\",228,513;\"Junio\",526,407;\"Julio\",183,338;\"Agosto\",540,105;\"Setiembre\",112,140;\"Octubre\",288,507;\"Noviembre\",462,161;\"Diciembre\",142,122},11,0)","v":288},{"$f":"IF(ARG2_01!G32=\"\",\"\",IF(I32=\"f\",IF(G32=ARG2_01!G32,\"ü\",\"û\"),\"\"))","v":""},"f"]
[null,{"$f":"\"\"","v":""},{"$f":"IF(_xlfn.ISFORMULA(ARG2_01!$G$32),MID(_xlfn.FORMULATEXT(ARG2_01!$G$32),1+60*(ROWS(C$33:C33)-1),60),\"\")","v":""},{"$nulls":4},{"$f":"IF(ARG2_01!G33=\"\",\"\",IF(I33=\"f\",IF(G33=ARG2_01!G33,\"ü\",\"û\"),\"\"))","v":""}]
[null,{"$f":"\"\"","v":""},{"$f":"IF(_xlfn.ISFORMULA(ARG2_01!$G$32),MID(_xlfn.FORMULATEXT(ARG2_01!$G$32),1+60*(ROWS(C$33:C34)-1),60),\"\")","v":""},{"$nulls":4},{"$f":"IF(ARG2_01!G34=\"\",\"\",IF(I34=\"f\",IF(G34=ARG2_01!G34,\"ü\",\"û\"),\"\"))","v":""}]
[null,{"$f":"\"\"","v":""},{"$f":"IF(_xlfn.ISFORMULA(ARG2_01!$G$32),MID(_xlfn.FORMULATEXT(ARG2_01!$G$32),1+60*(ROWS(C$33:C35)-1),60),\"\")","v":""},{"$nulls":4},{"$f":"IF(ARG2_01!G35=\"\",\"\",IF(I35=\"f\",IF(G35=ARG2_01!G35,\"ü\",\"û\"),\"\"))","v":""}]
[null,{"$f":"\"\"","v":""},{"$f":"IF(_xlfn.ISFORMULA(ARG2_01!$G$32),MID(_xlfn.FORMULATEXT(ARG2_01!$G$32),1+60*(ROWS(C$33:C36)-1),60),\"\")","v":""},{"$nulls":4},{"$f":"IF(ARG2_01!G36=\"\",\"\",IF(I36=\"f\",IF(G36=ARG2_01!G36,\"ü\",\"û\"),\"\"))","v":""}]
[null,{"$f":"\"\"","v":""},{"$f":"IF(_xlfn.ISFORMULA(ARG2_01!$G$32),MID(_xlfn.FORMULATEXT(ARG2_01!$G$32),1+60*(ROWS(C$33:C37)-1),60),\"\")","v":""},{"$nulls":4},{"$f":"IF(ARG2_01!G37=\"\",\"\",IF(I37=\"f\",IF(G37=ARG2_01!G37,\"ü\",\"û\"),\"\"))","v":""}]

{"sheet":"ARG2_01","index":27,"n_rows":37,"n_cols":12,"rows_kept":37,"hidden":true}
[null,"Argumento matriz buscar en"]
[null,"MOS Expert - CPC Martín Cruz - 998401784"]
[]
[]
[]
[null,{"$f":"lista02.01","v":""},"MATRIZ BUSCAR EN",{"$nulls":4},{"$f":"lista02.02","v":""}]
[null,"","",{"$nulls":4},""]
[null,"►","MATRIZ SIN CELDAS DE APOYO",{"$nulls":4},"",null,"Meses","Norte","Sur"]
[null,"","¿A cuánto asciende la venta del mes de mayo de la zona Sur?",{"$nulls":4},"",null,"Enero",490,230]
[null,"","Opción 1: BUSCARV",{"$nulls":4},"",null,"Febrero",226,564]
[null,"","",{"$nulls":4},"",null,"Marzo",175,598]
[null,"","",{"$nulls":4},"",null,"Abril",152,487]
[null,"","",{"$nulls":4},"",null,"Mayo",228,513]
[null,"","",{"$nulls":4},"",null,"Junio",526,407]
[null,"","",{"$nulls":4},"",null,"Julio",183,338]
[null,"","",{"$nulls":4},"",null,"Agosto",540,105]
[null,"","",{"$nulls":4},"",null,"Setiembre",112,140]
[null,"","Ejercicio →",{"$nulls":4},"",null,"Octubre",288,507]
[null,"","",{"$nulls":4},"",null,"Noviembre",462,161]
[null,"","",{"$nulls":4},"",null,"Diciembre",142,122]
[null,"","",{"$nulls":4},""]
[null,"","",{"$nulls":4},""]
[null,"","",{"$nulls":4},""]
[null,"","",{"$nulls":4},""]
[null,"","Opción 2: BUSCARH",{"$nulls":4},""]
[null,"","",{"$nulls":4},""]
[null,"","",{"$nulls":4},""]
[null,"","",{"$nulls":4},""]
[null,"","",{"$nulls":4},""]
[null,"","",{"$nulls":4},""]
[null,"","",{"$f":"IF(_xlfn.ISFORMULA(D27),\"Ahora para Octubre, evalúa que nro de fila será\",\"\")","v":""},{"$nulls":3},""]
[null,"","Ejercicio →",{"$nulls":4},""]
[null,"","",{"$nulls":4},""]
[null,"","",{"$nulls":4},""]
[null,"","",{"$nulls":4},""]
[null,"","",{"$nulls":4},""]
[null,"","",{"$nulls":4},""]

{"sheet":"DO_A2_02","index":28,"n_rows":22,"n_cols":22,"rows_kept":22,"hidden":true}
[]
[]
[]
[]
[]
[null,{"$f":"\"\"","v":""},{"$f":"\"\"","v":""},"MATRIZ BUSCAR EN",{"$nulls":4},{"$f":"IF(ARG2_02!H6=\"\",\"\",IF(J6=\"f\",IF(H6=ARG2_02!H6,\"ü\",\"û\"),\"\"))","v":""},null,null,"Carlos","Norte","Sur","Este","Oeste",null,"Patricia","Norte","Sur","Este","Oeste"]
[null,{"$f":"\"\"","v":""},{"$f":"\"\"","v":""},{"$f":"\"\"","v":""},{"$nulls":4},{"$f":"IF(ARG2_02!H7=\"\",\"\",IF(J7=\"f\",IF(H7=ARG2_02!H7,\"ü\",\"û\"),\"\"))","v":""},null,null,{"$f":"PROPER(TEXT(DATE(YEAR(TODAY()),ROWS(L$7:L7),1),\"mmmm\"))","v":"Enero"},{"$f":"ROUND(RANDBETWEEN(200,700)+RAND(),2)","v":{"v":397.7,"d":"397.70"}},238.83,244.92,{"v":622.7,"d":"622.70"},null,{"$f":"PROPER(TEXT(DATE(YEAR(TODAY()),ROWS(R$7:R7),1),\"mmmm\"))","v":"Enero"},{"$f":"ROUND(RANDBETWEEN(300,500)+RAND(),2)","v":474.37},372.56,479.08,353.15]
[null,"►",{"$f":"\"\"","v":""},"BUSCANDO EN DOS MATRICES",{"$nulls":4},{"$f":"IF(ARG2_02!H8=\"\",\"\",IF(J8=\"f\",IF(H8=ARG2_02!H8,\"ü\",\"û\"),\"\"))","v":""},null,null,{"$f":"PROPER(TEXT(DATE(YEAR(TODAY()),ROWS(L$7:L8),1),\"mmmm\"))","v":"Febrero"},566.26,275.37,253.21,522.66,null,{"$f":"PROPER(TEXT(DATE(YEAR(TODAY()),ROWS(R$7:R8),1),\"mmmm\"))","v":"Febrero"},{"v":356.2,"d":"356.20"},333.92,405.28,350.24]
[null,{"$f":"\"\"","v":""},{"$f":"\"\"","v":""},{"$f":"\"\"","v":""},{"$nulls":4},{"$f":"IF(ARG2_02!H9=\"\",\"\",IF(J9=\"f\",IF(H9=ARG2_02!H9,\"ü\",\"û\"),\"\"))","v":""},null,null,{"$f":"PROPER(TEXT(DATE(YEAR(TODAY()),ROWS(L$7:L9),1),\"mmmm\"))","v":"Marzo"},364.92,261.29,209.85,599.61,null,{"$f":"PROPER(TEXT(DATE(YEAR(TODAY()),ROWS(R$7:R9),1),\"mmmm\"))","v":"Marzo"},378.59,471.91,466.63,301.89]
[null,{"$f":"\"\"","v":""},{"$f":"\"\"","v":""},"Opción 1: BUSCARV",{"$nulls":4},{"$f":"IF(ARG2_02!H10=\"\",\"\",IF(J10=\"f\",IF(H10=ARG2_02!H10,\"ü\",\"û\"),\"\"))","v":""},null,null,{"$f":"PROPER(TEXT(DATE(YEAR(TODAY()),ROWS(L$7:L10),1),\"mmmm\"))","v":"Abril"},328.31,357.38,589.29,584.92,null,{"$f":"PROPER(TEXT(DATE(YEAR(TODAY()),ROWS(R$7:R10),1),\"mmmm\"))","v":"Abril"},426.36,433.43,399.73,478.79]
[null,{"$f":"\"\"","v":""},"Responsable",{"$f":"CHOOSE(RANDBETWEEN(1,2),\"Carlos\",\"Patricia\")","v":"Patricia"},{"$nulls":4},{"$f":"IF(ARG2_02!H11=\"\",\"\",IF(J11=\"f\",IF(H11=ARG2_02!H11,\"ü\",\"û\"),\"\"))","v":""},null,null,{"$f":"PROPER(TEXT(DATE(YEAR(TODAY()),ROWS(L$7:L11),1),\"mmmm\"))","v":"Mayo"},304.41,588.18,538.53,219.93,null,{"$f":"PROPER(TEXT(DATE(YEAR(TODAY()),ROWS(R$7:R11),1),\"mmmm\"))","v":"Mayo"},457.43,346.68,375.99,428.46]
[null,{"$f":"\"\"","v":""},"Zona",{"$f":"INDEX($M$6:$P$6,RANDBETWEEN(1,2)*2)","v":"Oeste"},{"$nulls":4},{"$f":"IF(ARG2_02!H12=\"\",\"\",IF(J12=\"f\",IF(H12=ARG2_02!H12,\"ü\",\"û\"),\"\"))","v":""},null,null,{"$f":"PROPER(TEXT(DATE(YEAR(TODAY()),ROWS(L$7:L12),1),\"mmmm\"))","v":"Junio"},418.46,548.87,500.33,304.73,null,{"$f":"PROPER(TEXT(DATE(YEAR(TODAY()),ROWS(R$7:R12),1),\"mmmm\"))","v":"Junio"},303.48,430.92,314.76,429.71]
[null,{"$f":"\"\"","v":""},"Mes",{"$f":"INDEX($L$7:$L$18,RANDBETWEEN(1,6)*2)","v":"Abril"},{"$nulls":3},{"$f":"VLOOKUP(D13,IF(D11=\"Carlos\",$L$6:$P$18,$R$6:$V$18),MATCH(D12,L$6:$P$6,0),0)","v":478.79},{"$f":"IF(ARG2_02!H13=\"\",\"\",IF(J13=\"f\",IF(H13=ARG2_02!H13,\"ü\",\"û\"),\"\"))","v":""},"f",null,{"$f":"PROPER(TEXT(DATE(YEAR(TODAY()),ROWS(L$7:L13),1),\"mmmm\"))","v":"Julio"},421.22,637.87,379.28,539.19,null,{"$f":"PROPER(TEXT(DATE(YEAR(TODAY()),ROWS(R$7:R13),1),\"mmmm\"))","v":"Julio"},323.74,408.47,370.22,361.11]
[null,{"$f":"\"\"","v":""},{"$f":"\"\"","v":""},{"$f":"IF(_xlfn.ISFORMULA(ARG2_02!H13),MID(_xlfn.FORMULATEXT(ARG2_02!H13),1,52),\"\")","v":""},{"$nulls":4},{"$f":"IF(ARG2_02!H14=\"\",\"\",IF(J14=\"f\",IF(H14=ARG2_02!H14,\"ü\",\"û\"),\"\"))","v":""},null,null,{"$f":"PROPER(TEXT(DATE(YEAR(TODAY()),ROWS(L$7:L14),1),\"mmmm\"))","v":"Agosto"},390.68,301.44,388.99,{"v":269.9,"d":"269.90"},null,{"$f":"PROPER(TEXT(DATE(YEAR(TODAY()),ROWS(R$7:R14),1),\"mmmm\"))","v":"Agosto"},443.33,374.15,376.23,397.21]
[null,{"$f":"\"\"","v":""},{"$f":"\"\"","v":""},{"$f":"IF(_xlfn.ISFORMULA(ARG2_02!H13),MID(_xlfn.FORMULATEXT(ARG2_02!H13),53,100),\"\")","v":""},{"$nulls":4},{"$f":"IF(ARG2_02!H15=\"\",\"\",IF(J15=\"f\",IF(H15=ARG2_02!H15,\"ü\",\"û\"),\"\"))","v":""},null,null,{"$f":"PROPER(TEXT(DATE(YEAR(TODAY()),ROWS(L$7:L15),1),\"mmmm\"))","v":"Setiembre"},495.49,{"v":432.1,"d":"432.10"},509.54,285.91,null,{"$f":"PROPER(TEXT(DATE(YEAR(TODAY()),ROWS(R$7:R15),1),\"mmmm\"))","v":"Setiembre"},{"v":439,"d":"439.00"},500.17,442.22,446.58]
[null,{"$f":"\"\"","v":""},{"$f":"\"\"","v":""},{"$f":"\"\"","v":""},{"$nulls":4},{"$f":"IF(ARG2_02!H16=\"\",\"\",IF(J16=\"f\",IF(H16=ARG2_02!H16,\"ü\",\"û\"),\"\"))","v":""},null,null,{"$f":"PROPER(TEXT(DATE(YEAR(TODAY()),ROWS(L$7:L16),1),\"mmmm\"))","v":"Octubre"},375.41,295.48,329.45,244.31,null,{"$f":"PROPER(TEXT(DATE(YEAR(TODAY()),ROWS(R$7:R16),1),\"mmmm\"))","v":"Octubre"},328.41,437.96,415.67,440.54]
[null,{"$f":"\"\"","v":""},{"$f":"\"\"","v":""},"Ejercicio →",{"$nulls":4},{"$f":"IF(ARG2_02!H17=\"\",\"\",IF(J17=\"f\",IF(H17=ARG2_02!H17,\"ü\",\"û\"),\"\"))","v":""},null,null,{"$f":"PROPER(TEXT(DATE(YEAR(TODAY()),ROWS(L$7:L17),1),\"mmmm\"))","v":"Noviembre"},695.15,616.67,626.75,520.13,null,{"$f":"PROPER(TEXT(DATE(YEAR(TODAY()),ROWS(R$7:R17),1),\"mmmm\"))","v":"Noviembre"},427.97,333.62,352.43,356.39]
[null,{"$f":"\"\"","v":""},"Responsable",{"$f":"CHOOSE(RANDBETWEEN(1,2),\"Carlos\",\"Patricia\")","v":"Carlos"},{"$nulls":4},{"$f":"IF(ARG2_02!H18=\"\",\"\",IF(J18=\"f\",IF(H18=ARG2_02!H18,\"ü\",\"û\"),\"\"))","v":""},null,null,{"$f":"PROPER(TEXT(DATE(YEAR(TODAY()),ROWS(L$7:L18),1),\"mmmm\"))","v":"Diciembre"},466.94,450.98,431.75,685.72,null,{"$f":"PROPER(TEXT(DATE(YEAR(TODAY()),ROWS(R$7:R18),1),\"mmmm\"))","v":"Diciembre"},358.24,358.62,432.97,{"v":409.1,"d":"409.10"}]
[null,{"$f":"\"\"","v":""},"Zona",{"$f":"INDEX($M$6:$P$6,RANDBETWEEN(1,2)*2-1)","v":"Norte"},{"$nulls":4},{"$f":"IF(ARG2_02!H19=\"\",\"\",IF(J19=\"f\",IF(H19=ARG2_02!H19,\"ü\",\"û\"),\"\"))","v":""}]
[null,{"$f":"\"\"","v":""},"Mes",{"$f":"INDEX($L$7:$L$18,RANDBETWEEN(1,6)*2-1)","v":"Enero"},{"$nulls":3},{"$f":"HLOOKUP(D19,IF(D18=\"Carlos\",$L$6:$P$18,$R$6:$V$18),MATCH(D20,L$6:$L$18,0),0)","v":{"v":397.7,"d":"397.70"}},{"$f":"IF(ARG2_02!H20=\"\",\"\",IF(J20=\"f\",IF(H20=ARG2_02!H20,\"ü\",\"û\"),\"\"))","v":""},"f"]
[null,{"$f":"\"\"","v":""},{"$f":"\"\"","v":""},{"$f":"IF(_xlfn.ISFORMULA(ARG2_02!H20),MID(_xlfn.FORMULATEXT(ARG2_02!H20),1,52),\"\")","v":""},{"$nulls":4},{"$f":"IF(ARG2_02!H21=\"\",\"\",IF(J21=\"f\",IF(H21=ARG2_02!H21,\"ü\",\"û\"),\"\"))","v":""}]
[null,{"$f":"\"\"","v":""},{"$f":"\"\"","v":""},{"$f":"IF(_xlfn.ISFORMULA(ARG2_02!H20),MID(_xlfn.FORMULATEXT(ARG2_02!H20),53,100),\"\")","v":""},{"$nulls":4},{"$f":"IF(ARG2_02!H22=\"\",\"\",IF(J22=\"f\",IF(H22=ARG2_02!H22,\"ü\",\"û\"),\"\"))","v":""}]

{"sheet":"ARG2_02","index":29,"n_rows":22,"n_cols":21,"rows_kept":22,"hidden":true}
[null,"Argumento matriz buscar en"]
[null,"MOS Expert - CPC Martín Cruz - 998401784"]
[]
[]
[]
[null,{"$f":"lista02.03","v":""},"","MATRIZ BUSCAR EN",{"$nulls":4},{"$f":"lista02.06","v":""}]
[null,"","","",{"$nulls":4},""]
[null,"►","","BUSCANDO EN DOS MATRICES",{"$nulls":4},"",null,{"$f":"lista02.04","v":"Carlos"},"Norte","Sur","Este","Oeste",null,{"$f":"lista02.05","v":"Patricia"},"Norte","Sur","Este","Oeste"]
[null,"","","",{"$nulls":4},"",null,"Enero",{"v":397.7,"d":"397.70"},238.83,244.92,{"v":622.7,"d":"622.70"},null,"Enero",474.37,372.56,479.08,353.15]
[null,"","","Opción 1: BUSCARV",{"$nulls":4},"",null,"Febrero",566.26,275.37,253.21,522.66,null,"Febrero",{"v":356.2,"d":"356.20"},333.92,405.28,350.24]
[null,"","Responsable","Patricia",{"$nulls":4},"",null,"Marzo",364.92,261.29,209.85,599.61,null,"Marzo",378.59,471.91,466.63,301.89]
[null,"","Zona","Oeste",{"$nulls":4},"",null,"Abril",328.31,357.38,589.29,584.92,null,"Abril",426.36,433.43,399.73,478.79]
[null,"","Mes","Abril",{"$nulls":4},"",null,"Mayo",304.41,588.18,538.53,219.93,null,"Mayo",457.43,346.68,375.99,428.46]
[null,"","","",{"$nulls":4},"",null,"Junio",418.46,548.87,500.33,304.73,null,"Junio",303.48,430.92,314.76,429.71]
[null,"","","",{"$nulls":4},"",null,"Julio",421.22,637.87,379.28,539.19,null,"Julio",323.74,408.47,370.22,361.11]
[null,"","","",{"$nulls":4},"",null,"Agosto",390.68,301.44,388.99,{"v":269.9,"d":"269.90"},null,"Agosto",443.33,374.15,376.23,397.21]
[null,"","","Ejercicio →",{"$nulls":4},"",null,"Setiembre",495.49,{"v":432.1,"d":"432.10"},509.54,285.91,null,"Setiembre",{"v":439,"d":"439.00"},500.17,442.22,446.58]
[null,"","Responsable","Carlos",{"$nulls":4},"",null,"Octubre",375.41,295.48,329.45,244.31,null,"Octubre",328.41,437.96,415.67,440.54]
[null,"","Zona","Norte",{"$nulls":4},"",null,"Noviembre",695.15,616.67,626.75,520.13,null,"Noviembre",427.97,333.62,352.43,356.39]
[null,"","Mes","Enero",{"$nulls":4},"",null,"Diciembre",466.94,450.98,431.75,685.72,null,"Diciembre",358.24,358.62,432.97,{"v":409.1,"d":"409.10"}]
[null,"","","",{"$nulls":4},""]
[null,"","","",{"$nulls":4},""]

{"sheet":"DO_A2_03","index":30,"n_rows":32,"n_cols":25,"rows_kept":32,"hidden":true}
[]
[]
[]
[]
[]
[null,{"$f":"\"\"","v":""},{"$f":"\"\"","v":""},"MATRIZ BUSCAR EN",{"$nulls":4},{"$f":"IF(ARG2_03!H6=\"\",\"\",IF(J6=\"f\",IF(H6=ARG2_03!H6,\"ü\",\"û\"),\"\"))","v":""},null,null,"Norte","Fideos","Harina","Aceite","Algodón",null,"Sur","Fideos","Harina","Aceite","Algodón"]
[null,{"$f":"\"\"","v":""},{"$f":"\"\"","v":""},{"$f":"\"\"","v":""},{"$nulls":4},{"$f":"IF(ARG2_03!H7=\"\",\"\",IF(J7=\"f\",IF(H7=ARG2_03!H7,\"ü\",\"û\"),\"\"))","v":""},null,null,{"$f":"PROPER(TEXT(DATE(YEAR(TODAY()),ROWS(L$7:L7),1),\"mmmm\"))","v":"Enero"},{"$f":"ROUND(RANDBETWEEN(200,700)+RAND(),2)","v":519.71},{"v":200.9,"d":"200.90"},206.91,675.36,null,{"$f":"PROPER(TEXT(DATE(YEAR(TODAY()),ROWS(R$7:R7),1),\"mmmm\"))","v":"Enero"},{"$f":"ROUND(RANDBETWEEN(300,900)+RAND(),2)","v":388.15},860.62,461.61,732.98,null,"Norte","lista02.07"]
[null,"►",{"$f":"\"\"","v":""},"BUSCANDO EN MAS DE DOS MATRICES",{"$nulls":4},{"$f":"IF(ARG2_03!H8=\"\",\"\",IF(J8=\"f\",IF(H8=ARG2_03!H8,\"ü\",\"û\"),\"\"))","v":""},null,null,{"$f":"PROPER(TEXT(DATE(YEAR(TODAY()),ROWS(L$7:L8),1),\"mmmm\"))","v":"Febrero"},210.36,210.05,274.27,569.36,null,{"$f":"PROPER(TEXT(DATE(YEAR(TODAY()),ROWS(R$7:R8),1),\"mmmm\"))","v":"Febrero"},744.16,659.99,872.65,{"v":395.6,"d":"395.60"},null,"Sur","lista02.08"]
[null,{"$f":"\"\"","v":""},{"$f":"\"\"","v":""},{"$f":"\"\"","v":""},{"$nulls":4},{"$f":"IF(ARG2_03!H9=\"\",\"\",IF(J9=\"f\",IF(H9=ARG2_03!H9,\"ü\",\"û\"),\"\"))","v":""},null,null,{"$f":"PROPER(TEXT(DATE(YEAR(TODAY()),ROWS(L$7:L9),1),\"mmmm\"))","v":"Marzo"},297.29,331.61,586.12,582.79,null,{"$f":"PROPER(TEXT(DATE(YEAR(TODAY()),ROWS(R$7:R9),1),\"mmmm\"))","v":"Marzo"},657.48,870.79,881.21,518.25,null,"Este","lista02.09"]
[null,{"$f":"\"\"","v":""},{"$f":"\"\"","v":""},"Opción 1: BUSCARH",{"$nulls":4},{"$f":"IF(ARG2_03!H10=\"\",\"\",IF(J10=\"f\",IF(H10=ARG2_03!H10,\"ü\",\"û\"),\"\"))","v":""},null,null,{"$f":"PROPER(TEXT(DATE(YEAR(TODAY()),ROWS(L$7:L10),1),\"mmmm\"))","v":"Abril"},592.36,632.02,249.01,275.21,null,{"$f":"PROPER(TEXT(DATE(YEAR(TODAY()),ROWS(R$7:R10),1),\"mmmm\"))","v":"Abril"},537.99,{"v":344.5,"d":"344.50"},648.45,364.89,null,"Oeste","lista02.10"]
[null,{"$f":"\"\"","v":""},"Zona",{"$f":"INDEX($X$7:$X$10,RANDBETWEEN(1,4))","v":"Este"},{"$nulls":4},{"$f":"IF(ARG2_03!H11=\"\",\"\",IF(J11=\"f\",IF(H11=ARG2_03!H11,\"ü\",\"û\"),\"\"))","v":""},null,null,{"$f":"PROPER(TEXT(DATE(YEAR(TODAY()),ROWS(L$7:L11),1),\"mmmm\"))","v":"Mayo"},295.14,487.86,523.46,266.05,null,{"$f":"PROPER(TEXT(DATE(YEAR(TODAY()),ROWS(R$7:R11),1),\"mmmm\"))","v":"Mayo"},405.04,763.82,830.19,857.19]
[null,{"$f":"\"\"","v":""},"Producto",{"$f":"INDEX($M$6:$P$6,RANDBETWEEN(1,2)*2)","v":"Algodón"},{"$nulls":4},{"$f":"IF(ARG2_03!H12=\"\",\"\",IF(J12=\"f\",IF(H12=ARG2_03!H12,\"ü\",\"û\"),\"\"))","v":""},null,null,{"$f":"PROPER(TEXT(DATE(YEAR(TODAY()),ROWS(L$7:L12),1),\"mmmm\"))","v":"Junio"},449.83,253.99,434.82,308.08,null,{"$f":"PROPER(TEXT(DATE(YEAR(TODAY()),ROWS(R$7:R12),1),\"mmmm\"))","v":"Junio"},547.45,497.18,844.93,534.41]
[null,{"$f":"\"\"","v":""},"Mes",{"$f":"INDEX($L$7:$L$18,RANDBETWEEN(1,6)*2)","v":"Diciembre"},{"$nulls":3},{"$f":"HLOOKUP(D12,INDIRECT(VLOOKUP(D11,$X$7:$Y$10,2,0)),\nMATCH(D13,$L$6:$L$18,0),0)","v":{"v":119.1,"d":"119.10"}},{"$f":"IF(ARG2_03!H13=\"\",\"\",IF(J13=\"f\",IF(H13=ARG2_03!H13,\"ü\",\"û\"),\"\"))","v":""},"f",null,{"$f":"PROPER(TEXT(DATE(YEAR(TODAY()),ROWS(L$7:L13),1),\"mmmm\"))","v":"Julio"},252.02,362.26,{"v":393.2,"d":"393.20"},614.89,null,{"$f":"PROPER(TEXT(DATE(YEAR(TODAY()),ROWS(R$7:R13),1),\"mmmm\"))","v":"Julio"},646.73,692.34,633.43,662.07]
[null,{"$f":"\"\"","v":""},{"$f":"\"\"","v":""},{"$f":"IF(_xlfn.ISFORMULA(ARG2_03!H13),_xlfn.FORMULATEXT(ARG2_03!H13),\"\")","v":""},{"$nulls":4},{"$f":"IF(ARG2_03!H14=\"\",\"\",IF(J14=\"f\",IF(H14=ARG2_03!H14,\"ü\",\"û\"),\"\"))","v":""},null,null,{"$f":"PROPER(TEXT(DATE(YEAR(TODAY()),ROWS(L$7:L14),1),\"mmmm\"))","v":"Agosto"},455.97,{"v":686.4,"d":"686.40"},562.11,240.96,null,{"$f":"PROPER(TEXT(DATE(YEAR(TODAY()),ROWS(R$7:R14),1),\"mmmm\"))","v":"Agosto"},845.02,628.87,674.83,599.53]
[null,{"$f":"\"\"","v":""},{"$f":"\"\"","v":""},{"$f":"\"\"","v":""},{"$nulls":4},{"$f":"IF(ARG2_03!H15=\"\",\"\",IF(J15=\"f\",IF(H15=ARG2_03!H15,\"ü\",\"û\"),\"\"))","v":""},null,null,{"$f":"PROPER(TEXT(DATE(YEAR(TODAY()),ROWS(L$7:L15),1),\"mmmm\"))","v":"Setiembre"},511.57,476.66,578.21,313.82,null,{"$f":"PROPER(TEXT(DATE(YEAR(TODAY()),ROWS(R$7:R15),1),\"mmmm\"))","v":"Setiembre"},321.38,766.69,854.96,642.57]
[null,{"$f":"\"\"","v":""},{"$f":"\"\"","v":""},"Ejercicio →",{"$nulls":4},{"$f":"IF(ARG2_03!H16=\"\",\"\",IF(J16=\"f\",IF(H16=ARG2_03!H16,\"ü\",\"û\"),\"\"))","v":""},null,null,{"$f":"PROPER(TEXT(DATE(YEAR(TODAY()),ROWS(L$7:L16),1),\"mmmm\"))","v":"Octubre"},450.13,626.75,531.29,{"v":254.5,"d":"254.50"},null,{"$f":"PROPER(TEXT(DATE(YEAR(TODAY()),ROWS(R$7:R16),1),\"mmmm\"))","v":"Octubre"},693.04,524.89,346.44,594.51]
[null,{"$f":"\"\"","v":""},"Zona",{"$f":"INDEX($X$7:$X$10,RANDBETWEEN(1,4))","v":"Este"},{"$nulls":4},{"$f":"IF(ARG2_03!H17=\"\",\"\",IF(J17=\"f\",IF(H17=ARG2_03!H17,\"ü\",\"û\"),\"\"))","v":""},null,null,{"$f":"PROPER(TEXT(DATE(YEAR(TODAY()),ROWS(L$7:L17),1),\"mmmm\"))","v":"Noviembre"},565.31,287.01,{"v":650.1,"d":"650.10"},533.35,null,{"$f":"PROPER(TEXT(DATE(YEAR(TODAY()),ROWS(R$7:R17),1),\"mmmm\"))","v":"Noviembre"},623.33,533.65,521.46,354.96]
[null,{"$f":"\"\"","v":""},"Producto",{"$f":"INDEX($M$6:$P$6,RANDBETWEEN(1,2)*2-1)","v":"Fideos"},{"$nulls":4},{"$f":"IF(ARG2_03!H18=\"\",\"\",IF(J18=\"f\",IF(H18=ARG2_03!H18,\"ü\",\"û\"),\"\"))","v":""},null,null,{"$f":"PROPER(TEXT(DATE(YEAR(TODAY()),ROWS(L$7:L18),1),\"mmmm\"))","v":"Diciembre"},603.89,441.86,644.28,431.22,null,{"$f":"PROPER(TEXT(DATE(YEAR(TODAY()),ROWS(R$7:R18),1),\"mmmm\"))","v":"Diciembre"},830.03,686.02,{"v":472.1,"d":"472.10"},333.18]
[null,{"$f":"\"\"","v":""},"Mes",{"$f":"INDEX($L$7:$L$18,RANDBETWEEN(1,6)*2-1)","v":"Noviembre"},{"$nulls":3},{"$f":"VLOOKUP(D19,INDIRECT(VLOOKUP(D17,$X$7:$Y$10,2,0)),\nMATCH(D18,$L$6:$P$6,0),0)","v":{"v":325.1,"d":"325.10"}},{"$f":"IF(ARG2_03!H19=\"\",\"\",IF(J19=\"f\",IF(H19=ARG2_03!H19,\"ü\",\"û\"),\"\"))","v":""},"f"]
[null,{"$f":"\"\"","v":""},{"$f":"\"\"","v":""},{"$f":"IF(_xlfn.ISFORMULA(ARG2_03!H19),_xlfn.FORMULATEXT(ARG2_03!H19),\"\")","v":""},{"$nulls":4},{"$f":"IF(ARG2_03!H20=\"\",\"\",IF(J20=\"f\",IF(H20=ARG2_03!H20,\"ü\",\"û\"),\"\"))","v":""},null,null,"Este","Fideos","Harina","Aceite","Algodón",null,"Oeste","Fideos","Harina","Aceite","Algodón"]
[{"$nulls":11},{"$f":"PROPER(TEXT(DATE(YEAR(TODAY()),ROWS(L$21:L21),1),\"mmmm\"))","v":"Enero"},{"$f":"ROUND(RANDBETWEEN(100,400)+RAND(),2)","v":374.48},274.66,141.61,347.86,null,{"$f":"PROPER(TEXT(DATE(YEAR(TODAY()),ROWS(R$21:R21),1),\"mmmm\"))","v":"Enero"},{"$f":"ROUND(RANDBETWEEN(500,998)+RAND(),2)","v":589.52},516.26,{"v":537.1,"d":"537.10"},770.88]
[{"$nulls":11},{"$f":"PROPER(TEXT(DATE(YEAR(TODAY()),ROWS(L$21:L22),1),\"mmmm\"))","v":"Febrero"},125.21,327.85,178.12,258.05,null,{"$f":"PROPER(TEXT(DATE(YEAR(TODAY()),ROWS(R$21:R22),1),\"mmmm\"))","v":"Febrero"},{"v":565.7,"d":"565.70"},525.63,771.06,513.75]
[{"$nulls":11},{"$f":"PROPER(TEXT(DATE(YEAR(TODAY()),ROWS(L$21:L23),1),\"mmmm\"))","v":"Marzo"},{"v":269.1,"d":"269.10"},360.33,166.23,114.67,null,{"$f":"PROPER(TEXT(DATE(YEAR(TODAY()),ROWS(R$21:R23),1),\"mmmm\"))","v":"Marzo"},869.62,719.73,889.31,910.86]
[{"$nulls":11},{"$f":"PROPER(TEXT(DATE(YEAR(TODAY()),ROWS(L$21:L24),1),\"mmmm\"))","v":"Abril"},111.87,350.77,{"v":238.8,"d":"238.80"},219.11,null,{"$f":"PROPER(TEXT(DATE(YEAR(TODAY()),ROWS(R$21:R24),1),\"mmmm\"))","v":"Abril"},683.73,571.03,851.18,801.84]
[{"$nulls":11},{"$f":"PROPER(TEXT(DATE(YEAR(TODAY()),ROWS(L$21:L25),1),\"mmmm\"))","v":"Mayo"},386.29,278.24,106.15,312.23,null,{"$f":"PROPER(TEXT(DATE(YEAR(TODAY()),ROWS(R$21:R25),1),\"mmmm\"))","v":"Mayo"},755.92,536.37,756.07,993.64]
[{"$nulls":11},{"$f":"PROPER(TEXT(DATE(YEAR(TODAY()),ROWS(L$21:L26),1),\"mmmm\"))","v":"Junio"},138.62,278.71,348.95,134.99,null,{"$f":"PROPER(TEXT(DATE(YEAR(TODAY()),ROWS(R$21:R26),1),\"mmmm\"))","v":"Junio"},947.28,{"v":674,"d":"674.00"},532.37,633.66]
[{"$nulls":11},{"$f":"PROPER(TEXT(DATE(YEAR(TODAY()),ROWS(L$21:L27),1),\"mmmm\"))","v":"Julio"},265.87,246.67,387.67,217.46,null,{"$f":"PROPER(TEXT(DATE(YEAR(TODAY()),ROWS(R$21:R27),1),\"mmmm\"))","v":"Julio"},687.63,553.73,764.03,616.08]
[{"$nulls":11},{"$f":"PROPER(TEXT(DATE(YEAR(TODAY()),ROWS(L$21:L28),1),\"mmmm\"))","v":"Agosto"},391.88,240.72,157.53,260.17,null,{"$f":"PROPER(TEXT(DATE(YEAR(TODAY()),ROWS(R$21:R28),1),\"mmmm\"))","v":"Agosto"},869.46,740.48,525.48,614.24]
[{"$nulls":11},{"$f":"PROPER(TEXT(DATE(YEAR(TODAY()),ROWS(L$21:L29),1),\"mmmm\"))","v":"Setiembre"},124.83,170.78,{"v":231,"d":"231.00"},{"v":259.9,"d":"259.90"},null,{"$f":"PROPER(TEXT(DATE(YEAR(TODAY()),ROWS(R$21:R29),1),\"mmmm\"))","v":"Setiembre"},929.98,596.11,896.75,886.63]
[{"$nulls":11},{"$f":"PROPER(TEXT(DATE(YEAR(TODAY()),ROWS(L$21:L30),1),\"mmmm\"))","v":"Octubre"},377.79,154.99,156.91,168.48,null,{"$f":"PROPER(TEXT(DATE(YEAR(TODAY()),ROWS(R$21:R30),1),\"mmmm\"))","v":"Octubre"},649.34,625.22,750.64,952.44]
[{"$nulls":11},{"$f":"PROPER(TEXT(DATE(YEAR(TODAY()),ROWS(L$21:L31),1),\"mmmm\"))","v":"Noviembre"},{"v":325.1,"d":"325.10"},119.15,178.35,{"v":233.5,"d":"233.50"},null,{"$f":"PROPER(TEXT(DATE(YEAR(TODAY()),ROWS(R$21:R31),1),\"mmmm\"))","v":"Noviembre"},968.66,504.76,922.23,753.95]
[{"$nulls":11},{"$f":"PROPER(TEXT(DATE(YEAR(TODAY()),ROWS(L$21:L32),1),\"mmmm\"))","v":"Diciembre"},328.58,241.89,318.92,{"v":119.1,"d":"119.10"},null,{"$f":"PROPER(TEXT(DATE(YEAR(TODAY()),ROWS(R$21:R32),1),\"mmmm\"))","v":"Diciembre"},922.84,762.06,683.12,647.95]

{"sheet":"ARG2_03","index":31,"n_rows":34,"n_cols":21,"rows_kept":34,"hidden":true}
[null,"Argumento matriz buscar en"]
[null,"MOS Expert - CPC Martín Cruz - 998401784"]
[]
[]
[]
[null,{"$f":"lista02.11","v":""},"","MATRIZ BUSCAR EN",{"$nulls":4},{"$f":"lista02.12","v":""}]
[null,"","","",{"$nulls":4},""]
[null,"►","","BUSCANDO EN MAS DE DOS MATRICES",{"$nulls":4},"",null,{"$f":"lista02.07","v":"Norte"},"Fideos","Harina","Aceite","Algodón",null,{"$f":"lista02.08","v":"Sur"},"Fideos","Harina","Aceite","Algodón"]
[null,"","","",{"$nulls":4},"",null,"Enero",519.71,{"v":200.9,"d":"200.90"},206.91,675.36,null,"Enero",388.15,860.62,461.61,732.98]
[null,"","","Opción 1: BUSCARH",{"$nulls":4},"",null,"Febrero",210.36,210.05,274.27,569.36,null,"Febrero",744.16,659.99,872.65,{"v":395.6,"d":"395.60"}]
[null,"","Zona","Este",{"$nulls":4},"",null,"Marzo",297.29,331.61,586.12,582.79,null,"Marzo",657.48,870.79,881.21,518.25]
[null,"","Producto","Algodón",{"$nulls":4},"",null,"Abril",592.36,632.02,249.01,275.21,null,"Abril",537.99,{"v":344.5,"d":"344.50"},648.45,364.89]
[null,"","Mes","Diciembre",{"$nulls":4},"",null,"Mayo",295.14,487.86,523.46,266.05,null,"Mayo",405.04,763.82,830.19,857.19]
[null,"","","",{"$nulls":4},"",null,"Junio",449.83,253.99,434.82,308.08,null,"Junio",547.45,497.18,844.93,534.41]
[null,"","","",{"$nulls":4},"",null,"Julio",252.02,362.26,{"v":393.2,"d":"393.20"},614.89,null,"Julio",646.73,692.34,633.43,662.07]
[null,"","","Ejercicio →",{"$nulls":4},"",null,"Agosto",455.97,{"v":686.4,"d":"686.40"},562.11,240.96,null,"Agosto",845.02,628.87,674.83,599.53]
[null,"","Zona","Este",{"$nulls":4},"",null,"Setiembre",511.57,476.66,578.21,313.82,null,"Setiembre",321.38,766.69,854.96,642.57]
[null,"","Producto","Fideos",{"$nulls":4},"",null,"Octubre",450.13,626.75,531.29,{"v":254.5,"d":"254.50"},null,"Octubre",693.04,524.89,346.44,594.51]
[null,"","Mes","Noviembre",{"$nulls":4},"",null,"Noviembre",565.31,287.01,{"v":650.1,"d":"650.10"},533.35,null,"Noviembre",623.33,533.65,521.46,354.96]
[null,"","","",{"$nulls":4},"",null,"Diciembre",603.89,441.86,644.28,431.22,null,"Diciembre",830.03,686.02,{"v":472.1,"d":"472.10"},333.18]
[]
[{"$nulls":10},{"$f":"lista02.09","v":"Este"},"Fideos","Harina","Aceite","Algodón",null,{"$f":"lista02.10","v":"Oeste"},"Fideos","Harina","Aceite","Algodón"]
[{"$nulls":10},"Enero",374.48,274.66,141.61,347.86,null,"Enero",589.52,516.26,{"v":537.1,"d":"537.10"},770.88]
[{"$nulls":10},"Febrero",125.21,327.85,178.12,258.05,null,"Febrero",{"v":565.7,"d":"565.70"},525.63,771.06,513.75]
[{"$nulls":10},"Marzo",{"v":269.1,"d":"269.10"},360.33,166.23,114.67,null,"Marzo",869.62,719.73,889.31,910.86]
[{"$nulls":10},"Abril",111.87,350.77,{"v":238.8,"d":"238.80"},219.11,null,"Abril",683.73,571.03,851.18,801.84]
[{"$nulls":10},"Mayo",386.29,278.24,106.15,312.23,null,"Mayo",755.92,536.37,756.07,993.64]
[{"$nulls":10},"Junio",138.62,278.71,348.95,134.99,null,"Junio",947.28,{"v":674,"d":"674.00"},532.37,633.66]
[{"$nulls":10},"Julio",265.87,246.67,387.67,217.46,null,"Julio",687.63,553.73,764.03,616.08]
[{"$nulls":10},"Agosto",391.88,240.72,157.53,260.17,null,"Agosto",869.46,740.48,525.48,614.24]
[{"$nulls":10},"Setiembre",124.83,170.78,{"v":231,"d":"231.00"},{"v":259.9,"d":"259.90"},null,"Setiembre",929.98,596.11,896.75,886.63]
[{"$nulls":10},"Octubre",377.79,154.99,156.91,168.48,null,"Octubre",649.34,625.22,750.64,952.44]
[{"$nulls":10},"Noviembre",{"v":325.1,"d":"325.10"},119.15,178.35,{"v":233.5,"d":"233.50"},null,"Noviembre",968.66,504.76,922.23,753.95]
[{"$nulls":10},"Diciembre",328.58,241.89,318.92,{"v":119.1,"d":"119.10"},null,"Diciembre",922.84,762.06,683.12,647.95]

{"sheet":"DO_A2_04","index":32,"n_rows":38,"n_cols":25,"rows_kept":38,"hidden":true}
[]
[]
[]
[]
[]
[null,{"$f":"\"\"","v":""},{"$f":"\"\"","v":""},"MATRIZ BUSCAR EN",{"$nulls":4},{"$f":"IF(ARG2_04!H6=\"\",\"\",IF(J6=\"f\",IF(H6=ARG2_04!H6,\"ü\",\"û\"),\"\"))","v":""},null,null,"Zona Norte","Fideos","Harina","Aceite","Algodón",null,"Zona Sur","Fideos","Harina","Aceite","Algodón"]
[null,{"$f":"\"\"","v":""},{"$f":"\"\"","v":""},{"$f":"\"\"","v":""},{"$nulls":4},{"$f":"IF(ARG2_04!H7=\"\",\"\",IF(J7=\"f\",IF(H7=ARG2_04!H7,\"ü\",\"û\"),\"\"))","v":""},null,null,{"$f":"PROPER(TEXT(DATE(YEAR(TODAY()),ROWS(L$7:L7),1),\"mmmm\"))","v":"Enero"},{"$f":"ROUND(RANDBETWEEN(200,700)+RAND(),2)","v":215.03},280.34,313.28,246.64,null,{"$f":"PROPER(TEXT(DATE(YEAR(TODAY()),ROWS(R$7:R7),1),\"mmmm\"))","v":"Enero"},{"$f":"ROUND(RANDBETWEEN(300,900)+RAND(),2)","v":{"v":888.9,"d":"888.90"}},534.33,591.25,323.72,null,"Norte","lista02.14"]
[null,"►",{"$f":"\"\"","v":""},"BUSCANDO EN MAS DE DOS MATRICES - CORRECCION MANUALES",{"$nulls":4},{"$f":"IF(ARG2_04!H8=\"\",\"\",IF(J8=\"f\",IF(H8=ARG2_04!H8,\"ü\",\"û\"),\"\"))","v":""},null,null,{"$f":"PROPER(TEXT(DATE(YEAR(TODAY()),ROWS(L$7:L8),1),\"mmmm\"))","v":"Febrero"},526.12,637.49,444.43,313.47,null,{"$f":"PROPER(TEXT(DATE(YEAR(TODAY()),ROWS(R$7:R8),1),\"mmmm\"))","v":"Febrero"},761.67,738.66,863.83,621.58,null,"Sur","lista02.15"]
[null,{"$f":"\"\"","v":""},{"$f":"\"\"","v":""},{"$f":"\"\"","v":""},{"$nulls":4},{"$f":"IF(ARG2_04!H9=\"\",\"\",IF(J9=\"f\",IF(H9=ARG2_04!H9,\"ü\",\"û\"),\"\"))","v":""},null,null,{"$f":"PROPER(TEXT(DATE(YEAR(TODAY()),ROWS(L$7:L9),1),\"mmmm\"))","v":"Marzo"},515.25,605.65,307.88,407.44,null,{"$f":"PROPER(TEXT(DATE(YEAR(TODAY()),ROWS(R$7:R9),1),\"mmmm\"))","v":"Marzo"},382.85,838.66,536.38,764.61,null,"Este","lista02.16"]
[null,{"$f":"\"\"","v":""},{"$f":"\"\"","v":""},"Opción 1: BUSCARH",{"$nulls":4},{"$f":"IF(ARG2_04!H10=\"\",\"\",IF(J10=\"f\",IF(H10=ARG2_04!H10,\"ü\",\"û\"),\"\"))","v":""},null,null,{"$f":"PROPER(TEXT(DATE(YEAR(TODAY()),ROWS(L$7:L10),1),\"mmmm\"))","v":"Abril"},430.23,538.91,329.91,261.71,null,{"$f":"PROPER(TEXT(DATE(YEAR(TODAY()),ROWS(R$7:R10),1),\"mmmm\"))","v":"Abril"},852.41,612.02,790.53,{"v":316.8,"d":"316.80"},null,"Oeste","lista02.17"]
[null,{"$f":"\"\"","v":""},"Zona",{"$f":"INDEX($X$7:$X$10,RANDBETWEEN(1,2)*2)","v":"Sur"},{"$nulls":4},{"$f":"IF(ARG2_04!H11=\"\",\"\",IF(J11=\"f\",IF(H11=ARG2_04!H11,\"ü\",\"û\"),\"\"))","v":""},null,null,{"$f":"PROPER(TEXT(DATE(YEAR(TODAY()),ROWS(L$7:L11),1),\"mmmm\"))","v":"Mayo"},658.55,422.87,680.23,251.88,null,{"$f":"PROPER(TEXT(DATE(YEAR(TODAY()),ROWS(R$7:R11),1),\"mmmm\"))","v":"Mayo"},889.03,493.29,625.41,515.61]
[null,{"$f":"\"\"","v":""},"Producto",{"$f":"INDEX($M$6:$P$6,RANDBETWEEN(1,2)*2)","v":"Algodón"},{"$nulls":4},{"$f":"IF(ARG2_04!H12=\"\",\"\",IF(J12=\"f\",IF(H12=ARG2_04!H12,\"ü\",\"û\"),\"\"))","v":""},null,null,{"$f":"PROPER(TEXT(DATE(YEAR(TODAY()),ROWS(L$7:L12),1),\"mmmm\"))","v":"Junio"},280.55,472.07,479.95,{"v":291.1,"d":"291.10"},null,{"$f":"PROPER(TEXT(DATE(YEAR(TODAY()),ROWS(R$7:R12),1),\"mmmm\"))","v":"Junio"},361.01,431.03,382.64,763.44]
[null,{"$f":"\"\"","v":""},"Mes",{"$f":"INDEX($L$7:$L$18,RANDBETWEEN(1,6)*2)","v":"Octubre"},{"$nulls":3},{"$f":"HLOOKUP(D12,INDIRECT(VLOOKUP(D11,$X$7:$Y$10,2,0)),\nMATCH(D13,$L$6:$L$18,0),0)","v":334.05},{"$f":"IF(ARG2_04!H13=\"\",\"\",IF(J13=\"f\",IF(H13=ARG2_04!H13,\"ü\",\"û\"),\"\"))","v":""},"f",null,{"$f":"PROPER(TEXT(DATE(YEAR(TODAY()),ROWS(L$7:L13),1),\"mmmm\"))","v":"Julio"},515.06,290.01,669.68,346.51,null,{"$f":"PROPER(TEXT(DATE(YEAR(TODAY()),ROWS(R$7:R13),1),\"mmmm\"))","v":"Julio"},425.18,337.92,780.44,869.64]
[null,{"$f":"\"\"","v":""},{"$f":"\"\"","v":""},{"$f":"IF(_xlfn.ISFORMULA(ARG2_04!H13),MID(_xlfn.FORMULATEXT(ARG2_04!H13),1,36),\"\")","v":""},{"$nulls":4},{"$f":"IF(ARG2_04!H14=\"\",\"\",IF(J14=\"f\",IF(H14=ARG2_04!H14,\"ü\",\"û\"),\"\"))","v":""},null,null,{"$f":"PROPER(TEXT(DATE(YEAR(TODAY()),ROWS(L$7:L14),1),\"mmmm\"))","v":"Agosto"},294.39,447.83,463.72,444.94,null,{"$f":"PROPER(TEXT(DATE(YEAR(TODAY()),ROWS(R$7:R14),1),\"mmmm\"))","v":"Agosto"},737.81,470.12,353.78,442.81]
[null,{"$f":"\"\"","v":""},{"$f":"\"\"","v":""},{"$f":"IF(_xlfn.ISFORMULA(ARG2_04!H13),MID(_xlfn.FORMULATEXT(ARG2_04!H13),37,60),\"\")","v":""},{"$nulls":4},{"$f":"IF(ARG2_04!H15=\"\",\"\",IF(J15=\"f\",IF(H15=ARG2_04!H15,\"ü\",\"û\"),\"\"))","v":""},null,null,{"$f":"PROPER(TEXT(DATE(YEAR(TODAY()),ROWS(L$7:L15),1),\"mmmm\"))","v":"Setiembre"},230.15,245.92,{"v":365.6,"d":"365.60"},582.22,null,{"$f":"PROPER(TEXT(DATE(YEAR(TODAY()),ROWS(R$7:R15),1),\"mmmm\"))","v":"Setiembre"},758.51,565.05,670.99,698.15]
[null,{"$f":"\"\"","v":""},{"$f":"\"\"","v":""},{"$f":"\"\"","v":""},{"$nulls":4},{"$f":"IF(ARG2_04!H16=\"\",\"\",IF(J16=\"f\",IF(H16=ARG2_04!H16,\"ü\",\"û\"),\"\"))","v":""},null,null,{"$f":"PROPER(TEXT(DATE(YEAR(TODAY()),ROWS(L$7:L16),1),\"mmmm\"))","v":"Octubre"},589.42,241.16,335.47,554.44,null,{"$f":"PROPER(TEXT(DATE(YEAR(TODAY()),ROWS(R$7:R16),1),\"mmmm\"))","v":"Octubre"},436.24,534.36,654.81,334.05]
[null,{"$f":"\"\"","v":""},{"$f":"\"\"","v":""},"Ejercicio →",{"$nulls":4},{"$f":"IF(ARG2_04!H17=\"\",\"\",IF(J17=\"f\",IF(H17=ARG2_04!H17,\"ü\",\"û\"),\"\"))","v":""},null,null,{"$f":"PROPER(TEXT(DATE(YEAR(TODAY()),ROWS(L$7:L17),1),\"mmmm\"))","v":"Noviembre"},399.21,404.54,445.36,670.87,null,{"$f":"PROPER(TEXT(DATE(YEAR(TODAY()),ROWS(R$7:R17),1),\"mmmm\"))","v":"Noviembre"},546.74,562.52,365.05,630.18]
[null,{"$f":"\"\"","v":""},"Zona",{"$f":"INDEX($X$7:$X$10,RANDBETWEEN(1,2)*2-1)","v":"Este"},{"$nulls":4},{"$f":"IF(ARG2_04!H18=\"\",\"\",IF(J18=\"f\",IF(H18=ARG2_04!H18,\"ü\",\"û\"),\"\"))","v":""},null,null,{"$f":"PROPER(TEXT(DATE(YEAR(TODAY()),ROWS(L$7:L18),1),\"mmmm\"))","v":"Diciembre"},544.06,244.06,221.08,473.89,null,{"$f":"PROPER(TEXT(DATE(YEAR(TODAY()),ROWS(R$7:R18),1),\"mmmm\"))","v":"Diciembre"},653.15,773.57,{"v":305.7,"d":"305.70"},715.82]
[null,{"$f":"\"\"","v":""},"Producto",{"$f":"INDEX($M$6:$P$6,RANDBETWEEN(1,2)*2-1)","v":"Aceite"},{"$nulls":4},{"$f":"IF(ARG2_04!H19=\"\",\"\",IF(J19=\"f\",IF(H19=ARG2_04!H19,\"ü\",\"û\"),\"\"))","v":""}]
[null,{"$f":"\"\"","v":""},"Mes",{"$f":"INDEX($L$7:$L$18,RANDBETWEEN(1,6)*2-1)","v":"Enero"},{"$nulls":3},{"$f":"VLOOKUP(D20,INDIRECT(VLOOKUP(D18,$X$7:$Y$10,2,0)),\nMATCH(D19,$L$6:$P$6,0),0)","v":{"v":378.2,"d":"378.20"}},{"$f":"IF(ARG2_04!H20=\"\",\"\",IF(J20=\"f\",IF(H20=ARG2_04!H20,\"ü\",\"û\"),\"\"))","v":""},"f",null,"Zona Este","Fideos","Harina","Aceite","Algodón",null,"Zona Oeste","Fideos","Harina","Aceite","Algodón"]
[null,{"$f":"\"\"","v":""},{"$f":"\"\"","v":""},{"$f":"IF(_xlfn.ISFORMULA(ARG2_04!H20),MID(_xlfn.FORMULATEXT(ARG2_04!H20),1,36),\"\")","v":""},{"$nulls":4},{"$f":"IF(ARG2_04!H21=\"\",\"\",IF(J21=\"f\",IF(H21=ARG2_04!H21,\"ü\",\"û\"),\"\"))","v":""},null,null,{"$f":"PROPER(TEXT(DATE(YEAR(TODAY()),ROWS(L$21:L21),1),\"mmmm\"))","v":"Enero"},{"$f":"ROUND(RANDBETWEEN(100,400)+RAND(),2)","v":255.49},104.26,{"v":378.2,"d":"378.20"},159.06,null,{"$f":"PROPER(TEXT(DATE(YEAR(TODAY()),ROWS(R$21:R21),1),\"mmmm\"))","v":"Enero"},{"$f":"ROUND(RANDBETWEEN(500,998)+RAND(),2)","v":882.77},548.92,{"v":581.7,"d":"581.70"},947.39]
[null,{"$f":"\"\"","v":""},{"$f":"\"\"","v":""},{"$f":"IF(_xlfn.ISFORMULA(ARG2_04!H20),MID(_xlfn.FORMULATEXT(ARG2_04!H20),37,60),\"\")","v":""},{"$nulls":4},{"$f":"IF(ARG2_04!H22=\"\",\"\",IF(J22=\"f\",IF(H22=ARG2_04!H22,\"ü\",\"û\"),\"\"))","v":""},null,null,{"$f":"PROPER(TEXT(DATE(YEAR(TODAY()),ROWS(L$21:L22),1),\"mmmm\"))","v":"Febrero"},260.27,258.59,338.75,385.31,null,{"$f":"PROPER(TEXT(DATE(YEAR(TODAY()),ROWS(R$21:R22),1),\"mmmm\"))","v":"Febrero"},828.03,{"v":900.4,"d":"900.40"},971.87,718.16]
[null,{"$f":"\"\"","v":""},{"$f":"\"\"","v":""},{"$f":"\"\"","v":""},{"$nulls":4},{"$f":"IF(ARG2_04!H23=\"\",\"\",IF(J23=\"f\",IF(H23=ARG2_04!H23,\"ü\",\"û\"),\"\"))","v":""},null,null,{"$f":"PROPER(TEXT(DATE(YEAR(TODAY()),ROWS(L$21:L23),1),\"mmmm\"))","v":"Marzo"},{"v":139.2,"d":"139.20"},297.41,{"v":394.1,"d":"394.10"},{"v":398.2,"d":"398.20"},null,{"$f":"PROPER(TEXT(DATE(YEAR(TODAY()),ROWS(R$21:R23),1),\"mmmm\"))","v":"Marzo"},599.99,698.05,995.96,518.04]
[null,"►",{"$f":"\"\"","v":""},"BUSCANDO EN MAS DE DOS MATRICES - CORRECCION FORMULADA",{"$nulls":4},{"$f":"IF(ARG2_04!H24=\"\",\"\",IF(J24=\"f\",IF(H24=ARG2_04!H24,\"ü\",\"û\"),\"\"))","v":""},null,null,{"$f":"PROPER(TEXT(DATE(YEAR(TODAY()),ROWS(L$21:L24),1),\"mmmm\"))","v":"Abril"},343.31,347.05,{"v":346.8,"d":"346.80"},{"v":301.7,"d":"301.70"},null,{"$f":"PROPER(TEXT(DATE(YEAR(TODAY()),ROWS(R$21:R24),1),\"mmmm\"))","v":"Abril"},711.89,669.74,543.41,717.81]
[null,{"$f":"\"\"","v":""},{"$f":"\"\"","v":""},{"$f":"\"\"","v":""},{"$nulls":4},{"$f":"IF(ARG2_04!H25=\"\",\"\",IF(J25=\"f\",IF(H25=ARG2_04!H25,\"ü\",\"û\"),\"\"))","v":""},null,null,{"$f":"PROPER(TEXT(DATE(YEAR(TODAY()),ROWS(L$21:L25),1),\"mmmm\"))","v":"Mayo"},286.16,127.88,289.03,213.21,null,{"$f":"PROPER(TEXT(DATE(YEAR(TODAY()),ROWS(R$21:R25),1),\"mmmm\"))","v":"Mayo"},803.75,607.49,588.66,900.85]
[null,{"$f":"\"\"","v":""},{"$f":"\"\"","v":""},"Opción 1: BUSCARH",{"$nulls":4},{"$f":"IF(ARG2_04!H26=\"\",\"\",IF(J26=\"f\",IF(H26=ARG2_04!H26,\"ü\",\"û\"),\"\"))","v":""},null,null,{"$f":"PROPER(TEXT(DATE(YEAR(TODAY()),ROWS(L$21:L26),1),\"mmmm\"))","v":"Junio"},178.05,290.29,300.79,201.39,null,{"$f":"PROPER(TEXT(DATE(YEAR(TODAY()),ROWS(R$21:R26),1),\"mmmm\"))","v":"Junio"},{"v":993.1,"d":"993.10"},547.75,690.49,{"v":941.3,"d":"941.30"}]
[null,{"$f":"\"\"","v":""},"Zona",{"$f":"\"Zona \"&INDEX($X$7:$X$10,RANDBETWEEN(1,2)*2)","v":"Zona Sur"},{"$nulls":4},{"$f":"IF(ARG2_04!H27=\"\",\"\",IF(J27=\"f\",IF(H27=ARG2_04!H27,\"ü\",\"û\"),\"\"))","v":""},null,null,{"$f":"PROPER(TEXT(DATE(YEAR(TODAY()),ROWS(L$21:L27),1),\"mmmm\"))","v":"Julio"},219.25,{"v":138.7,"d":"138.70"},157.42,206.84,null,{"$f":"PROPER(TEXT(DATE(YEAR(TODAY()),ROWS(R$21:R27),1),\"mmmm\"))","v":"Julio"},779.28,954.61,601.98,{"v":678.7,"d":"678.70"}]
[null,{"$f":"\"\"","v":""},"Producto",{"$f":"INDEX($M$6:$P$6,RANDBETWEEN(1,2)*2)","v":"Harina"},{"$nulls":4},{"$f":"IF(ARG2_04!H28=\"\",\"\",IF(J28=\"f\",IF(H28=ARG2_04!H28,\"ü\",\"û\"),\"\"))","v":""},null,null,{"$f":"PROPER(TEXT(DATE(YEAR(TODAY()),ROWS(L$21:L28),1),\"mmmm\"))","v":"Agosto"},165.68,132.45,212.86,378.47,null,{"$f":"PROPER(TEXT(DATE(YEAR(TODAY()),ROWS(R$21:R28),1),\"mmmm\"))","v":"Agosto"},982.43,682.06,512.31,765.71]
[null,{"$f":"\"\"","v":""},"Mes",{"$f":"INDEX($L$7:$L$18,RANDBETWEEN(1,6)*2)","v":"Abril"},{"$nulls":3},{"$f":"HLOOKUP(D28,INDIRECT(VLOOKUP(MID(D27,6,10),$X$7:$Y$10,2,0)),\nMATCH(D29,$L$6:$L$18,0),0)","v":612.02},{"$f":"IF(ARG2_04!H29=\"\",\"\",IF(J29=\"f\",IF(H29=ARG2_04!H29,\"ü\",\"û\"),\"\"))","v":""},"f",null,{"$f":"PROPER(TEXT(DATE(YEAR(TODAY()),ROWS(L$21:L29),1),\"mmmm\"))","v":"Setiembre"},396.34,297.83,183.66,296.41,null,{"$f":"PROPER(TEXT(DATE(YEAR(TODAY()),ROWS(R$21:R29),1),\"mmmm\"))","v":"Setiembre"},909.62,827.64,811.44,513.54]
[null,{"$f":"\"\"","v":""},{"$f":"\"\"","v":""},{"$f":"IF(_xlfn.ISFORMULA(ARG2_04!H29),MID(_xlfn.FORMULATEXT(ARG2_04!H29),1,48),\"\")","v":""},{"$nulls":4},{"$f":"IF(ARG2_04!H30=\"\",\"\",IF(J30=\"f\",IF(H30=ARG2_04!H30,\"ü\",\"û\"),\"\"))","v":""},null,null,{"$f":"PROPER(TEXT(DATE(YEAR(TODAY()),ROWS(L$21:L30),1),\"mmmm\"))","v":"Octubre"},370.03,387.44,385.66,370.22,null,{"$f":"PROPER(TEXT(DATE(YEAR(TODAY()),ROWS(R$21:R30),1),\"mmmm\"))","v":"Octubre"},601.02,873.28,639.76,561.53]
[null,{"$f":"\"\"","v":""},{"$f":"\"\"","v":""},{"$f":"IF(_xlfn.ISFORMULA(ARG2_04!H29),MID(_xlfn.FORMULATEXT(ARG2_04!H29),48+1,60),\"\")","v":""},{"$nulls":4},{"$f":"IF(ARG2_04!H31=\"\",\"\",IF(J31=\"f\",IF(H31=ARG2_04!H31,\"ü\",\"û\"),\"\"))","v":""},null,null,{"$f":"PROPER(TEXT(DATE(YEAR(TODAY()),ROWS(L$21:L31),1),\"mmmm\"))","v":"Noviembre"},159.75,172.82,320.43,250.82,null,{"$f":"PROPER(TEXT(DATE(YEAR(TODAY()),ROWS(R$21:R31),1),\"mmmm\"))","v":"Noviembre"},588.36,655.77,700.69,969.99]
[null,{"$f":"\"\"","v":""},{"$f":"\"\"","v":""},{"$f":"\"\"","v":""},{"$nulls":4},{"$f":"IF(ARG2_04!H32=\"\",\"\",IF(J32=\"f\",IF(H32=ARG2_04!H32,\"ü\",\"û\"),\"\"))","v":""},null,null,{"$f":"PROPER(TEXT(DATE(YEAR(TODAY()),ROWS(L$21:L32),1),\"mmmm\"))","v":"Diciembre"},328.57,176.63,365.48,373.25,null,{"$f":"PROPER(TEXT(DATE(YEAR(TODAY()),ROWS(R$21:R32),1),\"mmmm\"))","v":"Diciembre"},904.75,599.15,640.71,910.63]
[null,{"$f":"\"\"","v":""},{"$f":"\"\"","v":""},"Ejercicio →",{"$nulls":4},{"$f":"IF(ARG2_04!H33=\"\",\"\",IF(J33=\"f\",IF(H33=ARG2_04!H33,\"ü\",\"û\"),\"\"))","v":""}]
[null,{"$f":"\"\"","v":""},"Zona",{"$f":"\"Zona \"&INDEX($X$7:$X$10,RANDBETWEEN(1,2)*2-1)","v":"Zona Este"},{"$nulls":4},{"$f":"IF(ARG2_04!H34=\"\",\"\",IF(J34=\"f\",IF(H34=ARG2_04!H34,\"ü\",\"û\"),\"\"))","v":""}]
[null,{"$f":"\"\"","v":""},"Producto",{"$f":"INDEX($M$6:$P$6,RANDBETWEEN(1,2)*2-1)","v":"Fideos"},{"$nulls":4},{"$f":"IF(ARG2_04!H35=\"\",\"\",IF(J35=\"f\",IF(H35=ARG2_04!H35,\"ü\",\"û\"),\"\"))","v":""}]
[null,{"$f":"\"\"","v":""},"Mes",{"$f":"INDEX($L$7:$L$18,RANDBETWEEN(1,6)*2-1)","v":"Setiembre"},{"$nulls":3},{"$f":"VLOOKUP(D36,INDIRECT(VLOOKUP(MID(D34,6,10),$X$7:$Y$10,2,0)),\nMATCH(D35,$L$6:$P$6,0),0)","v":396.34},{"$f":"IF(ARG2_04!H36=\"\",\"\",IF(J36=\"f\",IF(H36=ARG2_04!H36,\"ü\",\"û\"),\"\"))","v":""},"f"]
[null,{"$f":"\"\"","v":""},{"$f":"\"\"","v":""},{"$f":"IF(_xlfn.ISFORMULA(ARG2_04!H36),MID(_xlfn.FORMULATEXT(ARG2_04!H36),1,48),\"\")","v":""},{"$nulls":4},{"$f":"IF(ARG2_04!H37=\"\",\"\",IF(J37=\"f\",IF(H37=ARG2_04!H37,\"ü\",\"û\"),\"\"))","v":""}]
[null,{"$f":"\"\"","v":""},{"$f":"\"\"","v":""},{"$f":"IF(_xlfn.ISFORMULA(ARG2_04!H36),MID(_xlfn.FORMULATEXT(ARG2_04!H36),49,60),\"\")","v":""},{"$nulls":4},{"$f":"IF(ARG2_04!H38=\"\",\"\",IF(J38=\"f\",IF(H38=ARG2_04!H38,\"ü\",\"û\"),\"\"))","v":""}]

{"sheet":"ARG2_04","index":33,"n_rows":38,"n_cols":21,"rows_kept":38,"hidden":true}
[null,"Argumento matriz buscar en"]
[null,"MOS Expert - CPC Martín Cruz - 998401784"]
[]
[]
[]
[null,{"$f":"lista02.13","v":""},"","MATRIZ BUSCAR EN",{"$nulls":4},{"$f":"lista02.18","v":""}]
[null,"","","",{"$nulls":4},""]
[null,"►","","BUSCANDO EN MAS DE DOS MATRICES - CORRECCION MANUALES",{"$nulls":4},"",null,{"$f":"lista02.14","v":"Zona Norte"},"Fideos","Harina","Aceite","Algodón",null,{"$f":"lista02.15","v":"Zona Sur"},"Fideos","Harina","Aceite","Algodón"]
[null,"","","",{"$nulls":4},"",null,"Enero",215.03,280.34,313.28,246.64,null,"Enero",{"v":888.9,"d":"888.90"},534.33,591.25,323.72]
[null,"","","Opción 1: BUSCARH",{"$nulls":4},"",null,"Febrero",526.12,637.49,444.43,313.47,null,"Febrero",761.67,738.66,863.83,621.58]
[null,"","Zona","Sur",{"$nulls":4},"",null,"Marzo",515.25,605.65,307.88,407.44,null,"Marzo",382.85,838.66,536.38,764.61]
[null,"","Producto","Algodón",{"$nulls":4},"",null,"Abril",430.23,538.91,329.91,261.71,null,"Abril",852.41,612.02,790.53,{"v":316.8,"d":"316.80"}]
[null,"","Mes","Octubre",{"$nulls":4},"",null,"Mayo",658.55,422.87,680.23,251.88,null,"Mayo",889.03,493.29,625.41,515.61]
[null,"","","",{"$nulls":4},"",null,"Junio",280.55,472.07,479.95,{"v":291.1,"d":"291.10"},null,"Junio",361.01,431.03,382.64,763.44]
[null,"","","",{"$nulls":4},"",null,"Julio",515.06,290.01,669.68,346.51,null,"Julio",425.18,337.92,780.44,869.64]
[null,"","","",{"$nulls":4},"",null,"Agosto",294.39,447.83,463.72,444.94,null,"Agosto",737.81,470.12,353.78,442.81]
[null,"","","Ejercicio →",{"$nulls":4},"",null,"Setiembre",230.15,245.92,{"v":365.6,"d":"365.60"},582.22,null,"Setiembre",758.51,565.05,670.99,698.15]
[null,"","Zona","Este",{"$nulls":4},"",null,"Octubre",589.42,241.16,335.47,554.44,null,"Octubre",436.24,534.36,654.81,334.05]
[null,"","Producto","Aceite",{"$nulls":4},"",null,"Noviembre",399.21,404.54,445.36,670.87,null,"Noviembre",546.74,562.52,365.05,630.18]
[null,"","Mes","Enero",{"$nulls":4},"",null,"Diciembre",544.06,244.06,221.08,473.89,null,"Diciembre",653.15,773.57,{"v":305.7,"d":"305.70"},715.82]
[null,"","","",{"$nulls":4},""]
[null,"","","",{"$nulls":4},"",null,{"$f":"lista02.16","v":"Zona Este"},"Fideos","Harina","Aceite","Algodón",null,{"$f":"lista02.17","v":"Zona Oeste"},"Fideos","Harina","Aceite","Algodón"]
[null,"","","",{"$nulls":4},"",null,"Enero",255.49,104.26,{"v":378.2,"d":"378.20"},159.06,null,"Enero",882.77,548.92,{"v":581.7,"d":"581.70"},947.39]
[null,"►","","BUSCANDO EN MAS DE DOS MATRICES - CORRECCION FORMULADA",{"$nulls":4},"",null,"Febrero",260.27,258.59,338.75,385.31,null,"Febrero",828.03,{"v":900.4,"d":"900.40"},971.87,718.16]
[null,"","","",{"$nulls":4},"",null,"Marzo",{"v":139.2,"d":"139.20"},297.41,{"v":394.1,"d":"394.10"},{"v":398.2,"d":"398.20"},null,"Marzo",599.99,698.05,995.96,518.04]
[null,"","","Opción 1: BUSCARH",{"$nulls":4},"",null,"Abril",343.31,347.05,{"v":346.8,"d":"346.80"},{"v":301.7,"d":"301.70"},null,"Abril",711.89,669.74,543.41,717.81]
[null,"","Zona","Zona Sur",{"$nulls":4},"",null,"Mayo",286.16,127.88,289.03,213.21,null,"Mayo",803.75,607.49,588.66,900.85]
[null,"","Producto","Harina",{"$nulls":4},"",null,"Junio",178.05,290.29,300.79,201.39,null,"Junio",{"v":993.1,"d":"993.10"},547.75,690.49,{"v":941.3,"d":"941.30"}]
[null,"","Mes","Abril",{"$nulls":4},"",null,"Julio",219.25,{"v":138.7,"d":"138.70"},157.42,206.84,null,"Julio",779.28,954.61,601.98,{"v":678.7,"d":"678.70"}]
[null,"","","",{"$nulls":4},"",null,"Agosto",165.68,132.45,212.86,378.47,null,"Agosto",982.43,682.06,512.31,765.71]
[null,"","","",{"$nulls":4},"",null,"Setiembre",396.34,297.83,183.66,296.41,null,"Setiembre",909.62,827.64,811.44,513.54]
[null,"","","",{"$nulls":4},"",null,"Octubre",370.03,387.44,385.66,370.22,null,"Octubre",601.02,873.28,639.76,561.53]
[null,"","","Ejercicio →",{"$nulls":4},"",null,"Noviembre",159.75,172.82,320.43,250.82,null,"Noviembre",588.36,655.77,700.69,969.99]
[null,"","Zona","Zona Este",{"$nulls":4},"",null,"Diciembre",328.57,176.63,365.48,373.25,null,"Diciembre",904.75,599.15,640.71,910.63]
[null,"","Producto","Fideos",{"$nulls":4},""]
[null,"","Mes","Setiembre",{"$nulls":4},""]
[null,"","","",{"$nulls":4},""]
[null,"","","",{"$nulls":4},""]

{"sheet":"DO_A2_05","index":34,"n_rows":22,"n_cols":15,"rows_kept":22,"hidden":true}
[]
[]
[]
[]
[]
[null,{"$f":"\"\"","v":""},"MATRIZ BUSCAR EN",{"$nulls":4},{"$f":"IF(ARG2_05!G6=\"\",\"\",IF(I6=\"f\",IF(G6=ARG2_05!G6,\"ü\",\"û\"),\"\"))","v":""},null,null,"Meses","Norte","Sur","Este","Oeste"]
[null,{"$f":"\"\"","v":""},{"$f":"\"\"","v":""},{"$nulls":4},{"$f":"IF(ARG2_05!G7=\"\",\"\",IF(I7=\"f\",IF(G7=ARG2_05!G7,\"ü\",\"û\"),\"\"))","v":""},null,null,{"$f":"PROPER(TEXT(DATE(YEAR(TODAY()),ROWS(K$7:K7),1),\"mmmm\"))","v":"Enero"},{"$f":"ROUND(RANDBETWEEN(100,600)+RAND(),2)","v":371.69},177.72,375.11,216.42]
[null,"►","MATRIZ EN REVERSA",{"$nulls":4},{"$f":"IF(ARG2_05!G8=\"\",\"\",IF(I8=\"f\",IF(G8=ARG2_05!G8,\"ü\",\"û\"),\"\"))","v":""},null,null,{"$f":"PROPER(TEXT(DATE(YEAR(TODAY()),ROWS(K$7:K8),1),\"mmmm\"))","v":"Febrero"},318.81,547.32,314.36,453.44]
[null,{"$f":"\"\"","v":""},{"$f":"\"\"","v":""},{"$nulls":4},{"$f":"IF(ARG2_05!G9=\"\",\"\",IF(I9=\"f\",IF(G9=ARG2_05!G9,\"ü\",\"û\"),\"\"))","v":""},null,null,{"$f":"PROPER(TEXT(DATE(YEAR(TODAY()),ROWS(K$7:K9),1),\"mmmm\"))","v":"Marzo"},257.77,384.04,401.72,592.05]
[null,{"$f":"\"\"","v":""},"Opción 1: BUSCARV…columna 5",{"$nulls":4},{"$f":"IF(ARG2_05!G10=\"\",\"\",IF(I10=\"f\",IF(G10=ARG2_05!G10,\"ü\",\"û\"),\"\"))","v":""},null,null,{"$f":"PROPER(TEXT(DATE(YEAR(TODAY()),ROWS(K$7:K10),1),\"mmmm\"))","v":"Abril"},222.52,516.71,512.79,200.02]
[null,{"$f":"\"\"","v":""},{"$f":"INDEX($K$7:$K$18,RANDBETWEEN(1,12))","v":"Diciembre"},{"$nulls":3},{"$f":"VLOOKUP(C11,$K$6:$O$18,5,0)","v":119.94},{"$f":"IF(ARG2_05!G11=\"\",\"\",IF(I11=\"f\",IF(G11=ARG2_05!G11,\"ü\",\"û\"),\"\"))","v":""},"f",null,{"$f":"PROPER(TEXT(DATE(YEAR(TODAY()),ROWS(K$7:K11),1),\"mmmm\"))","v":"Mayo"},457.81,261.41,395.94,{"v":239.4,"d":"239.40"}]
[null,{"$f":"\"\"","v":""},{"$f":"IF(_xlfn.ISFORMULA(ARG2_05!G11),_xlfn.FORMULATEXT(ARG2_05!G11),\"\")","v":""},{"$nulls":4},{"$f":"IF(ARG2_05!G12=\"\",\"\",IF(I12=\"f\",IF(G12=ARG2_05!G12,\"ü\",\"û\"),\"\"))","v":""},null,null,{"$f":"PROPER(TEXT(DATE(YEAR(TODAY()),ROWS(K$7:K12),1),\"mmmm\"))","v":"Junio"},132.07,543.16,247.94,552.14]
[null,{"$f":"\"\"","v":""},{"$f":"\"\"","v":""},{"$nulls":4},{"$f":"IF(ARG2_05!G13=\"\",\"\",IF(I13=\"f\",IF(G13=ARG2_05!G13,\"ü\",\"û\"),\"\"))","v":""},null,null,{"$f":"PROPER(TEXT(DATE(YEAR(TODAY()),ROWS(K$7:K13),1),\"mmmm\"))","v":"Julio"},190.47,{"v":226.2,"d":"226.20"},227.73,560.41]
[null,{"$f":"\"\"","v":""},"Reversa →",{"$nulls":3},{"$f":"VLOOKUP(G11,\nCHOOSE({2,1},$K$6:$K$18,$O$6:$O$18),2,0)","v":"Diciembre"},{"$f":"IF(ARG2_05!G14=\"\",\"\",IF(I14=\"f\",IF(G14=ARG2_05!G14,\"ü\",\"û\"),\"\"))","v":""},"f",null,{"$f":"PROPER(TEXT(DATE(YEAR(TODAY()),ROWS(K$7:K14),1),\"mmmm\"))","v":"Agosto"},337.33,585.77,561.81,193.64]
[null,{"$f":"\"\"","v":""},{"$f":"IF(_xlfn.ISFORMULA(ARG2_05!G14),_xlfn.FORMULATEXT(ARG2_05!G14),\"\")","v":""},{"$nulls":4},{"$f":"IF(ARG2_05!G15=\"\",\"\",IF(I15=\"f\",IF(G15=ARG2_05!G15,\"ü\",\"û\"),\"\"))","v":""},null,null,{"$f":"PROPER(TEXT(DATE(YEAR(TODAY()),ROWS(K$7:K15),1),\"mmmm\"))","v":"Setiembre"},179.28,461.89,273.32,{"v":117.6,"d":"117.60"}]
[null,{"$f":"\"\"","v":""},{"$f":"\"\"","v":""},{"$nulls":4},{"$f":"IF(ARG2_05!G16=\"\",\"\",IF(I16=\"f\",IF(G16=ARG2_05!G16,\"ü\",\"û\"),\"\"))","v":""},null,null,{"$f":"PROPER(TEXT(DATE(YEAR(TODAY()),ROWS(K$7:K16),1),\"mmmm\"))","v":"Octubre"},244.68,218.39,139.63,257.77]
[null,{"$f":"\"\"","v":""},"Ejercicio → … fila 7",{"$nulls":4},{"$f":"IF(ARG2_05!G17=\"\",\"\",IF(I17=\"f\",IF(G17=ARG2_05!G17,\"ü\",\"û\"),\"\"))","v":""},null,null,{"$f":"PROPER(TEXT(DATE(YEAR(TODAY()),ROWS(K$7:K17),1),\"mmmm\"))","v":"Noviembre"},110.81,560.04,565.28,{"v":516.7,"d":"516.70"}]
[null,{"$f":"\"\"","v":""},{"$f":"INDEX($L$6:$O$6,RANDBETWEEN(1,4))","v":"Oeste"},{"$nulls":3},{"$f":"HLOOKUP(C18,$K$6:$O$18,7,0)","v":552.14},{"$f":"IF(ARG2_05!G18=\"\",\"\",IF(I18=\"f\",IF(G18=ARG2_05!G18,\"ü\",\"û\"),\"\"))","v":""},"f",null,{"$f":"PROPER(TEXT(DATE(YEAR(TODAY()),ROWS(K$7:K18),1),\"mmmm\"))","v":"Diciembre"},313.71,155.79,180.75,119.94]
[null,{"$f":"\"\"","v":""},{"$f":"IF(_xlfn.ISFORMULA(ARG2_05!G18),_xlfn.FORMULATEXT(ARG2_05!G18),\"\")","v":""},{"$nulls":4},{"$f":"IF(ARG2_05!G19=\"\",\"\",IF(I19=\"f\",IF(G19=ARG2_05!G19,\"ü\",\"û\"),\"\"))","v":""}]
[null,{"$f":"\"\"","v":""},{"$f":"\"\"","v":""},{"$nulls":4},{"$f":"IF(ARG2_05!G20=\"\",\"\",IF(I20=\"f\",IF(G20=ARG2_05!G20,\"ü\",\"û\"),\"\"))","v":""}]
[null,{"$f":"\"\"","v":""},"Reversa →",{"$nulls":3},{"$f":"HLOOKUP(G18,\nCHOOSE({2;1},$K$6:$O$6,$K$12:$O$12),2,0)","v":"Oeste"},{"$f":"IF(ARG2_05!G21=\"\",\"\",IF(I21=\"f\",IF(G21=ARG2_05!G21,\"ü\",\"û\"),\"\"))","v":""},"f"]
[null,{"$f":"\"\"","v":""},{"$f":"IF(_xlfn.ISFORMULA(ARG2_05!G21),_xlfn.FORMULATEXT(ARG2_05!G21),\"\")","v":""},{"$nulls":4},{"$f":"IF(ARG2_05!G22=\"\",\"\",IF(I22=\"f\",IF(G22=ARG2_05!G22,\"ü\",\"û\"),\"\"))","v":""}]

{"sheet":"ARG2_05","index":35,"n_rows":22,"n_cols":14,"rows_kept":22,"hidden":true}
[null,"Argumento matriz buscar en"]
[null,"MOS Expert - CPC Martín Cruz - 998401784"]
[]
[]
[]
[null,{"$f":"lista02.19","v":""},"MATRIZ BUSCAR EN",{"$nulls":4},{"$f":"lista02.21","v":""}]
[null,"","",{"$nulls":4},""]
[null,"►","MATRIZ EN REVERSA",{"$nulls":4},"",null,{"$f":"lista02.20","v":"Meses"},"Norte","Sur","Este","Oeste"]
[null,"","",{"$nulls":4},"",null,"Enero",371.69,177.72,375.11,216.42]
[null,"","Opción 1: BUSCARV…columna 5",{"$nulls":4},"",null,"Febrero",318.81,547.32,314.36,453.44]
[null,"","Diciembre",{"$nulls":4},"",null,"Marzo",257.77,384.04,401.72,592.05]
[null,"","",{"$nulls":4},"",null,"Abril",222.52,516.71,512.79,200.02]
[null,"","",{"$nulls":4},"",null,"Mayo",457.81,261.41,395.94,{"v":239.4,"d":"239.40"}]
[null,"","Reversa →",{"$nulls":4},"",null,"Junio",132.07,543.16,247.94,552.14]
[null,"","",{"$nulls":4},"",null,"Julio",190.47,{"v":226.2,"d":"226.20"},227.73,560.41]
[null,"","",{"$nulls":4},"",null,"Agosto",337.33,585.77,561.81,193.64]
[null,"","Ejercicio → … fila 7",{"$nulls":4},"",null,"Setiembre",179.28,461.89,273.32,{"v":117.6,"d":"117.60"}]
[null,"","Oeste",{"$nulls":4},"",null,"Octubre",244.68,218.39,139.63,257.77]
[null,"","",{"$nulls":4},"",null,"Noviembre",110.81,560.04,565.28,{"v":516.7,"d":"516.70"}]
[null,"","",{"$nulls":4},"",null,"Diciembre",313.71,155.79,180.75,119.94]
[null,"","Reversa →",{"$nulls":4},""]
[null,"","",{"$nulls":4},""]

{"sheet":"DO_A2_06","index":36,"n_rows":25,"n_cols":16,"rows_kept":25,"hidden":true}
[]
[]
[]
[]
[]
[null,{"$f":"\"\"","v":""},"MATRIZ BUSCAR EN",{"$nulls":5},{"$f":"IF(DO_ARG2_06!H6=\"\",\"\",IF(J6=\"f\",IF(H6=DO_ARG2_06!H6,\"ü\",\"û\"),\"\"))","v":""},null,null,"Meses","Norte","Sur","Este","Oeste"]
[null,{"$f":"\"\"","v":""},{"$f":"\"\"","v":""},{"$nulls":5},{"$f":"IF(DO_ARG2_06!H7=\"\",\"\",IF(J7=\"f\",IF(H7=DO_ARG2_06!H7,\"ü\",\"û\"),\"\"))","v":""},null,null,{"$f":"PROPER(TEXT(DATE(YEAR(TODAY()),ROWS(L$7:L7),1),\"mmmm\"))","v":"Enero"},{"$f":"ROUND(RANDBETWEEN(100,600)+RAND(),2)","v":204.38},459.22,363.24,{"v":407.5,"d":"407.50"}]
[null,"►","MATRIZ EN REVERSA - EXPERTO",{"$nulls":5},{"$f":"IF(DO_ARG2_06!H8=\"\",\"\",IF(J8=\"f\",IF(H8=DO_ARG2_06!H8,\"ü\",\"û\"),\"\"))","v":""},null,null,{"$f":"PROPER(TEXT(DATE(YEAR(TODAY()),ROWS(L$7:L8),1),\"mmmm\"))","v":"Febrero"},562.21,385.32,125.73,141.48]
[null,{"$f":"\"\"","v":""},{"$f":"\"\"","v":""},{"$nulls":5},{"$f":"IF(DO_ARG2_06!H9=\"\",\"\",IF(J9=\"f\",IF(H9=DO_ARG2_06!H9,\"ü\",\"û\"),\"\"))","v":""},null,null,{"$f":"PROPER(TEXT(DATE(YEAR(TODAY()),ROWS(L$7:L9),1),\"mmmm\"))","v":"Marzo"},283.82,405.46,382.94,428.62]
[null,{"$f":"\"\"","v":""},"Ejercicio →",{"$nulls":5},{"$f":"IF(DO_ARG2_06!H10=\"\",\"\",IF(J10=\"f\",IF(H10=DO_ARG2_06!H10,\"ü\",\"û\"),\"\"))","v":""},null,null,{"$f":"PROPER(TEXT(DATE(YEAR(TODAY()),ROWS(L$7:L10),1),\"mmmm\"))","v":"Abril"},535.89,{"v":480,"d":"480.00"},282.41,528.91]
[null,{"$f":"\"\"","v":""},{"$f":"INDEX($M$6:$P$6,RANDBETWEEN(1,4))","v":"Este"},{"$nulls":5},{"$f":"IF(DO_ARG2_06!H11=\"\",\"\",IF(J11=\"f\",IF(H11=DO_ARG2_06!H11,\"ü\",\"û\"),\"\"))","v":""},null,null,{"$f":"PROPER(TEXT(DATE(YEAR(TODAY()),ROWS(L$7:L11),1),\"mmmm\"))","v":"Mayo"},{"v":519.1,"d":"519.10"},480.04,424.97,262.25]
[null,{"$f":"\"\"","v":""},{"$f":"INDEX($L$7:$L$18,RANDBETWEEN(1,12))","v":"Enero"},{"$nulls":4},{"$f":"VLOOKUP(C12,$L$6:$P$18,MATCH(C11,$L$6:$P$6,0),0)","v":363.24},{"$f":"IF(DO_ARG2_06!H12=\"\",\"\",IF(J12=\"f\",IF(H12=DO_ARG2_06!H12,\"ü\",\"û\"),\"\"))","v":"ü"},"f",null,{"$f":"PROPER(TEXT(DATE(YEAR(TODAY()),ROWS(L$7:L12),1),\"mmmm\"))","v":"Junio"},584.41,167.42,433.55,184.68]
[null,{"$f":"\"\"","v":""},{"$f":"IF(_xlfn.ISFORMULA(DO_ARG2_06!H12),_xlfn.FORMULATEXT(DO_ARG2_06!H12),\"\")","v":"=BUSCARV(C12,$K$8:$O$20,COINCIDIR(C11,$K$8:$O$8,0),0)"},{"$nulls":5},{"$f":"IF(DO_ARG2_06!H13=\"\",\"\",IF(J13=\"f\",IF(H13=DO_ARG2_06!H13,\"ü\",\"û\"),\"\"))","v":""},null,null,{"$f":"PROPER(TEXT(DATE(YEAR(TODAY()),ROWS(L$7:L13),1),\"mmmm\"))","v":"Julio"},591.57,348.39,572.43,324.54]
[null,{"$f":"\"\"","v":""},{"$f":"\"\"","v":""},{"$nulls":5},{"$f":"IF(DO_ARG2_06!H14=\"\",\"\",IF(J14=\"f\",IF(H14=DO_ARG2_06!H14,\"ü\",\"û\"),\"\"))","v":""},null,null,{"$f":"PROPER(TEXT(DATE(YEAR(TODAY()),ROWS(L$7:L14),1),\"mmmm\"))","v":"Agosto"},416.58,108.85,322.29,294.84]
[null,{"$f":"\"\"","v":""},"Reversa 1 →",{"$nulls":4},{"$f":"VLOOKUP(H12,\nCHOOSE(CHOOSE({1,2},MATCH(C11,$L$6:$P$6,0),1),$L$6:$L$18,$M$6:$M$18,$N$6:$N$18,$O$6:$O$18,$P$6:$P$18),2,0)","v":"Enero"},{"$f":"IF(DO_ARG2_06!H15=\"\",\"\",IF(J15=\"f\",IF(H15=DO_ARG2_06!H15,\"ü\",\"û\"),\"\"))","v":"ü"},"f",null,{"$f":"PROPER(TEXT(DATE(YEAR(TODAY()),ROWS(L$7:L15),1),\"mmmm\"))","v":"Setiembre"},553.13,277.65,500.53,106.77]
[null,{"$f":"\"\"","v":""},{"$f":"IF(_xlfn.ISFORMULA(DO_ARG2_06!H15),MID(_xlfn.FORMULATEXT(DO_ARG2_06!H15),1,35),\"\")","v":"{=BUSCARV(H12,\nELEGIR(ELEGIR({1,2},"},{"$nulls":5},{"$f":"IF(DO_ARG2_06!H16=\"\",\"\",IF(J16=\"f\",IF(H16=DO_ARG2_06!H16,\"ü\",\"û\"),\"\"))","v":""},null,null,{"$f":"PROPER(TEXT(DATE(YEAR(TODAY()),ROWS(L$7:L16),1),\"mmmm\"))","v":"Octubre"},474.27,553.74,234.92,587.74]
[null,{"$f":"\"\"","v":""},{"$f":"IF(_xlfn.ISFORMULA(DO_ARG2_06!H15),MID(_xlfn.FORMULATEXT(DO_ARG2_06!H15),36,52),\"\")","v":"COINCIDIR(C11,$K$8:$O$8,0),1),$K$8:$K$20,$L$8:$L$20,"},{"$nulls":5},{"$f":"IF(DO_ARG2_06!H17=\"\",\"\",IF(J17=\"f\",IF(H17=DO_ARG2_06!H17,\"ü\",\"û\"),\"\"))","v":""},null,null,{"$f":"PROPER(TEXT(DATE(YEAR(TODAY()),ROWS(L$7:L17),1),\"mmmm\"))","v":"Noviembre"},309.58,{"v":299.6,"d":"299.60"},102.54,202.15]
[null,{"$f":"\"\"","v":""},{"$f":"IF(_xlfn.ISFORMULA(DO_ARG2_06!H15),MID(_xlfn.FORMULATEXT(DO_ARG2_06!H15),88,60),\"\")","v":"$M$8:$M$20,$N$8:$N$20,$O$8:$O$20),2,0)}"},{"$nulls":5},{"$f":"IF(DO_ARG2_06!H18=\"\",\"\",IF(J18=\"f\",IF(H18=DO_ARG2_06!H18,\"ü\",\"û\"),\"\"))","v":""},null,null,{"$f":"PROPER(TEXT(DATE(YEAR(TODAY()),ROWS(L$7:L18),1),\"mmmm\"))","v":"Diciembre"},497.73,572.89,105.87,503.87]
[null,{"$f":"\"\"","v":""},{"$f":"\"\"","v":""},{"$nulls":5},{"$f":"IF(DO_ARG2_06!H19=\"\",\"\",IF(J19=\"f\",IF(H19=DO_ARG2_06!H19,\"ü\",\"û\"),\"\"))","v":""}]
[null,{"$f":"\"\"","v":""},"Reversa 2 →",{"$nulls":4},{"$f":"HLOOKUP(H12,\nCHOOSE(CHOOSE({1;2},MATCH(C12,$L$6:$L$18,0),1),$L$6:$P$6,$L$7:$P$7,$L$8:$P$8,$L$9:$P$9,$L$10:$P$10,$L$11:$P$11,$L$12:$P$12,$L$13:$P$13,$L$14:$P$14,$L$15:$P$15,$L$16:$P$16,$L$17:$P$17,$L$18:$P$18),2,0)","v":"Este"},{"$f":"IF(DO_ARG2_06!H20=\"\",\"\",IF(J20=\"f\",IF(H20=DO_ARG2_06!H20,\"ü\",\"û\"),\"\"))","v":"ü"},"f"]
[null,{"$f":"\"\"","v":""},{"$f":"IF(_xlfn.ISFORMULA(DO_ARG2_06!H20),MID(_xlfn.FORMULATEXT(DO_ARG2_06!H20),1,35),\"\")","v":"{=BUSCARH(H12,\nELEGIR(ELEGIR({1;2},"},{"$nulls":5},{"$f":"IF(DO_ARG2_06!H21=\"\",\"\",IF(J21=\"f\",IF(H21=DO_ARG2_06!H21,\"ü\",\"û\"),\"\"))","v":""}]
[null,{"$f":"\"\"","v":""},{"$f":"IF(_xlfn.ISFORMULA(DO_ARG2_06!H20),MID(_xlfn.FORMULATEXT(DO_ARG2_06!H20),36,51),\"\")","v":"COINCIDIR(C12,$K$8:$K$20,0),1),$K$8:$O$8,$K$9:$O$9,"},{"$nulls":5},{"$f":"IF(DO_ARG2_06!H22=\"\",\"\",IF(J22=\"f\",IF(H22=DO_ARG2_06!H22,\"ü\",\"û\"),\"\"))","v":""}]
[null,{"$f":"\"\"","v":""},{"$f":"IF(_xlfn.ISFORMULA(DO_ARG2_06!H20),MID(_xlfn.FORMULATEXT(DO_ARG2_06!H20),87,56),\"\")","v":"$K$10:$O$10,$K$11:$O$11,$K$12:$O$12,$K$13:$O$13,$K$14:$O"},{"$nulls":5},{"$f":"IF(DO_ARG2_06!H23=\"\",\"\",IF(J23=\"f\",IF(H23=DO_ARG2_06!H23,\"ü\",\"û\"),\"\"))","v":""}]
[null,{"$f":"\"\"","v":""},{"$f":"IF(_xlfn.ISFORMULA(DO_ARG2_06!H20),MID(_xlfn.FORMULATEXT(DO_ARG2_06!H20),143,48),\"\")","v":"$14,$K$15:$O$15,$K$16:$O$16,$K$17:$O$17,$K$18:$O"},{"$nulls":5},{"$f":"IF(DO_ARG2_06!H24=\"\",\"\",IF(J24=\"f\",IF(H24=DO_ARG2_06!H24,\"ü\",\"û\"),\"\"))","v":""}]
[null,{"$f":"\"\"","v":""},{"$f":"IF(_xlfn.ISFORMULA(DO_ARG2_06!H20),MID(_xlfn.FORMULATEXT(DO_ARG2_06!H20),192,48),\"\")","v":"18,$K$19:$O$19,$K$20:$O$20),2,0)}"},{"$nulls":5},{"$f":"IF(DO_ARG2_06!H25=\"\",\"\",IF(J25=\"f\",IF(H25=DO_ARG2_06!H25,\"ü\",\"û\"),\"\"))","v":""}]

{"sheet":"DO_ARG2_06","index":37,"n_rows":25,"n_cols":15,"rows_kept":25,"hidden":true}
[null,"Argumento matriz buscar en"]
[null,"MOS Expert - CPC Martín Cruz - 998401784"]
[]
[]
[]
[null,{"$f":"lista02.22","v":""},"MATRIZ BUSCAR EN",{"$nulls":5},{"$f":"lista02.24","v":""}]
[null,"","",{"$nulls":5},""]
[null,"►","MATRIZ EN REVERSA - EXPERTO",{"$nulls":5},"",null,{"$f":"lista02.23","v":"Meses"},"Norte","Sur","Este","Oeste"]
[null,"","",{"$nulls":5},"",null,"Enero",204.38,459.22,363.24,{"v":407.5,"d":"407.50"}]
[null,"","Ejercicio →",{"$nulls":5},"",null,"Febrero",562.21,385.32,125.73,141.48]
[null,"","Este",{"$nulls":5},"",null,"Marzo",283.82,405.46,382.94,428.62]
[null,"","Enero",{"$nulls":4},{"$f":"VLOOKUP(C12,$K$8:$O$20,MATCH(C11,$K$8:$O$8,0),0)","v":363.24},"ü",null,"Abril",535.89,{"v":480,"d":"480.00"},282.41,528.91]
[null,"","=BUSCARV(C12,$K$8:$O$20,COINCIDIR(C11,$K$8:$O$8,0),0)",{"$nulls":5},"",null,"Mayo",{"v":519.1,"d":"519.10"},480.04,424.97,262.25]
[null,"","",{"$nulls":5},"",null,"Junio",584.41,167.42,433.55,184.68]
[null,"","Reversa 1 →",{"$nulls":4},{"$f":"VLOOKUP(H12,\nCHOOSE(CHOOSE({1,2},MATCH(C11,$K$8:$O$8,0),1),$K$8:$K$20,$L$8:$L$20,$M$8:$M$20,$N$8:$N$20,$O$8:$O$20),2,0)","v":"Enero"},"ü",null,"Julio",591.57,348.39,572.43,324.54]
[null,"","{=BUSCARV(H12,\nELEGIR(ELEGIR({1,2},",{"$nulls":5},"",null,"Agosto",416.58,108.85,322.29,294.84]
[null,"","COINCIDIR(C11,$K$8:$O$8,0),1),$K$8:$K$20,$L$8:$L$20,",{"$nulls":5},"",null,"Setiembre",553.13,277.65,500.53,106.77]
[null,"","$M$8:$M$20,$N$8:$N$20,$O$8:$O$20),2,0)}",{"$nulls":5},"",null,"Octubre",474.27,553.74,234.92,587.74]
[null,"","",{"$nulls":5},"",null,"Noviembre",309.58,{"v":299.6,"d":"299.60"},102.54,202.15]
[null,"","Reversa 2 →",{"$nulls":4},{"$f":"HLOOKUP(H12,\nCHOOSE(CHOOSE({1;2},MATCH(C12,$K$8:$K$20,0),1),$K$8:$O$8,$K$9:$O$9,$K$10:$O$10,$K$11:$O$11,$K$12:$O$12,$K$13:$O$13,$K$14:$O$14,$K$15:$O$15,$K$16:$O$16,$K$17:$O$17,$K$18:$O$18,$K$19:$O$19,$K$20:$O$20),2,0)","v":"Este"},"ü",null,"Diciembre",497.73,572.89,105.87,503.87]
[null,"","{=BUSCARH(H12,\nELEGIR(ELEGIR({1;2},",{"$nulls":5},""]
[null,"","COINCIDIR(C12,$K$8:$K$20,0),1),$K$8:$O$8,$K$9:$O$9,",{"$nulls":5},""]
[null,"","$K$10:$O$10,$K$11:$O$11,$K$12:$O$12,$K$13:$O$13,$K$14:$O",{"$nulls":5},""]
[null,"","$14,$K$15:$O$15,$K$16:$O$16,$K$17:$O$17,$K$18:$O",{"$nulls":5},""]
[null,"","18,$K$19:$O$19,$K$20:$O$20),2,0)}",{"$nulls":5},""]

{"sheet":"DO_EJER01","index":38,"n_rows":35,"n_cols":23,"rows_kept":35,"hidden":true}
[]
[]
[]
[]
[]
[null,{"$f":"\"\"","v":""},"EJERCICIOS"]
[null,{"$f":"\"\"","v":""},{"$f":"\"\"","v":""}]
[null,"►","MATRIZ EN REVERSA - EXPERTO",{"$nulls":8},"Vendedor","Clientes","Ventas","Margen",null,{"$f":"RAND()","v":0.08617587794298798},"Ochoa",0.18767489191578357,"José",{"$f":"VLOOKUP(LARGE($S$8:$S$20,ROWS(U$8:U8)),$S$8:$T$20,2,0)","v":"Francisco"},{"$f":"VLOOKUP(LARGE($Q$8:$Q$20,ROWS(V$8:V8)),$Q$8:$R$20,2,0)","v":"Cespedes"},{"$f":"U8&\" \"&V8","v":"Francisco Cespedes"}]
[{"$nulls":11},{"$f":"U8","v":"Francisco"},{"$f":"RANDBETWEEN(5,15)","v":5},{"$f":"ROUND(M9*RANDBETWEEN(80,150)+RAND(),2)","v":{"v":655.71,"d":"656"}},{"$f":"ROUND(N9*RANDBETWEEN(25,35)%,0)","v":203},null,0.5118618346560355,"Manco",0.3971839872037579,"Alberto",{"$f":"VLOOKUP(LARGE($S$8:$S$20,ROWS(U$8:U9)),$S$8:$T$20,2,0)","v":"Jacob"},{"$f":"VLOOKUP(LARGE($Q$8:$Q$20,ROWS(V$8:V9)),$Q$8:$R$20,2,0)","v":"Velasquez"},"Jacob Velasquez"]
[null,{"$f":"\"\"","v":""},{"$f":"\"¿Cuál es el promedio de venta por cliente del vendedor \"&C12&\"?\"","v":"¿Cuál es el promedio de venta por cliente del vendedor Miguel?"},{"$nulls":8},"Jacob",14,{"v":1848.09,"d":"1,848"},554,null,0.44863622518186796,"Rodriguez",0.3246295244572832,"Javier",{"$f":"VLOOKUP(LARGE($S$8:$S$20,ROWS(U$8:U10)),$S$8:$T$20,2,0)","v":"Omar"},{"$f":"VLOOKUP(LARGE($Q$8:$Q$20,ROWS(V$8:V10)),$Q$8:$R$20,2,0)","v":"Quiñones"},"Omar Quiñones"]
[null,{"$f":"\"\"","v":""},"Ejercicio →",{"$nulls":8},"Omar",14,{"v":1330.83,"d":"1,331"},373,null,0.20352124574258057,"Santos",0.0905957326785457,"Jesús",{"$f":"VLOOKUP(LARGE($S$8:$S$20,ROWS(U$8:U11)),$S$8:$T$20,2,0)","v":"Roger"},{"$f":"VLOOKUP(LARGE($Q$8:$Q$20,ROWS(V$8:V11)),$Q$8:$R$20,2,0)","v":"Cabello"},"Roger Cabello"]
[null,{"$f":"\"\"","v":""},{"$f":"INDEX($L$9:$L$18,RANDBETWEEN(1,5)*2)","v":"Miguel"},{"$nulls":3},{"$f":"VLOOKUP(C12,$L$8:$O$18,3,0)/VLOOKUP(C12,$L$8:$O$18,2,0)","v":{"v":102.05071428571429,"d":"102.05"}},{"$nulls":4},"Roger",11,{"v":880.78,"d":"881"},308,null,0.005873095107241988,"Baca",0.9063333227802978,"Jacob",{"$f":"VLOOKUP(LARGE($S$8:$S$20,ROWS(U$8:U12)),$S$8:$T$20,2,0)","v":"Fabio"},{"$f":"VLOOKUP(LARGE($Q$8:$Q$20,ROWS(V$8:V12)),$Q$8:$R$20,2,0)","v":"Quispe"},"Fabio Quispe"]
[null,null,{"$f":"IF(_xlfn.ISFORMULA(DO_EJER01!G12),_xlfn.FORMULATEXT(DO_EJER01!G12),\"\")","v":"=BUSCARV(C12,$L$8:$O$18,3,0)/BUSCARV(C12,$L$8:$O$18,2,0)"},{"$nulls":8},"Fabio",12,{"v":1236.98,"d":"1,237"},346,null,0.7915696845392322,"Velasquez",0.8149353366564449,"Roger",{"$f":"VLOOKUP(LARGE($S$8:$S$20,ROWS(U$8:U13)),$S$8:$T$20,2,0)","v":"Miguel"},{"$f":"VLOOKUP(LARGE($Q$8:$Q$20,ROWS(V$8:V13)),$Q$8:$R$20,2,0)","v":"Manco"},"Miguel Manco"]
[{"$nulls":11},"Miguel",14,{"v":1428.71,"d":"1,429"},443,null,0.9940312006528519,"Cespedes",0.33456331708531717,"Eduardo",{"$f":"VLOOKUP(LARGE($S$8:$S$20,ROWS(U$8:U14)),$S$8:$T$20,2,0)","v":"Alberto"},{"$f":"VLOOKUP(LARGE($Q$8:$Q$20,ROWS(V$8:V14)),$Q$8:$R$20,2,0)","v":"Rodriguez"},"Alberto Rodriguez"]
[null,null,{"$f":"\"¿Quién vendió más \"&C17&\" o \"&C18&\"?\"","v":"¿Quién vendió más Jacob o Alberto?"},{"$nulls":8},"Alberto",14,{"v":2044.84,"d":"2,045"},634,null,0.34993931741274975,"Zegarra",0.6105427048675026,"Miguel",{"$f":"VLOOKUP(LARGE($S$8:$S$20,ROWS(U$8:U15)),$S$8:$T$20,2,0)","v":"Eduardo"},{"$f":"VLOOKUP(LARGE($Q$8:$Q$20,ROWS(V$8:V15)),$Q$8:$R$20,2,0)","v":"Zegarra"},"Eduardo Zegarra"]
[null,null,"Ejercicio →",{"$nulls":8},"Eduardo",5,{"v":405.18,"d":"405"},113,null,0.7731854695209238,"Quiñones",0.9071779294170307,"Francisco",{"$f":"VLOOKUP(LARGE($S$8:$S$20,ROWS(U$8:U16)),$S$8:$T$20,2,0)","v":"Franco"},{"$f":"VLOOKUP(LARGE($Q$8:$Q$20,ROWS(V$8:V16)),$Q$8:$R$20,2,0)","v":"Miranda"},"Franco Miranda"]
[null,null,{"$f":"INDEX($L$9:$L$18,RANDBETWEEN(1,5)*2)","v":"Jacob"},{"$nulls":8},"Franco",15,{"v":1380.86,"d":"1,381"},414,null,0.2829188762549171,"Atoche",0.7454743047819826,"Fabio",{"$f":"VLOOKUP(LARGE($S$8:$S$20,ROWS(U$8:U17)),$S$8:$T$20,2,0)","v":"Javier"},{"$f":"VLOOKUP(LARGE($Q$8:$Q$20,ROWS(V$8:V17)),$Q$8:$R$20,2,0)","v":"Atoche"},"Javier Atoche"]
[null,null,{"$f":"INDEX($L$9:$L$18,RANDBETWEEN(1,5)*2-1)","v":"Alberto"},{"$nulls":3},{"$f":"IF(VLOOKUP(C17,$L$8:$O$18,3,0)>VLOOKUP(C18,$L$8:$O$18,2,0),C17,C18)","v":"Jacob"},{"$nulls":4},"Javier",7,{"v":721.87,"d":"722"},202,null,0.6331897554129383,"Quispe",0.8606839283576528,"Omar",{"$f":"VLOOKUP(LARGE($S$8:$S$20,ROWS(U$8:U18)),$S$8:$T$20,2,0)","v":"José"},{"$f":"VLOOKUP(LARGE($Q$8:$Q$20,ROWS(V$8:V18)),$Q$8:$R$20,2,0)","v":"Santos"},"José Santos"]
[null,null,{"$f":"IF(_xlfn.ISFORMULA(DO_EJER01!G18),_xlfn.FORMULATEXT(DO_EJER01!G18),\"\")","v":"=SI(BUSCARV(C17,$L$8:$O$18,3,0)>BUSCARV(C18,$L$8:$O$18,2,0),C17,C18)"},{"$nulls":13},0.2910375629026942,"Miranda",0.32804002637637053,"Franco",{"$f":"VLOOKUP(LARGE($S$8:$S$20,ROWS(U$8:U19)),$S$8:$T$20,2,0)","v":"Jesús"},{"$f":"VLOOKUP(LARGE($Q$8:$Q$20,ROWS(V$8:V19)),$Q$8:$R$20,2,0)","v":"Ochoa"},"Jesús Ochoa"]
[{"$nulls":16},0.6800097285843909,"Cabello",0.08839019888265942,"Oscar",{"$f":"VLOOKUP(LARGE($S$8:$S$20,ROWS(U$8:U20)),$S$8:$T$20,2,0)","v":"Oscar"},{"$f":"VLOOKUP(LARGE($Q$8:$Q$20,ROWS(V$8:V20)),$Q$8:$R$20,2,0)","v":"Baca"},"Oscar Baca"]
[null,null,{"$f":"\"¿Quién obtuvo la mejor venta?\"","v":"¿Quién obtuvo la mejor venta?"}]
[null,null,"Ejercicio →",{"$nulls":3},{"$f":"VLOOKUP(MAX($N$9:$N$18),CHOOSE({2,1},$L$9:$L$18,$N$9:$N$18),2,0)","v":"Alberto"}]
[null,null,{"$f":"IF(_xlfn.ISFORMULA(DO_EJER01!G22),_xlfn.FORMULATEXT(DO_EJER01!G22),\"\")","v":"=BUSCARV(MAX($N$9:$N$18),ELEGIR({2,1},$L$9:$L$18,$N$9:$N$18),2,0)"}]
[]
[null,null,{"$f":"\"¿Quién obtuvo la 2do mejor venta?\"","v":"¿Quién obtuvo la 2do mejor venta?"}]
[null,null,"Ejercicio →",{"$nulls":3},{"$f":"VLOOKUP(LARGE($N$9:$N$18,2),CHOOSE({2,1},$L$9:$L$18,$N$9:$N$18),2,0)","v":"Jacob"}]
[null,null,{"$f":"IF(_xlfn.ISFORMULA(DO_EJER01!G26),_xlfn.FORMULATEXT(DO_EJER01!G26),\"\")","v":"=BUSCARV(K.ESIMO.MAYOR($N$9:$N$18,2),ELEGIR({2,1},$L$9:$L$18,$N$9:$N$18),2,0)"}]
[]
[null,null,{"$f":"\"¿Quién obtuvo la menor margen?\"","v":"¿Quién obtuvo la menor margen?"}]
[null,null,"Ejercicio →",{"$nulls":3},{"$f":"VLOOKUP(MIN($O$9:$O$18),CHOOSE({2,1},$L$9:$L$18,$O$9:$O$18),2,0)","v":"Eduardo"}]
[null,null,{"$f":"IF(_xlfn.ISFORMULA(DO_EJER01!G30),_xlfn.FORMULATEXT(DO_EJER01!G30),\"\")","v":"=BUSCARV(MIN($O$9:$O$18),ELEGIR({2,1},$L$9:$L$18,$O$9:$O$18),2,0)"}]
[]
[null,null,{"$f":"\"¿A quién le pertenece el promedio de venta más alto?\"","v":"¿A quién le pertenece el promedio de venta más alto?"}]
[null,null,"Ejercicio →",{"$nulls":3},{"$f":"VLOOKUP(MAX($N$9:$N$18/$M$9:$M$18),CHOOSE({2,1},$L$9:$L$18,$N$9:$N$18/$M$9:$M$18),2,0)","v":"Alberto"}]
[null,null,{"$f":"IF(_xlfn.ISFORMULA(DO_EJER01!G34),_xlfn.FORMULATEXT(DO_EJER01!G34),\"\")","v":"{=BUSCARV(MAX($N$9:$N$18/$M$9:$M$18),ELEGIR({2,1},$L$9:$L$18,$N$9:$N$18/$M$9:$M$18),2,0)}"}]