{"text_format":"3","workbook":"xlsx","n_sheets":6,"sheets":["DO_1","Calendario por años (Editable)","Dias (Editable)","Calendario Casa Matriz","DO_2","Calendario Actual"],"not_rendered":{"macros":1,"defined_names":36},"read":"whole","date_system":"1900"}

{"sheet":"DO_1","index":0,"n_rows":25,"n_cols":69,"rows_kept":25,"hidden":true}
[]
[]
[]
[{"$nulls":7},{"$f":"IF('Calendario Casa Matriz'!B5=\"\",TEXT(TODAY(),\"mmmm\"),'Calendario Casa Matriz'!B5)","v":"Agosto"},{"$nulls":3},{"$f":"UPPER(H4)&\"•\"&H17","v":"AGOSTO•2019"}]
[{"$nulls":11},"L","M","X","J","V","S","D",null,"Feriados y no laborables",{"$nulls":6},"Obligaciones mensuales",{"$nulls":6},"Feriados casa matriz",{"$nulls":14},{"$f":"L5","v":"L"},"M","X","J","V","S","D"]
[{"$nulls":11},{"$f":"f.ini+(ROWS($L$6:$L6)-1)*7+(COLUMNS($L$6:L$6)-1)","v":"2019-07-29"},{"$f":"f.ini+(ROWS($L$6:$L6)-1)*7+(COLUMNS($L$6:M$6)-1)","v":"2019-07-30"},{"$f":"f.ini+(ROWS($L$6:$L6)-1)*7+(COLUMNS($L$6:N$6)-1)","v":"2019-07-31"},{"$f":"f.ini+(ROWS($L$6:$L6)-1)*7+(COLUMNS($L$6:O$6)-1)","v":"2019-08-01"},{"$f":"f.ini+(ROWS($L$6:$L6)-1)*7+(COLUMNS($L$6:P$6)-1)","v":"2019-08-02"},{"$f":"f.ini+(ROWS($L$6:$L6)-1)*7+(COLUMNS($L$6:Q$6)-1)","v":"2019-08-03"},{"$f":"f.ini+(ROWS($L$6:$L6)-1)*7+(COLUMNS($L$6:R$6)-1)","v":"2019-08-04"},null,{"$f":"IFERROR(DAY(SMALL(IF(MONTH(t.feriados[DIA])=MONTH(DO_1!$H$18),t.feriados[DIA],\"\"),ROWS(T$6:T6))),\"\")","v":29},{"$f":"IFERROR(VLOOKUP(SMALL(IF(MONTH(t.feriados[DIA])=MONTH(DO_1!$H$18),t.feriados[DIA],\"\"),ROWS(T$6:T6)),t.feriados[],2,0),\"\")","v":"No Laborable (declarado)"},{"$nulls":5},{"$f":"IFERROR(DAY(SMALL(IF(MONTH(t.obligaciones[DIA])=MONTH(DO_1!$H$18),t.obligaciones[DIA],\"\"),ROWS(AA$6:AA6))),\"\")","v":{"v":2,"d":"02"}},{"$f":"IFERROR(VLOOKUP(SMALL(IF(MONTH(t.obligaciones[DIA])=MONTH(DO_1!$H$18),t.obligaciones[DIA],\"\"),ROWS(T$6:T6)),t.obligaciones[],2,0),\"\")","v":"Reporting"},{"$nulls":5},{"$f":"IFERROR(DAY(SMALL(IF(MONTH(t.feriados.matriz[DIA])=MONTH(DO_1!$H$18),t.feriados.matriz[DIA],\"\"),ROWS(AH$6:AH6))),\"\")","v":15},{"$f":"IFERROR(VLOOKUP(SMALL(IF(MONTH(t.feriados.matriz[DIA])=MONTH(DO_1!$H$18),t.feriados.matriz[DIA],\"\"),ROWS(AA$6:AA6)),t.feriados.matriz[],2,0),\"\")","v":"Asunción de la Virgen"},{"$nulls":13},"2019-07-29","2019-07-30","2019-07-31","2019-08-01","2019-08-02","2019-08-03","2019-08-04",null,{"$f":"T6","v":29},"No Laborable (declarado)",null,{"$f":"AA6","v":{"v":2,"d":"02"}},"Reporting",{"$nulls":3},{"$f":"AH6","v":15},"Asunción de la Virgen"]
[{"$nulls":11},{"$f":"f.ini+(ROWS($L$6:$L7)-1)*7+(COLUMNS($L$6:L$6)-1)","v":"2019-08-05"},{"$f":"f.ini+(ROWS($L$6:$L7)-1)*7+(COLUMNS($L$6:M$6)-1)","v":"2019-08-06"},{"$f":"f.ini+(ROWS($L$6:$L7)-1)*7+(COLUMNS($L$6:N$6)-1)","v":"2019-08-07"},{"$f":"f.ini+(ROWS($L$6:$L7)-1)*7+(COLUMNS($L$6:O$6)-1)","v":"2019-08-08"},{"$f":"f.ini+(ROWS($L$6:$L7)-1)*7+(COLUMNS($L$6:P$6)-1)","v":"2019-08-09"},{"$f":"f.ini+(ROWS($L$6:$L7)-1)*7+(COLUMNS($L$6:Q$6)-1)","v":"2019-08-10"},{"$f":"f.ini+(ROWS($L$6:$L7)-1)*7+(COLUMNS($L$6:R$6)-1)","v":"2019-08-11"},null,{"$f":"IFERROR(DAY(SMALL(IF(MONTH(t.feriados[DIA])=MONTH(DO_1!$H$18),t.feriados[DIA],\"\"),ROWS(T$6:T7))),\"\")","v":30},{"$f":"IFERROR(VLOOKUP(SMALL(IF(MONTH(t.feriados[DIA])=MONTH(DO_1!$H$18),t.feriados[DIA],\"\"),ROWS(T$6:T7)),t.feriados[],2,0),\"\")","v":"Santa Rosa de Lima"},{"$nulls":5},{"$f":"IFERROR(DAY(SMALL(IF(MONTH(t.obligaciones[DIA])=MONTH(DO_1!$H$18),t.obligaciones[DIA],\"\"),ROWS(AA$6:AA7))),\"\")","v":{"v":7,"d":"07"}},{"$f":"IFERROR(VLOOKUP(SMALL(IF(MONTH(t.obligaciones[DIA])=MONTH(DO_1!$H$18),t.obligaciones[DIA],\"\"),ROWS(T$6:T7)),t.obligaciones[],2,0),\"\")","v":"Declaración AFP"},{"$nulls":5},{"$f":"IFERROR(DAY(SMALL(IF(MONTH(t.feriados.matriz[DIA])=MONTH(DO_1!$H$18),t.feriados.matriz[DIA],\"\"),ROWS(AH$6:AH7))),\"\")","v":""},{"$f":"IFERROR(VLOOKUP(SMALL(IF(MONTH(t.feriados.matriz[DIA])=MONTH(DO_1!$H$18),t.feriados.matriz[DIA],\"\"),ROWS(AA$6:AA7)),t.feriados.matriz[],2,0),\"\")","v":""},{"$nulls":13},"2019-08-05","2019-08-06","2019-08-07","2019-08-08","2019-08-09","2019-08-10","2019-08-11",null,30,"Santa Rosa de Lima",null,{"v":7,"d":"07"},"Declaración AFP",{"$nulls":3},"",""]
[{"$nulls":11},{"$f":"f.ini+(ROWS($L$6:$L8)-1)*7+(COLUMNS($L$6:L$6)-1)","v":"2019-08-12"},{"$f":"f.ini+(ROWS($L$6:$L8)-1)*7+(COLUMNS($L$6:M$6)-1)","v":"2019-08-13"},{"$f":"f.ini+(ROWS($L$6:$L8)-1)*7+(COLUMNS($L$6:N$6)-1)","v":"2019-08-14"},{"$f":"f.ini+(ROWS($L$6:$L8)-1)*7+(COLUMNS($L$6:O$6)-1)","v":"2019-08-15"},{"$f":"f.ini+(ROWS($L$6:$L8)-1)*7+(COLUMNS($L$6:P$6)-1)","v":"2019-08-16"},{"$f":"f.ini+(ROWS($L$6:$L8)-1)*7+(COLUMNS($L$6:Q$6)-1)","v":"2019-08-17"},{"$f":"f.ini+(ROWS($L$6:$L8)-1)*7+(COLUMNS($L$6:R$6)-1)","v":"2019-08-18"},null,{"$f":"IFERROR(DAY(SMALL(IF(MONTH(t.feriados[DIA])=MONTH(DO_1!$H$18),t.feriados[DIA],\"\"),ROWS(T$6:T8))),\"\")","v":""},{"$f":"IFERROR(VLOOKUP(SMALL(IF(MONTH(t.feriados[DIA])=MONTH(DO_1!$H$18),t.feriados[DIA],\"\"),ROWS(T$6:T8)),t.feriados[],2,0),\"\")","v":""},{"$nulls":5},{"$f":"IFERROR(DAY(SMALL(IF(MONTH(t.obligaciones[DIA])=MONTH(DO_1!$H$18),t.obligaciones[DIA],\"\"),ROWS(AA$6:AA8))),\"\")","v":13},{"$f":"IFERROR(VLOOKUP(SMALL(IF(MONTH(t.obligaciones[DIA])=MONTH(DO_1!$H$18),t.obligaciones[DIA],\"\"),ROWS(T$6:T8)),t.obligaciones[],2,0),\"\")","v":"Libros Electrónicos"},{"$nulls":5},{"$f":"IFERROR(DAY(SMALL(IF(MONTH(t.feriados.matriz[DIA])=MONTH(DO_1!$H$18),t.feriados.matriz[DIA],\"\"),ROWS(AH$6:AH8))),\"\")","v":""},{"$f":"IFERROR(VLOOKUP(SMALL(IF(MONTH(t.feriados.matriz[DIA])=MONTH(DO_1!$H$18),t.feriados.matriz[DIA],\"\"),ROWS(AA$6:AA8)),t.feriados.matriz[],2,0),\"\")","v":""},{"$nulls":13},"2019-08-12","2019-08-13","2019-08-14","2019-08-15","2019-08-16","2019-08-17","2019-08-18",null,"","",null,13,"Libros Electrónicos",{"$nulls":3},"",""]
[{"$nulls":11},{"$f":"f.ini+(ROWS($L$6:$L9)-1)*7+(COLUMNS($L$6:L$6)-1)","v":"2019-08-19"},{"$f":"f.ini+(ROWS($L$6:$L9)-1)*7+(COLUMNS($L$6:M$6)-1)","v":"2019-08-20"},{"$f":"f.ini+(ROWS($L$6:$L9)-1)*7+(COLUMNS($L$6:N$6)-1)","v":"2019-08-21"},{"$f":"f.ini+(ROWS($L$6:$L9)-1)*7+(COLUMNS($L$6:O$6)-1)","v":"2019-08-22"},{"$f":"f.ini+(ROWS($L$6:$L9)-1)*7+(COLUMNS($L$6:P$6)-1)","v":"2019-08-23"},{"$f":"f.ini+(ROWS($L$6:$L9)-1)*7+(COLUMNS($L$6:Q$6)-1)","v":"2019-08-24"},{"$f":"f.ini+(ROWS($L$6:$L9)-1)*7+(COLUMNS($L$6:R$6)-1)","v":"2019-08-25"},null,{"$f":"IFERROR(DAY(SMALL(IF(MONTH(t.feriados[DIA])=MONTH(DO_1!$H$18),t.feriados[DIA],\"\"),ROWS(T$6:T9))),\"\")","v":""},{"$f":"IFERROR(VLOOKUP(SMALL(IF(MONTH(t.feriados[DIA])=MONTH(DO_1!$H$18),t.feriados[DIA],\"\"),ROWS(T$6:T9)),t.feriados[],2,0),\"\")","v":""},{"$nulls":5},{"$f":"IFERROR(DAY(SMALL(IF(MONTH(t.obligaciones[DIA])=MONTH(DO_1!$H$18),t.obligaciones[DIA],\"\"),ROWS(AA$6:AA9))),\"\")","v":14},{"$f":"IFERROR(VLOOKUP(SMALL(IF(MONTH(t.obligaciones[DIA])=MONTH(DO_1!$H$18),t.obligaciones[DIA],\"\"),ROWS(T$6:T9)),t.obligaciones[],2,0),\"\")","v":"Declaración SUNAT"},{"$nulls":5},{"$f":"IFERROR(DAY(SMALL(IF(MONTH(t.feriados.matriz[DIA])=MONTH(DO_1!$H$18),t.feriados.matriz[DIA],\"\"),ROWS(AH$6:AH9))),\"\")","v":""},{"$f":"IFERROR(VLOOKUP(SMALL(IF(MONTH(t.feriados.matriz[DIA])=MONTH(DO_1!$H$18),t.feriados.matriz[DIA],\"\"),ROWS(AA$6:AA9)),t.feriados.matriz[],2,0),\"\")","v":""},{"$nulls":13},"2019-08-19","2019-08-20","2019-08-21","2019-08-22","2019-08-23","2019-08-24","2019-08-25",null,"","",null,14,"Declaración SUNAT",{"$nulls":3},"",""]
[{"$nulls":11},{"$f":"f.ini+(ROWS($L$6:$L10)-1)*7+(COLUMNS($L$6:L$6)-1)","v":"2019-08-26"},{"$f":"f.ini+(ROWS($L$6:$L10)-1)*7+(COLUMNS($L$6:M$6)-1)","v":"2019-08-27"},{"$f":"f.ini+(ROWS($L$6:$L10)-1)*7+(COLUMNS($L$6:N$6)-1)","v":"2019-08-28"},{"$f":"f.ini+(ROWS($L$6:$L10)-1)*7+(COLUMNS($L$6:O$6)-1)","v":"2019-08-29"},{"$f":"f.ini+(ROWS($L$6:$L10)-1)*7+(COLUMNS($L$6:P$6)-1)","v":"2019-08-30"},{"$f":"f.ini+(ROWS($L$6:$L10)-1)*7+(COLUMNS($L$6:Q$6)-1)","v":"2019-08-31"},{"$f":"f.ini+(ROWS($L$6:$L10)-1)*7+(COLUMNS($L$6:R$6)-1)","v":"2019-09-01"},null,{"$f":"IFERROR(DAY(SMALL(IF(MONTH(t.feriados[DIA])=MONTH(DO_1!$H$18),t.feriados[DIA],\"\"),ROWS(T$6:T10))),\"\")","v":""},{"$f":"IFERROR(VLOOKUP(SMALL(IF(MONTH(t.feriados[DIA])=MONTH(DO_1!$H$18),t.feriados[DIA],\"\"),ROWS(T$6:T10)),t.feriados[],2,0),\"\")","v":""},{"$nulls":5},{"$f":"IFERROR(DAY(SMALL(IF(MONTH(t.obligaciones[DIA])=MONTH(DO_1!$H$18),t.obligaciones[DIA],\"\"),ROWS(AA$6:AA10))),\"\")","v":16},{"$f":"IFERROR(VLOOKUP(SMALL(IF(MONTH(t.obligaciones[DIA])=MONTH(DO_1!$H$18),t.obligaciones[DIA],\"\"),ROWS(T$6:T10)),t.obligaciones[],2,0),\"\")","v":"INEI"},{"$nulls":5},{"$f":"IFERROR(DAY(SMALL(IF(MONTH(t.feriados.matriz[DIA])=MONTH(DO_1!$H$18),t.feriados.matriz[DIA],\"\"),ROWS(AH$6:AH10))),\"\")","v":""},{"$f":"IFERROR(VLOOKUP(SMALL(IF(MONTH(t.feriados.matriz[DIA])=MONTH(DO_1!$H$18),t.feriados.matriz[DIA],\"\"),ROWS(AA$6:AA10)),t.feriados.matriz[],2,0),\"\")","v":""},{"$nulls":13},"2019-08-26","2019-08-27","2019-08-28","2019-08-29","2019-08-30","2019-08-31","2019-09-01",null,"","",null,16,"INEI",{"$nulls":3},"",""]
[{"$nulls":11},{"$f":"f.ini+(ROWS($L$6:$L11)-1)*7+(COLUMNS($L$6:L$6)-1)","v":"2019-09-02"},{"$f":"f.ini+(ROWS($L$6:$L11)-1)*7+(COLUMNS($L$6:M$6)-1)","v":"2019-09-03"},{"$f":"f.ini+(ROWS($L$6:$L11)-1)*7+(COLUMNS($L$6:N$6)-1)","v":"2019-09-04"},{"$f":"f.ini+(ROWS($L$6:$L11)-1)*7+(COLUMNS($L$6:O$6)-1)","v":"2019-09-05"},{"$f":"f.ini+(ROWS($L$6:$L11)-1)*7+(COLUMNS($L$6:P$6)-1)","v":"2019-09-06"},{"$f":"f.ini+(ROWS($L$6:$L11)-1)*7+(COLUMNS($L$6:Q$6)-1)","v":"2019-09-07"},{"$f":"f.ini+(ROWS($L$6:$L11)-1)*7+(COLUMNS($L$6:R$6)-1)","v":"2019-09-08"},null,{"$f":"IFERROR(DAY(SMALL(IF(MONTH(t.feriados[DIA])=MONTH(DO_1!$H$18),t.feriados[DIA],\"\"),ROWS(T$6:T11))),\"\")","v":""},{"$f":"IFERROR(VLOOKUP(SMALL(IF(MONTH(t.feriados[DIA])=MONTH(DO_1!$H$18),t.feriados[DIA],\"\"),ROWS(T$6:T11)),t.feriados[],2,0),\"\")","v":""},{"$nulls":5},{"$f":"IFERROR(DAY(SMALL(IF(MONTH(t.obligaciones[DIA])=MONTH(DO_1!$H$18),t.obligaciones[DIA],\"\"),ROWS(AA$6:AA11))),\"\")","v":""},{"$f":"IFERROR(VLOOKUP(SMALL(IF(MONTH(t.obligaciones[DIA])=MONTH(DO_1!$H$18),t.obligaciones[DIA],\"\"),ROWS(T$6:T11)),t.obligaciones[],2,0),\"\")","v":""},{"$nulls":5},{"$f":"IFERROR(DAY(SMALL(IF(MONTH(t.feriados.matriz[DIA])=MONTH(DO_1!$H$18),t.feriados.matriz[DIA],\"\"),ROWS(AH$6:AH11))),\"\")","v":""},{"$f":"IFERROR(VLOOKUP(SMALL(IF(MONTH(t.feriados.matriz[DIA])=MONTH(DO_1!$H$18),t.feriados.matriz[DIA],\"\"),ROWS(AA$6:AA11)),t.feriados.matriz[],2,0),\"\")","v":""},{"$nulls":13},"2019-09-02","2019-09-03","2019-09-04","2019-09-05","2019-09-06","2019-09-07","2019-09-08",null,"","",null,"","",{"$nulls":3},"",""]
[]
[{"$nulls":11},{"$f":"MONTH(DATEVALUE(\"01/\"&SUBSTITUTE($L$15,\"•\",\"/\")))","v":7},7,7,7,7,7,7,{"$f":"MONTH(DATEVALUE(\"01/\"&SUBSTITUTE($S$15,\"•\",\"/\")))","v":8},8,8,8,8,8,8,{"$f":"MONTH(DATEVALUE(\"01/\"&SUBSTITUTE($Z$15,\"•\",\"/\")))","v":9},9,9,9,9,9,9]
[null,{"$f":"PROPER(TEXT(DATE($H$17,ROWS(B$14:B14),1),\"mmmm\"))","v":"Enero"}]
[null,{"$f":"PROPER(TEXT(DATE($H$17,ROWS(B$14:B15),1),\"mmmm\"))","v":"Febrero"},{"$nulls":9},{"$f":"UPPER(D16)&\"•\"&D17","v":"JULIO•2019"},{"$nulls":6},{"$f":"UPPER(H4)&\"•\"&H17","v":"AGOSTO•2019"},{"$nulls":6},{"$f":"UPPER(D18)&\"•\"&IF(D18=\"enero\",1,0)+H17","v":"SEPTIEMBRE•2019"}]
[null,{"$f":"PROPER(TEXT(DATE($H$17,ROWS(B$14:B16),1),\"mmmm\"))","v":"Marzo"},null,{"$f":"TEXT(G18,\"mmmm\")","v":"julio"},{"$nulls":7},"L","M","X","J","V","S","D","L","M","X","J","V","S","D","L","M","X","J","V","S","D",{"$nulls":16},{"$f":"L16","v":"L"},"M","X","J","V","S","D","L","M","X",{"$f":"V16","v":"J"},"V","S","D","L","M","X","J","V","S",{"$f":"AF16","v":"D"}]
[null,{"$f":"PROPER(TEXT(DATE($H$17,ROWS(B$14:B17),1),\"mmmm\"))","v":"Abril"},null,{"$f":"YEAR(G18)","v":2019},{"$nulls":3},2019,{"$nulls":3},{"$f":"f.a.ini+(ROWS($L$17:$L17)-1)*7+(COLUMNS($L$17:L$17)-1)","v":"2019-07-01"},{"$f":"f.a.ini+(ROWS($L$17:$L17)-1)*7+(COLUMNS($L$17:M$17)-1)","v":"2019-07-02"},{"$f":"f.a.ini+(ROWS($L$17:$L17)-1)*7+(COLUMNS($L$17:N$17)-1)","v":"2019-07-03"},{"$f":"f.a.ini+(ROWS($L$17:$L17)-1)*7+(COLUMNS($L$17:O$17)-1)","v":"2019-07-04"},{"$f":"f.a.ini+(ROWS($L$17:$L17)-1)*7+(COLUMNS($L$17:P$17)-1)","v":"2019-07-05"},{"$f":"f.a.ini+(ROWS($L$17:$L17)-1)*7+(COLUMNS($L$17:Q$17)-1)","v":"2019-07-06"},{"$f":"f.a.ini+(ROWS($L$17:$L17)-1)*7+(COLUMNS($L$17:R$17)-1)","v":"2019-07-07"},{"$f":"f.ini+(ROWS($S$17:$S17)-1)*7+(COLUMNS($S$17:S$17)-1)","v":"2019-07-29"},{"$f":"f.ini+(ROWS($S$17:$S17)-1)*7+(COLUMNS($S$17:T$17)-1)","v":"2019-07-30"},{"$f":"f.ini+(ROWS($S$17:$S17)-1)*7+(COLUMNS($S$17:U$17)-1)","v":"2019-07-31"},{"$f":"f.ini+(ROWS($S$17:$S17)-1)*7+(COLUMNS($S$17:V$17)-1)","v":"2019-08-01"},{"$f":"f.ini+(ROWS($S$17:$S17)-1)*7+(COLUMNS($S$17:W$17)-1)","v":"2019-08-02"},{"$f":"f.ini+(ROWS($S$17:$S17)-1)*7+(COLUMNS($S$17:X$17)-1)","v":"2019-08-03"},{"$f":"f.ini+(ROWS($S$17:$S17)-1)*7+(COLUMNS($S$17:Y$17)-1)","v":"2019-08-04"},{"$f":"f.a2.ini+(ROWS($S$17:$S17)-1)*7+(COLUMNS($S$17:S$17)-1)","v":"2019-08-26"},{"$f":"f.a2.ini+(ROWS($S$17:$S17)-1)*7+(COLUMNS($S$17:T$17)-1)","v":"2019-08-27"},{"$f":"f.a2.ini+(ROWS($S$17:$S17)-1)*7+(COLUMNS($S$17:U$17)-1)","v":"2019-08-28"},{"$f":"f.a2.ini+(ROWS($S$17:$S17)-1)*7+(COLUMNS($S$17:V$17)-1)","v":"2019-08-29"},{"$f":"f.a2.ini+(ROWS($S$17:$S17)-1)*7+(COLUMNS($S$17:W$17)-1)","v":"2019-08-30"},{"$f":"f.a2.ini+(ROWS($S$17:$S17)-1)*7+(COLUMNS($S$17:X$17)-1)","v":"2019-08-31"},{"$f":"f.a2.ini+(ROWS($S$17:$S17)-1)*7+(COLUMNS($S$17:Y$17)-1)","v":"2019-09-01"},{"$nulls":16},"2019-07-01","2019-07-02","2019-07-03","2019-07-04","2019-07-05","2019-07-06","2019-07-07","2019-07-29","2019-07-30","2019-07-31","2019-08-01","2019-08-02","2019-08-03","2019-08-04","2019-08-26","2019-08-27","2019-08-28","2019-08-29","2019-08-30","2019-08-31","2019-09-01"]
[null,{"$f":"PROPER(TEXT(DATE($H$17,ROWS(B$14:B18),1),\"mmmm\"))","v":"Mayo"},null,{"$f":"INDEX($B$14:$B$25,IF(MATCH(H4,$B$14:$B$25,0)+1=13,1,MATCH(H4,$B$14:$B$25,0)+1))","v":"Septiembre"},null,null,{"$f":"EOMONTH(DATE($H$17,MATCH($H$4,$B$14:$B$25,0),1),-2)+1","v":"2019-07-01"},{"$f":"DATE($H$17,MATCH($H$4,$B$14:$B$25,0),1)","v":"2019-08-01"},{"$f":"EOMONTH(DATE($H$17,MATCH($H$4,$B$14:$B$25,0),1),0)+1","v":"2019-09-01"},null,null,{"$f":"f.a.ini+(ROWS($L$17:$L18)-1)*7+(COLUMNS($L$17:L$17)-1)","v":"2019-07-08"},{"$f":"f.a.ini+(ROWS($L$17:$L18)-1)*7+(COLUMNS($L$17:M$17)-1)","v":"2019-07-09"},{"$f":"f.a.ini+(ROWS($L$17:$L18)-1)*7+(COLUMNS($L$17:N$17)-1)","v":"2019-07-10"},{"$f":"f.a.ini+(ROWS($L$17:$L18)-1)*7+(COLUMNS($L$17:O$17)-1)","v":"2019-07-11"},{"$f":"f.a.ini+(ROWS($L$17:$L18)-1)*7+(COLUMNS($L$17:P$17)-1)","v":"2019-07-12"},{"$f":"f.a.ini+(ROWS($L$17:$L18)-1)*7+(COLUMNS($L$17:Q$17)-1)","v":"2019-07-13"},{"$f":"f.a.ini+(ROWS($L$17:$L18)-1)*7+(COLUMNS($L$17:R$17)-1)","v":"2019-07-14"},{"$f":"f.ini+(ROWS($S$17:$S18)-1)*7+(COLUMNS($S$17:S$17)-1)","v":"2019-08-05"},{"$f":"f.ini+(ROWS($S$17:$S18)-1)*7+(COLUMNS($S$17:T$17)-1)","v":"2019-08-06"},{"$f":"f.ini+(ROWS($S$17:$S18)-1)*7+(COLUMNS($S$17:U$17)-1)","v":"2019-08-07"},{"$f":"f.ini+(ROWS($S$17:$S18)-1)*7+(COLUMNS($S$17:V$17)-1)","v":"2019-08-08"},{"$f":"f.ini+(ROWS($S$17:$S18)-1)*7+(COLUMNS($S$17:W$17)-1)","v":"2019-08-09"},{"$f":"f.ini+(ROWS($S$17:$S18)-1)*7+(COLUMNS($S$17:X$17)-1)","v":"2019-08-10"},{"$f":"f.ini+(ROWS($S$17:$S18)-1)*7+(COLUMNS($S$17:Y$17)-1)","v":"2019-08-11"},{"$f":"f.a2.ini+(ROWS($S$17:$S18)-1)*7+(COLUMNS($S$17:S$17)-1)","v":"2019-09-02"},{"$f":"f.a2.ini+(ROWS($S$17:$S18)-1)*7+(COLUMNS($S$17:T$17)-1)","v":"2019-09-03"},{"$f":"f.a2.ini+(ROWS($S$17:$S18)-1)*7+(COLUMNS($S$17:U$17)-1)","v":"2019-09-04"},{"$f":"f.a2.ini+(ROWS($S$17:$S18)-1)*7+(COLUMNS($S$17:V$17)-1)","v":"2019-09-05"},{"$f":"f.a2.ini+(ROWS($S$17:$S18)-1)*7+(COLUMNS($S$17:W$17)-1)","v":"2019-09-06"},{"$f":"f.a2.ini+(ROWS($S$17:$S18)-1)*7+(COLUMNS($S$17:X$17)-1)","v":"2019-09-07"},{"$f":"f.a2.ini+(ROWS($S$17:$S18)-1)*7+(COLUMNS($S$17:Y$17)-1)","v":"2019-09-08"},{"$nulls":16},"2019-07-08","2019-07-09","2019-07-10","2019-07-11","2019-07-12","2019-07-13","2019-07-14","2019-08-05","2019-08-06","2019-08-07","2019-08-08","2019-08-09","2019-08-10","2019-08-11","2019-09-02","2019-09-03","2019-09-04","2019-09-05","2019-09-06","2019-09-07","2019-09-08"]
[null,{"$f":"PROPER(TEXT(DATE($H$17,ROWS(B$14:B19),1),\"mmmm\"))","v":"Junio"},{"$nulls":4},{"$f":"WEEKDAY(G18,2)","v":1},{"$f":"WEEKDAY(H18,2)","v":4},{"$f":"WEEKDAY(I18,2)","v":7},null,null,{"$f":"f.a.ini+(ROWS($L$17:$L19)-1)*7+(COLUMNS($L$17:L$17)-1)","v":"2019-07-15"},{"$f":"f.a.ini+(ROWS($L$17:$L19)-1)*7+(COLUMNS($L$17:M$17)-1)","v":"2019-07-16"},{"$f":"f.a.ini+(ROWS($L$17:$L19)-1)*7+(COLUMNS($L$17:N$17)-1)","v":"2019-07-17"},{"$f":"f.a.ini+(ROWS($L$17:$L19)-1)*7+(COLUMNS($L$17:O$17)-1)","v":"2019-07-18"},{"$f":"f.a.ini+(ROWS($L$17:$L19)-1)*7+(COLUMNS($L$17:P$17)-1)","v":"2019-07-19"},{"$f":"f.a.ini+(ROWS($L$17:$L19)-1)*7+(COLUMNS($L$17:Q$17)-1)","v":"2019-07-20"},{"$f":"f.a.ini+(ROWS($L$17:$L19)-1)*7+(COLUMNS($L$17:R$17)-1)","v":"2019-07-21"},{"$f":"f.ini+(ROWS($S$17:$S19)-1)*7+(COLUMNS($S$17:S$17)-1)","v":"2019-08-12"},{"$f":"f.ini+(ROWS($S$17:$S19)-1)*7+(COLUMNS($S$17:T$17)-1)","v":"2019-08-13"},{"$f":"f.ini+(ROWS($S$17:$S19)-1)*7+(COLUMNS($S$17:U$17)-1)","v":"2019-08-14"},{"$f":"f.ini+(ROWS($S$17:$S19)-1)*7+(COLUMNS($S$17:V$17)-1)","v":"2019-08-15"},{"$f":"f.ini+(ROWS($S$17:$S19)-1)*7+(COLUMNS($S$17:W$17)-1)","v":"2019-08-16"},{"$f":"f.ini+(ROWS($S$17:$S19)-1)*7+(COLUMNS($S$17:X$17)-1)","v":"2019-08-17"},{"$f":"f.ini+(ROWS($S$17:$S19)-1)*7+(COLUMNS($S$17:Y$17)-1)","v":"2019-08-18"},{"$f":"f.a2.ini+(ROWS($S$17:$S19)-1)*7+(COLUMNS($S$17:S$17)-1)","v":"2019-09-09"},{"$f":"f.a2.ini+(ROWS($S$17:$S19)-1)*7+(COLUMNS($S$17:T$17)-1)","v":"2019-09-10"},{"$f":"f.a2.ini+(ROWS($S$17:$S19)-1)*7+(COLUMNS($S$17:U$17)-1)","v":"2019-09-11"},{"$f":"f.a2.ini+(ROWS($S$17:$S19)-1)*7+(COLUMNS($S$17:V$17)-1)","v":"2019-09-12"},{"$f":"f.a2.ini+(ROWS($S$17:$S19)-1)*7+(COLUMNS($S$17:W$17)-1)","v":"2019-09-13"},{"$f":"f.a2.ini+(ROWS($S$17:$S19)-1)*7+(COLUMNS($S$17:X$17)-1)","v":"2019-09-14"},{"$f":"f.a2.ini+(ROWS($S$17:$S19)-1)*7+(COLUMNS($S$17:Y$17)-1)","v":"2019-09-15"},{"$nulls":16},"2019-07-15","2019-07-16","2019-07-17","2019-07-18","2019-07-19","2019-07-20","2019-07-21","2019-08-12","2019-08-13","2019-08-14","2019-08-15","2019-08-16","2019-08-17","2019-08-18","2019-09-09","2019-09-10","2019-09-11","2019-09-12","2019-09-13","2019-09-14","2019-09-15"]
[null,{"$f":"PROPER(TEXT(DATE($H$17,ROWS(B$14:B20),1),\"mmmm\"))","v":"Julio"},{"$nulls":4},{"$f":"G18-G19+1","v":"2019-07-01"},{"$f":"H18-H19+1","v":"2019-07-29"},{"$f":"I18-I19+1","v":"2019-08-26"},null,null,{"$f":"f.a.ini+(ROWS($L$17:$L20)-1)*7+(COLUMNS($L$17:L$17)-1)","v":"2019-07-22"},{"$f":"f.a.ini+(ROWS($L$17:$L20)-1)*7+(COLUMNS($L$17:M$17)-1)","v":"2019-07-23"},{"$f":"f.a.ini+(ROWS($L$17:$L20)-1)*7+(COLUMNS($L$17:N$17)-1)","v":"2019-07-24"},{"$f":"f.a.ini+(ROWS($L$17:$L20)-1)*7+(COLUMNS($L$17:O$17)-1)","v":"2019-07-25"},{"$f":"f.a.ini+(ROWS($L$17:$L20)-1)*7+(COLUMNS($L$17:P$17)-1)","v":"2019-07-26"},{"$f":"f.a.ini+(ROWS($L$17:$L20)-1)*7+(COLUMNS($L$17:Q$17)-1)","v":"2019-07-27"},{"$f":"f.a.ini+(ROWS($L$17:$L20)-1)*7+(COLUMNS($L$17:R$17)-1)","v":"2019-07-28"},{"$f":"f.ini+(ROWS($S$17:$S20)-1)*7+(COLUMNS($S$17:S$17)-1)","v":"2019-08-19"},{"$f":"f.ini+(ROWS($S$17:$S20)-1)*7+(COLUMNS($S$17:T$17)-1)","v":"2019-08-20"},{"$f":"f.ini+(ROWS($S$17:$S20)-1)*7+(COLUMNS($S$17:U$17)-1)","v":"2019-08-21"},{"$f":"f.ini+(ROWS($S$17:$S20)-1)*7+(COLUMNS($S$17:V$17)-1)","v":"2019-08-22"},{"$f":"f.ini+(ROWS($S$17:$S20)-1)*7+(COLUMNS($S$17:W$17)-1)","v":"2019-08-23"},{"$f":"f.ini+(ROWS($S$17:$S20)-1)*7+(COLUMNS($S$17:X$17)-1)","v":"2019-08-24"},{"$f":"f.ini+(ROWS($S$17:$S20)-1)*7+(COLUMNS($S$17:Y$17)-1)","v":"2019-08-25"},{"$f":"f.a2.ini+(ROWS($S$17:$S20)-1)*7+(COLUMNS($S$17:S$17)-1)","v":"2019-09-16"},{"$f":"f.a2.ini+(ROWS($S$17:$S20)-1)*7+(COLUMNS($S$17:T$17)-1)","v":"2019-09-17"},{"$f":"f.a2.ini+(ROWS($S$17:$S20)-1)*7+(COLUMNS($S$17:U$17)-1)","v":"2019-09-18"},{"$f":"f.a2.ini+(ROWS($S$17:$S20)-1)*7+(COLUMNS($S$17:V$17)-1)","v":"2019-09-19"},{"$f":"f.a2.ini+(ROWS($S$17:$S20)-1)*7+(COLUMNS($S$17:W$17)-1)","v":"2019-09-20"},{"$f":"f.a2.ini+(ROWS($S$17:$S20)-1)*7+(COLUMNS($S$17:X$17)-1)","v":"2019-09-21"},{"$f":"f.a2.ini+(ROWS($S$17:$S20)-1)*7+(COLUMNS($S$17:Y$17)-1)","v":"2019-09-22"},{"$nulls":16},"2019-07-22","2019-07-23","2019-07-24","2019-07-25","2019-07-26","2019-07-27","2019-07-28","2019-08-19","2019-08-20","2019-08-21","2019-08-22","2019-08-23","2019-08-24","2019-08-25","2019-09-16","2019-09-17","2019-09-18","2019-09-19","2019-09-20","2019-09-21","2019-09-22"]
[null,{"$f":"PROPER(TEXT(DATE($H$17,ROWS(B$14:B21),1),\"mmmm\"))","v":"Agosto"},{"$nulls":9},{"$f":"f.a.ini+(ROWS($L$17:$L21)-1)*7+(COLUMNS($L$17:L$17)-1)","v":"2019-07-29"},{"$f":"f.a.ini+(ROWS($L$17:$L21)-1)*7+(COLUMNS($L$17:M$17)-1)","v":"2019-07-30"},{"$f":"f.a.ini+(ROWS($L$17:$L21)-1)*7+(COLUMNS($L$17:N$17)-1)","v":"2019-07-31"},{"$f":"f.a.ini+(ROWS($L$17:$L21)-1)*7+(COLUMNS($L$17:O$17)-1)","v":"2019-08-01"},{"$f":"f.a.ini+(ROWS($L$17:$L21)-1)*7+(COLUMNS($L$17:P$17)-1)","v":"2019-08-02"},{"$f":"f.a.ini+(ROWS($L$17:$L21)-1)*7+(COLUMNS($L$17:Q$17)-1)","v":"2019-08-03"},{"$f":"f.a.ini+(ROWS($L$17:$L21)-1)*7+(COLUMNS($L$17:R$17)-1)","v":"2019-08-04"},{"$f":"f.ini+(ROWS($S$17:$S21)-1)*7+(COLUMNS($S$17:S$17)-1)","v":"2019-08-26"},{"$f":"f.ini+(ROWS($S$17:$S21)-1)*7+(COLUMNS($S$17:T$17)-1)","v":"2019-08-27"},{"$f":"f.ini+(ROWS($S$17:$S21)-1)*7+(COLUMNS($S$17:U$17)-1)","v":"2019-08-28"},{"$f":"f.ini+(ROWS($S$17:$S21)-1)*7+(COLUMNS($S$17:V$17)-1)","v":"2019-08-29"},{"$f":"f.ini+(ROWS($S$17:$S21)-1)*7+(COLUMNS($S$17:W$17)-1)","v":"2019-08-30"},{"$f":"f.ini+(ROWS($S$17:$S21)-1)*7+(COLUMNS($S$17:X$17)-1)","v":"2019-08-31"},{"$f":"f.ini+(ROWS($S$17:$S21)-1)*7+(COLUMNS($S$17:Y$17)-1)","v":"2019-09-01"},{"$f":"f.a2.ini+(ROWS($S$17:$S21)-1)*7+(COLUMNS($S$17:S$17)-1)","v":"2019-09-23"},{"$f":"f.a2.ini+(ROWS($S$17:$S21)-1)*7+(COLUMNS($S$17:T$17)-1)","v":"2019-09-24"},{"$f":"f.a2.ini+(ROWS($S$17:$S21)-1)*7+(COLUMNS($S$17:U$17)-1)","v":"2019-09-25"},{"$f":"f.a2.ini+(ROWS($S$17:$S21)-1)*7+(COLUMNS($S$17:V$17)-1)","v":"2019-09-26"},{"$f":"f.a2.ini+(ROWS($S$17:$S21)-1)*7+(COLUMNS($S$17:W$17)-1)","v":"2019-09-27"},{"$f":"f.a2.ini+(ROWS($S$17:$S21)-1)*7+(COLUMNS($S$17:X$17)-1)","v":"2019-09-28"},{"$f":"f.a2.ini+(ROWS($S$17:$S21)-1)*7+(COLUMNS($S$17:Y$17)-1)","v":"2019-09-29"},{"$nulls":16},"2019-07-29","2019-07-30","2019-07-31","2019-08-01","2019-08-02","2019-08-03","2019-08-04","2019-08-26","2019-08-27","2019-08-28","2019-08-29","2019-08-30","2019-08-31","2019-09-01","2019-09-23","2019-09-24","2019-09-25","2019-09-26","2019-09-27","2019-09-28","2019-09-29"]
[null,{"$f":"PROPER(TEXT(DATE($H$17,ROWS(B$14:B22),1),\"mmmm\"))","v":"Septiembre"},{"$nulls":9},{"$f":"f.a.ini+(ROWS($L$17:$L22)-1)*7+(COLUMNS($L$17:L$17)-1)","v":"2019-08-05"},{"$f":"f.a.ini+(ROWS($L$17:$L22)-1)*7+(COLUMNS($L$17:M$17)-1)","v":"2019-08-06"},{"$f":"f.a.ini+(ROWS($L$17:$L22)-1)*7+(COLUMNS($L$17:N$17)-1)","v":"2019-08-07"},{"$f":"f.a.ini+(ROWS($L$17:$L22)-1)*7+(COLUMNS($L$17:O$17)-1)","v":"2019-08-08"},{"$f":"f.a.ini+(ROWS($L$17:$L22)-1)*7+(COLUMNS($L$17:P$17)-1)","v":"2019-08-09"},{"$f":"f.a.ini+(ROWS($L$17:$L22)-1)*7+(COLUMNS($L$17:Q$17)-1)","v":"2019-08-10"},{"$f":"f.a.ini+(ROWS($L$17:$L22)-1)*7+(COLUMNS($L$17:R$17)-1)","v":"2019-08-11"},{"$f":"f.ini+(ROWS($S$17:$S22)-1)*7+(COLUMNS($S$17:S$17)-1)","v":"2019-09-02"},{"$f":"f.ini+(ROWS($S$17:$S22)-1)*7+(COLUMNS($S$17:T$17)-1)","v":"2019-09-03"},{"$f":"f.ini+(ROWS($S$17:$S22)-1)*7+(COLUMNS($S$17:U$17)-1)","v":"2019-09-04"},{"$f":"f.ini+(ROWS($S$17:$S22)-1)*7+(COLUMNS($S$17:V$17)-1)","v":"2019-09-05"},{"$f":"f.ini+(ROWS($S$17:$S22)-1)*7+(COLUMNS($S$17:W$17)-1)","v":"2019-09-06"},{"$f":"f.ini+(ROWS($S$17:$S22)-1)*7+(COLUMNS($S$17:X$17)-1)","v":"2019-09-07"},{"$f":"f.ini+(ROWS($S$17:$S22)-1)*7+(COLUMNS($S$17:Y$17)-1)","v":"2019-09-08"},{"$f":"f.a2.ini+(ROWS($S$17:$S22)-1)*7+(COLUMNS($S$17:S$17)-1)","v":"2019-09-30"},{"$f":"f.a2.ini+(ROWS($S$17:$S22)-1)*7+(COLUMNS($S$17:T$17)-1)","v":"2019-10-01"},{"$f":"f.a2.ini+(ROWS($S$17:$S22)-1)*7+(COLUMNS($S$17:U$17)-1)","v":"2019-10-02"},{"$f":"f.a2.ini+(ROWS($S$17:$S22)-1)*7+(COLUMNS($S$17:V$17)-1)","v":"2019-10-03"},{"$f":"f.a2.ini+(ROWS($S$17:$S22)-1)*7+(COLUMNS($S$17:W$17)-1)","v":"2019-10-04"},{"$f":"f.a2.ini+(ROWS($S$17:$S22)-1)*7+(COLUMNS($S$17:X$17)-1)","v":"2019-10-05"},{"$f":"f.a2.ini+(ROWS($S$17:$S22)-1)*7+(COLUMNS($S$17:Y$17)-1)","v":"2019-10-06"},{"$nulls":16},"2019-08-05","2019-08-06","2019-08-07","2019-08-08","2019-08-09","2019-08-10","2019-08-11","2019-09-02","2019-09-03","2019-09-04","2019-09-05","2019-09-06","2019-09-07","2019-09-08","2019-09-30","2019-10-01","2019-10-02","2019-10-03","2019-10-04","2019-10-05","2019-10-06"]
[null,{"$f":"PROPER(TEXT(DATE($H$17,ROWS(B$14:B23),1),\"mmmm\"))","v":"Octubre"}]
[null,{"$f":"PROPER(TEXT(DATE($H$17,ROWS(B$14:B24),1),\"mmmm\"))","v":"Noviembre"}]
[null,{"$f":"PROPER(TEXT(DATE($H$17,ROWS(B$14:B25),1),\"mmmm\"))","v":"Diciembre"}]

{"sheet":"Calendario por años (Editable)","index":1,"n_rows":43,"n_cols":32,"rows_kept":43,"merged":[[3,1,3,3],[4,1,4,3],[6,1,6,23],[8,1,8,6],[8,9,8,14],[8,17,8,22],[17,1,17,6],[17,9,17,14],[17,17,17,22],[26,1,26,6],[26,9,26,14],[26,17,26,22],[35,1,35,6],[35,9,35,14],[35,17,35,22]]}
[null,"Calendario Anual"]
[null,"MOS Expert - CPC Martín Cruz - +51 998401784"]
[]
[null,"Indique el año"]
[null,2020]
[]
[null,{"$f":"\"Calendario [ \"&B5&\" ]\"","v":"Calendario [ 2020 ]"}]
[]
[null,{"$f":"\"Enero\"&\" • \"&IF($B$5=\"\",YEAR(TODAY()),B5)","v":"Enero • 2020"},{"$nulls":5},1,null,{"$f":"\"Febrero\"&\" • \"&IF($B$5=\"\",YEAR(TODAY()),B5)","v":"Febrero • 2020"},{"$nulls":5},2,null,{"$f":"\"Marzo\"&\" • \"&IF($B$5=\"\",YEAR(TODAY()),B5)","v":"Marzo • 2020"},{"$nulls":5},3]
[null,"Lu","Ma","Mi","Ju","Vi","Sá","Do",null,"Lu","Ma","Mi","Ju","Vi","Sá","Do",null,"Lu","Ma","Mi","Ju","Vi","Sá","Do"]
[null,{"$f":"(DATEVALUE(\"01/\"&H9&\"/\"&B5)-WEEKDAY(DATEVALUE(\"01/\"&H9&\"/\"&B5),2)+1)+Z11","v":"2019-12-30"},{"$f":"(DATEVALUE(\"01/\"&H9&\"/\"&B5)-WEEKDAY(DATEVALUE(\"01/\"&H9&\"/\"&B5),2)+1)+AA11","v":"2019-12-31"},{"$f":"(DATEVALUE(\"01/\"&H9&\"/\"&B5)-WEEKDAY(DATEVALUE(\"01/\"&H9&\"/\"&B5),2)+1)+AB11","v":"2020-01-01"},{"$f":"(DATEVALUE(\"01/\"&H9&\"/\"&B5)-WEEKDAY(DATEVALUE(\"01/\"&H9&\"/\"&B5),2)+1)+AC11","v":"2020-01-02"},{"$f":"(DATEVALUE(\"01/\"&H9&\"/\"&B5)-WEEKDAY(DATEVALUE(\"01/\"&H9&\"/\"&B5),2)+1)+AD11","v":"2020-01-03"},{"$f":"(DATEVALUE(\"01/\"&H9&\"/\"&B5)-WEEKDAY(DATEVALUE(\"01/\"&H9&\"/\"&B5),2)+1)+AE11","v":"2020-01-04"},{"$f":"(DATEVALUE(\"01/\"&H9&\"/\"&B5)-WEEKDAY(DATEVALUE(\"01/\"&H9&\"/\"&B5),2)+1)+AF11","v":"2020-01-05"},null,{"$f":"(DATEVALUE(\"01/\"&P9&\"/\"&B5)-WEEKDAY(DATEVALUE(\"01/\"&P9&\"/\"&B5),2)+1)+Z11","v":"2020-01-27"},{"$f":"(DATEVALUE(\"01/\"&P9&\"/\"&B5)-WEEKDAY(DATEVALUE(\"01/\"&P9&\"/\"&B5),2)+1)+AA11","v":"2020-01-28"},{"$f":"(DATEVALUE(\"01/\"&P9&\"/\"&B5)-WEEKDAY(DATEVALUE(\"01/\"&P9&\"/\"&B5),2)+1)+AB11","v":"2020-01-29"},{"$f":"(DATEVALUE(\"01/\"&P9&\"/\"&B5)-WEEKDAY(DATEVALUE(\"01/\"&P9&\"/\"&B5),2)+1)+AC11","v":"2020-01-30"},{"$f":"(DATEVALUE(\"01/\"&P9&\"/\"&B5)-WEEKDAY(DATEVALUE(\"01/\"&P9&\"/\"&B5),2)+1)+AD11","v":"2020-01-31"},{"$f":"(DATEVALUE(\"01/\"&P9&\"/\"&B5)-WEEKDAY(DATEVALUE(\"01/\"&P9&\"/\"&B5),2)+1)+AE11","v":"2020-02-01"},{"$f":"(DATEVALUE(\"01/\"&P9&\"/\"&B5)-WEEKDAY(DATEVALUE(\"01/\"&P9&\"/\"&B5),2)+1)+AF11","v":"2020-02-02"},null,{"$f":"(DATEVALUE(\"01/\"&X9&\"/\"&B5)-WEEKDAY(DATEVALUE(\"01/\"&X9&\"/\"&B5),2)+1)+Z11","v":"2020-02-24"},{"$f":"(DATEVALUE(\"01/\"&X9&\"/\"&B5)-WEEKDAY(DATEVALUE(\"01/\"&X9&\"/\"&B5),2)+1)+AA11","v":"2020-02-25"},{"$f":"(DATEVALUE(\"01/\"&X9&\"/\"&B5)-WEEKDAY(DATEVALUE(\"01/\"&X9&\"/\"&B5),2)+1)+AB11","v":"2020-02-26"},{"$f":"(DATEVALUE(\"01/\"&X9&\"/\"&B5)-WEEKDAY(DATEVALUE(\"01/\"&X9&\"/\"&B5),2)+1)+AC11","v":"2020-02-27"},{"$f":"(DATEVALUE(\"01/\"&X9&\"/\"&B5)-WEEKDAY(DATEVALUE(\"01/\"&X9&\"/\"&B5),2)+1)+AD11","v":"2020-02-28"},{"$f":"(DATEVALUE(\"01/\"&X9&\"/\"&B5)-WEEKDAY(DATEVALUE(\"01/\"&X9&\"/\"&B5),2)+1)+AE11","v":"2020-02-29"},{"$f":"(DATEVALUE(\"01/\"&X9&\"/\"&B5)-WEEKDAY(DATEVALUE(\"01/\"&X9&\"/\"&B5),2)+1)+AF11","v":"2020-03-01"},null,0,1,2,3,4,5,6]
[null,{"$f":"(DATEVALUE(\"01/\"&H9&\"/\"&B5)-WEEKDAY(DATEVALUE(\"01/\"&H9&\"/\"&B5),2)+1)+Z12","v":"2020-01-06"},{"$f":"(DATEVALUE(\"01/\"&H9&\"/\"&B5)-WEEKDAY(DATEVALUE(\"01/\"&H9&\"/\"&B5),2)+1)+AA12","v":"2020-01-07"},{"$f":"(DATEVALUE(\"01/\"&H9&\"/\"&B5)-WEEKDAY(DATEVALUE(\"01/\"&H9&\"/\"&B5),2)+1)+AB12","v":"2020-01-08"},{"$f":"(DATEVALUE(\"01/\"&H9&\"/\"&B5)-WEEKDAY(DATEVALUE(\"01/\"&H9&\"/\"&B5),2)+1)+AC12","v":"2020-01-09"},{"$f":"(DATEVALUE(\"01/\"&H9&\"/\"&B5)-WEEKDAY(DATEVALUE(\"01/\"&H9&\"/\"&B5),2)+1)+AD12","v":"2020-01-10"},{"$f":"(DATEVALUE(\"01/\"&H9&\"/\"&B5)-WEEKDAY(DATEVALUE(\"01/\"&H9&\"/\"&B5),2)+1)+AE12","v":"2020-01-11"},{"$f":"(DATEVALUE(\"01/\"&H9&\"/\"&B5)-WEEKDAY(DATEVALUE(\"01/\"&H9&\"/\"&B5),2)+1)+AF12","v":"2020-01-12"},null,{"$f":"(DATEVALUE(\"01/\"&P9&\"/\"&B5)-WEEKDAY(DATEVALUE(\"01/\"&P9&\"/\"&B5),2)+1)+Z12","v":"2020-02-03"},{"$f":"(DATEVALUE(\"01/\"&P9&\"/\"&B5)-WEEKDAY(DATEVALUE(\"01/\"&P9&\"/\"&B5),2)+1)+AA12","v":"2020-02-04"},{"$f":"(DATEVALUE(\"01/\"&P9&\"/\"&B5)-WEEKDAY(DATEVALUE(\"01/\"&P9&\"/\"&B5),2)+1)+AB12","v":"2020-02-05"},{"$f":"(DATEVALUE(\"01/\"&P9&\"/\"&B5)-WEEKDAY(DATEVALUE(\"01/\"&P9&\"/\"&B5),2)+1)+AC12","v":"2020-02-06"},{"$f":"(DATEVALUE(\"01/\"&P9&\"/\"&B5)-WEEKDAY(DATEVALUE(\"01/\"&P9&\"/\"&B5),2)+1)+AD12","v":"2020-02-07"},{"$f":"(DATEVALUE(\"01/\"&P9&\"/\"&B5)-WEEKDAY(DATEVALUE(\"01/\"&P9&\"/\"&B5),2)+1)+AE12","v":"2020-02-08"},{"$f":"(DATEVALUE(\"01/\"&P9&\"/\"&B5)-WEEKDAY(DATEVALUE(\"01/\"&P9&\"/\"&B5),2)+1)+AF12","v":"2020-02-09"},null,{"$f":"(DATEVALUE(\"01/\"&X9&\"/\"&B5)-WEEKDAY(DATEVALUE(\"01/\"&X9&\"/\"&B5),2)+1)+Z12","v":"2020-03-02"},{"$f":"(DATEVALUE(\"01/\"&X9&\"/\"&B5)-WEEKDAY(DATEVALUE(\"01/\"&X9&\"/\"&B5),2)+1)+AA12","v":"2020-03-03"},{"$f":"(DATEVALUE(\"01/\"&X9&\"/\"&B5)-WEEKDAY(DATEVALUE(\"01/\"&X9&\"/\"&B5),2)+1)+AB12","v":"2020-03-04"},{"$f":"(DATEVALUE(\"01/\"&X9&\"/\"&B5)-WEEKDAY(DATEVALUE(\"01/\"&X9&\"/\"&B5),2)+1)+AC12","v":"2020-03-05"},{"$f":"(DATEVALUE(\"01/\"&X9&\"/\"&B5)-WEEKDAY(DATEVALUE(\"01/\"&X9&\"/\"&B5),2)+1)+AD12","v":"2020-03-06"},{"$f":"(DATEVALUE(\"01/\"&X9&\"/\"&B5)-WEEKDAY(DATEVALUE(\"01/\"&X9&\"/\"&B5),2)+1)+AE12","v":"2020-03-07"},{"$f":"(DATEVALUE(\"01/\"&X9&\"/\"&B5)-WEEKDAY(DATEVALUE(\"01/\"&X9&\"/\"&B5),2)+1)+AF12","v":"2020-03-08"},null,7,8,9,10,11,12,13]
[null,{"$f":"(DATEVALUE(\"01/\"&H9&\"/\"&B5)-WEEKDAY(DATEVALUE(\"01/\"&H9&\"/\"&B5),2)+1)+Z13","v":"2020-01-13"},{"$f":"(DATEVALUE(\"01/\"&H9&\"/\"&B5)-WEEKDAY(DATEVALUE(\"01/\"&H9&\"/\"&B5),2)+1)+AA13","v":"2020-01-14"},{"$f":"(DATEVALUE(\"01/\"&H9&\"/\"&B5)-WEEKDAY(DATEVALUE(\"01/\"&H9&\"/\"&B5),2)+1)+AB13","v":"2020-01-15"},{"$f":"(DATEVALUE(\"01/\"&H9&\"/\"&B5)-WEEKDAY(DATEVALUE(\"01/\"&H9&\"/\"&B5),2)+1)+AC13","v":"2020-01-16"},{"$f":"(DATEVALUE(\"01/\"&H9&\"/\"&B5)-WEEKDAY(DATEVALUE(\"01/\"&H9&\"/\"&B5),2)+1)+AD13","v":"2020-01-17"},{"$f":"(DATEVALUE(\"01/\"&H9&\"/\"&B5)-WEEKDAY(DATEVALUE(\"01/\"&H9&\"/\"&B5),2)+1)+AE13","v":"2020-01-18"},{"$f":"(DATEVALUE(\"01/\"&H9&\"/\"&B5)-WEEKDAY(DATEVALUE(\"01/\"&H9&\"/\"&B5),2)+1)+AF13","v":"2020-01-19"},null,{"$f":"(DATEVALUE(\"01/\"&P9&\"/\"&B5)-WEEKDAY(DATEVALUE(\"01/\"&P9&\"/\"&B5),2)+1)+Z13","v":"2020-02-10"},{"$f":"(DATEVALUE(\"01/\"&P9&\"/\"&B5)-WEEKDAY(DATEVALUE(\"01/\"&P9&\"/\"&B5),2)+1)+AA13","v":"2020-02-11"},{"$f":"(DATEVALUE(\"01/\"&P9&\"/\"&B5)-WEEKDAY(DATEVALUE(\"01/\"&P9&\"/\"&B5),2)+1)+AB13","v":"2020-02-12"},{"$f":"(DATEVALUE(\"01/\"&P9&\"/\"&B5)-WEEKDAY(DATEVALUE(\"01/\"&P9&\"/\"&B5),2)+1)+AC13","v":"2020-02-13"},{"$f":"(DATEVALUE(\"01/\"&P9&\"/\"&B5)-WEEKDAY(DATEVALUE(\"01/\"&P9&\"/\"&B5),2)+1)+AD13","v":"2020-02-14"},{"$f":"(DATEVALUE(\"01/\"&P9&\"/\"&B5)-WEEKDAY(DATEVALUE(\"01/\"&P9&\"/\"&B5),2)+1)+AE13","v":"2020-02-15"},{"$f":"(DATEVALUE(\"01/\"&P9&\"/\"&B5)-WEEKDAY(DATEVALUE(\"01/\"&P9&\"/\"&B5),2)+1)+AF13","v":"2020-02-16"},null,{"$f":"(DATEVALUE(\"01/\"&X9&\"/\"&B5)-WEEKDAY(DATEVALUE(\"01/\"&X9&\"/\"&B5),2)+1)+Z13","v":"2020-03-09"},{"$f":"(DATEVALUE(\"01/\"&X9&\"/\"&B5)-WEEKDAY(DATEVALUE(\"01/\"&X9&\"/\"&B5),2)+1)+AA13","v":"2020-03-10"},{"$f":"(DATEVALUE(\"01/\"&X9&\"/\"&B5)-WEEKDAY(DATEVALUE(\"01/\"&X9&\"/\"&B5),2)+1)+AB13","v":"2020-03-11"},{"$f":"(DATEVALUE(\"01/\"&X9&\"/\"&B5)-WEEKDAY(DATEVALUE(\"01/\"&X9&\"/\"&B5),2)+1)+AC13","v":"2020-03-12"},{"$f":"(DATEVALUE(\"01/\"&X9&\"/\"&B5)-WEEKDAY(DATEVALUE(\"01/\"&X9&\"/\"&B5),2)+1)+AD13","v":"2020-03-13"},{"$f":"(DATEVALUE(\"01/\"&X9&\"/\"&B5)-WEEKDAY(DATEVALUE(\"01/\"&X9&\"/\"&B5),2)+1)+AE13","v":"2020-03-14"},{"$f":"(DATEVALUE(\"01/\"&X9&\"/\"&B5)-WEEKDAY(DATEVALUE(\"01/\"&X9&\"/\"&B5),2)+1)+AF13","v":"2020-03-15"},null,14,15,16,17,18,19,20]
[null,{"$f":"(DATEVALUE(\"01/\"&H9&\"/\"&B5)-WEEKDAY(DATEVALUE(\"01/\"&H9&\"/\"&B5),2)+1)+Z14","v":"2020-01-20"},{"$f":"(DATEVALUE(\"01/\"&H9&\"/\"&B5)-WEEKDAY(DATEVALUE(\"01/\"&H9&\"/\"&B5),2)+1)+AA14","v":"2020-01-21"},{"$f":"(DATEVALUE(\"01/\"&H9&\"/\"&B5)-WEEKDAY(DATEVALUE(\"01/\"&H9&\"/\"&B5),2)+1)+AB14","v":"2020-01-22"},{"$f":"(DATEVALUE(\"01/\"&H9&\"/\"&B5)-WEEKDAY(DATEVALUE(\"01/\"&H9&\"/\"&B5),2)+1)+AC14","v":"2020-01-23"},{"$f":"(DATEVALUE(\"01/\"&H9&\"/\"&B5)-WEEKDAY(DATEVALUE(\"01/\"&H9&\"/\"&B5),2)+1)+AD14","v":"2020-01-24"},{"$f":"(DATEVALUE(\"01/\"&H9&\"/\"&B5)-WEEKDAY(DATEVALUE(\"01/\"&H9&\"/\"&B5),2)+1)+AE14","v":"2020-01-25"},{"$f":"(DATEVALUE(\"01/\"&H9&\"/\"&B5)-WEEKDAY(DATEVALUE(\"01/\"&H9&\"/\"&B5),2)+1)+AF14","v":"2020-01-26"},null,{"$f":"(DATEVALUE(\"01/\"&P9&\"/\"&B5)-WEEKDAY(DATEVALUE(\"01/\"&P9&\"/\"&B5),2)+1)+Z14","v":"2020-02-17"},{"$f":"(DATEVALUE(\"01/\"&P9&\"/\"&B5)-WEEKDAY(DATEVALUE(\"01/\"&P9&\"/\"&B5),2)+1)+AA14","v":"2020-02-18"},{"$f":"(DATEVALUE(\"01/\"&P9&\"/\"&B5)-WEEKDAY(DATEVALUE(\"01/\"&P9&\"/\"&B5),2)+1)+AB14","v":"2020-02-19"},{"$f":"(DATEVALUE(\"01/\"&P9&\"/\"&B5)-WEEKDAY(DATEVALUE(\"01/\"&P9&\"/\"&B5),2)+1)+AC14","v":"2020-02-20"},{"$f":"(DATEVALUE(\"01/\"&P9&\"/\"&B5)-WEEKDAY(DATEVALUE(\"01/\"&P9&\"/\"&B5),2)+1)+AD14","v":"2020-02-21"},{"$f":"(DATEVALUE(\"01/\"&P9&\"/\"&B5)-WEEKDAY(DATEVALUE(\"01/\"&P9&\"/\"&B5),2)+1)+AE14","v":"2020-02-22"},{"$f":"(DATEVALUE(\"01/\"&P9&\"/\"&B5)-WEEKDAY(DATEVALUE(\"01/\"&P9&\"/\"&B5),2)+1)+AF14","v":"2020-02-23"},null,{"$f":"(DATEVALUE(\"01/\"&X9&\"/\"&B5)-WEEKDAY(DATEVALUE(\"01/\"&X9&\"/\"&B5),2)+1)+Z14","v":"2020-03-16"},{"$f":"(DATEVALUE(\"01/\"&X9&\"/\"&B5)-WEEKDAY(DATEVALUE(\"01/\"&X9&\"/\"&B5),2)+1)+AA14","v":"2020-03-17"},{"$f":"(DATEVALUE(\"01/\"&X9&\"/\"&B5)-WEEKDAY(DATEVALUE(\"01/\"&X9&\"/\"&B5),2)+1)+AB14","v":"2020-03-18"},{"$f":"(DATEVALUE(\"01/\"&X9&\"/\"&B5)-WEEKDAY(DATEVALUE(\"01/\"&X9&\"/\"&B5),2)+1)+AC14","v":"2020-03-19"},{"$f":"(DATEVALUE(\"01/\"&X9&\"/\"&B5)-WEEKDAY(DATEVALUE(\"01/\"&X9&\"/\"&B5),2)+1)+AD14","v":"2020-03-20"},{"$f":"(DATEVALUE(\"01/\"&X9&\"/\"&B5)-WEEKDAY(DATEVALUE(\"01/\"&X9&\"/\"&B5),2)+1)+AE14","v":"2020-03-21"},{"$f":"(DATEVALUE(\"01/\"&X9&\"/\"&B5)-WEEKDAY(DATEVALUE(\"01/\"&X9&\"/\"&B5),2)+1)+AF14","v":"2020-03-22"},null,21,22,23,24,25,26,27]
[null,{"$f":"(DATEVALUE(\"01/\"&H9&\"/\"&B5)-WEEKDAY(DATEVALUE(\"01/\"&H9&\"/\"&B5),2)+1)+Z15","v":"2020-01-27"},{"$f":"(DATEVALUE(\"01/\"&H9&\"/\"&B5)-WEEKDAY(DATEVALUE(\"01/\"&H9&\"/\"&B5),2)+1)+AA15","v":"2020-01-28"},{"$f":"(DATEVALUE(\"01/\"&H9&\"/\"&B5)-WEEKDAY(DATEVALUE(\"01/\"&H9&\"/\"&B5),2)+1)+AB15","v":"2020-01-29"},{"$f":"(DATEVALUE(\"01/\"&H9&\"/\"&B5)-WEEKDAY(DATEVALUE(\"01/\"&H9&\"/\"&B5),2)+1)+AC15","v":"2020-01-30"},{"$f":"(DATEVALUE(\"01/\"&H9&\"/\"&B5)-WEEKDAY(DATEVALUE(\"01/\"&H9&\"/\"&B5),2)+1)+AD15","v":"2020-01-31"},{"$f":"(DATEVALUE(\"01/\"&H9&\"/\"&B5)-WEEKDAY(DATEVALUE(\"01/\"&H9&\"/\"&B5),2)+1)+AE15","v":"2020-02-01"},{"$f":"(DATEVALUE(\"01/\"&H9&\"/\"&B5)-WEEKDAY(DATEVALUE(\"01/\"&H9&\"/\"&B5),2)+1)+AF15","v":"2020-02-02"},null,{"$f":"(DATEVALUE(\"01/\"&P9&\"/\"&B5)-WEEKDAY(DATEVALUE(\"01/\"&P9&\"/\"&B5),2)+1)+Z15","v":"2020-02-24"},{"$f":"(DATEVALUE(\"01/\"&P9&\"/\"&B5)-WEEKDAY(DATEVALUE(\"01/\"&P9&\"/\"&B5),2)+1)+AA15","v":"2020-02-25"},{"$f":"(DATEVALUE(\"01/\"&P9&\"/\"&B5)-WEEKDAY(DATEVALUE(\"01/\"&P9&\"/\"&B5),2)+1)+AB15","v":"2020-02-26"},{"$f":"(DATEVALUE(\"01/\"&P9&\"/\"&B5)-WEEKDAY(DATEVALUE(\"01/\"&P9&\"/\"&B5),2)+1)+AC15","v":"2020-02-27"},{"$f":"(DATEVALUE(\"01/\"&P9&\"/\"&B5)-WEEKDAY(DATEVALUE(\"01/\"&P9&\"/\"&B5),2)+1)+AD15","v":"2020-02-28"},{"$f":"(DATEVALUE(\"01/\"&P9&\"/\"&B5)-WEEKDAY(DATEVALUE(\"01/\"&P9&\"/\"&B5),2)+1)+AE15","v":"2020-02-29"},{"$f":"(DATEVALUE(\"01/\"&P9&\"/\"&B5)-WEEKDAY(DATEVALUE(\"01/\"&P9&\"/\"&B5),2)+1)+AF15","v":"2020-03-01"},null,{"$f":"(DATEVALUE(\"01/\"&X9&\"/\"&B5)-WEEKDAY(DATEVALUE(\"01/\"&X9&\"/\"&B5),2)+1)+Z15","v":"2020-03-23"},{"$f":"(DATEVALUE(\"01/\"&X9&\"/\"&B5)-WEEKDAY(DATEVALUE(\"01/\"&X9&\"/\"&B5),2)+1)+AA15","v":"2020-03-24"},{"$f":"(DATEVALUE(\"01/\"&X9&\"/\"&B5)-WEEKDAY(DATEVALUE(\"01/\"&X9&\"/\"&B5),2)+1)+AB15","v":"2020-03-25"},{"$f":"(DATEVALUE(\"01/\"&X9&\"/\"&B5)-WEEKDAY(DATEVALUE(\"01/\"&X9&\"/\"&B5),2)+1)+AC15","v":"2020-03-26"},{"$f":"(DATEVALUE(\"01/\"&X9&\"/\"&B5)-WEEKDAY(DATEVALUE(\"01/\"&X9&\"/\"&B5),2)+1)+AD15","v":"2020-03-27"},{"$f":"(DATEVALUE(\"01/\"&X9&\"/\"&B5)-WEEKDAY(DATEVALUE(\"01/\"&X9&\"/\"&B5),2)+1)+AE15","v":"2020-03-28"},{"$f":"(DATEVALUE(\"01/\"&X9&\"/\"&B5)-WEEKDAY(DATEVALUE(\"01/\"&X9&\"/\"&B5),2)+1)+AF15","v":"2020-03-29"},null,28,29,30,31,32,33,34]
[null,{"$f":"(DATEVALUE(\"01/\"&H9&\"/\"&B5)-WEEKDAY(DATEVALUE(\"01/\"&H9&\"/\"&B5),2)+1)+Z16","v":"2020-02-03"},{"$f":"(DATEVALUE(\"01/\"&H9&\"/\"&B5)-WEEKDAY(DATEVALUE(\"01/\"&H9&\"/\"&B5),2)+1)+AA16","v":"2020-02-04"},{"$f":"(DATEVALUE(\"01/\"&H9&\"/\"&B5)-WEEKDAY(DATEVALUE(\"01/\"&H9&\"/\"&B5),2)+1)+AB16","v":"2020-02-05"},{"$f":"(DATEVALUE(\"01/\"&H9&\"/\"&B5)-WEEKDAY(DATEVALUE(\"01/\"&H9&\"/\"&B5),2)+1)+AC16","v":"2020-02-06"},{"$f":"(DATEVALUE(\"01/\"&H9&\"/\"&B5)-WEEKDAY(DATEVALUE(\"01/\"&H9&\"/\"&B5),2)+1)+AD16","v":"2020-02-07"},{"$f":"(DATEVALUE(\"01/\"&H9&\"/\"&B5)-WEEKDAY(DATEVALUE(\"01/\"&H9&\"/\"&B5),2)+1)+AE16","v":"2020-02-08"},{"$f":"(DATEVALUE(\"01/\"&H9&\"/\"&B5)-WEEKDAY(DATEVALUE(\"01/\"&H9&\"/\"&B5),2)+1)+AF16","v":"2020-02-09"},null,{"$f":"(DATEVALUE(\"01/\"&P9&\"/\"&B5)-WEEKDAY(DATEVALUE(\"01/\"&P9&\"/\"&B5),2)+1)+Z16","v":"2020-03-02"},{"$f":"(DATEVALUE(\"01/\"&P9&\"/\"&B5)-WEEKDAY(DATEVALUE(\"01/\"&P9&\"/\"&B5),2)+1)+AA16","v":"2020-03-03"},{"$f":"(DATEVALUE(\"01/\"&P9&\"/\"&B5)-WEEKDAY(DATEVALUE(\"01/\"&P9&\"/\"&B5),2)+1)+AB16","v":"2020-03-04"},{"$f":"(DATEVALUE(\"01/\"&P9&\"/\"&B5)-WEEKDAY(DATEVALUE(\"01/\"&P9&\"/\"&B5),2)+1)+AC16","v":"2020-03-05"},{"$f":"(DATEVALUE(\"01/\"&P9&\"/\"&B5)-WEEKDAY(DATEVALUE(\"01/\"&P9&\"/\"&B5),2)+1)+AD16","v":"2020-03-06"},{"$f":"(DATEVALUE(\"01/\"&P9&\"/\"&B5)-WEEKDAY(DATEVALUE(\"01/\"&P9&\"/\"&B5),2)+1)+AE16","v":"2020-03-07"},{"$f":"(DATEVALUE(\"01/\"&P9&\"/\"&B5)-WEEKDAY(DATEVALUE(\"01/\"&P9&\"/\"&B5),2)+1)+AF16","v":"2020-03-08"},null,{"$f":"(DATEVALUE(\"01/\"&X9&\"/\"&B5)-WEEKDAY(DATEVALUE(\"01/\"&X9&\"/\"&B5),2)+1)+Z16","v":"2020-03-30"},{"$f":"(DATEVALUE(\"01/\"&X9&\"/\"&B5)-WEEKDAY(DATEVALUE(\"01/\"&X9&\"/\"&B5),2)+1)+AA16","v":"2020-03-31"},{"$f":"(DATEVALUE(\"01/\"&X9&\"/\"&B5)-WEEKDAY(DATEVALUE(\"01/\"&X9&\"/\"&B5),2)+1)+AB16","v":"2020-04-01"},{"$f":"(DATEVALUE(\"01/\"&X9&\"/\"&B5)-WEEKDAY(DATEVALUE(\"01/\"&X9&\"/\"&B5),2)+1)+AC16","v":"2020-04-02"},{"$f":"(DATEVALUE(\"01/\"&X9&\"/\"&B5)-WEEKDAY(DATEVALUE(\"01/\"&X9&\"/\"&B5),2)+1)+AD16","v":"2020-04-03"},{"$f":"(DATEVALUE(\"01/\"&X9&\"/\"&B5)-WEEKDAY(DATEVALUE(\"01/\"&X9&\"/\"&B5),2)+1)+AE16","v":"2020-04-04"},{"$f":"(DATEVALUE(\"01/\"&X9&\"/\"&B5)-WEEKDAY(DATEVALUE(\"01/\"&X9&\"/\"&B5),2)+1)+AF16","v":"2020-04-05"},null,35,36,37,38,39,40,41]
[]
[null,{"$f":"\"Abril\"&\" • \"&IF(B5=\"\",YEAR(TODAY()),B5)","v":"Abril • 2020"},{"$nulls":5},4,null,{"$f":"\"Mayo\"&\" • \"&IF(B5=\"\",YEAR(TODAY()),B5)","v":"Mayo • 2020"},{"$nulls":5},5,null,{"$f":"\"Junio\"&\" • \"&IF(B5=\"\",YEAR(TODAY()),B5)","v":"Junio • 2020"},{"$nulls":5},6]
[null,"Lu","Ma","Mi","Ju","Vi","Sá","Do",null,"Lu","Ma","Mi","Ju","Vi","Sá","Do",null,"Lu","Ma","Mi","Ju","Vi","Sá","Do",null,"Formulación"]
[null,{"$f":"(DATEVALUE(\"01/\"&H18&\"/\"&B5)-WEEKDAY(DATEVALUE(\"01/\"&H18&\"/\"&B5),2)+1)+Z11","v":"2020-03-30"},{"$f":"(DATEVALUE(\"01/\"&H18&\"/\"&B5)-WEEKDAY(DATEVALUE(\"01/\"&H18&\"/\"&B5),2)+1)+AA11","v":"2020-03-31"},{"$f":"(DATEVALUE(\"01/\"&H18&\"/\"&B5)-WEEKDAY(DATEVALUE(\"01/\"&H18&\"/\"&B5),2)+1)+AB11","v":"2020-04-01"},{"$f":"(DATEVALUE(\"01/\"&H18&\"/\"&B5)-WEEKDAY(DATEVALUE(\"01/\"&H18&\"/\"&B5),2)+1)+AC11","v":"2020-04-02"},{"$f":"(DATEVALUE(\"01/\"&H18&\"/\"&B5)-WEEKDAY(DATEVALUE(\"01/\"&H18&\"/\"&B5),2)+1)+AD11","v":"2020-04-03"},{"$f":"(DATEVALUE(\"01/\"&H18&\"/\"&B5)-WEEKDAY(DATEVALUE(\"01/\"&H18&\"/\"&B5),2)+1)+AE11","v":"2020-04-04"},{"$f":"(DATEVALUE(\"01/\"&H18&\"/\"&B5)-WEEKDAY(DATEVALUE(\"01/\"&H18&\"/\"&B5),2)+1)+AF11","v":"2020-04-05"},null,{"$f":"(DATEVALUE(\"01/\"&P18&\"/\"&B5)-WEEKDAY(DATEVALUE(\"01/\"&P18&\"/\"&B5),2)+1)+Z11","v":"2020-04-27"},{"$f":"(DATEVALUE(\"01/\"&P18&\"/\"&B5)-WEEKDAY(DATEVALUE(\"01/\"&P18&\"/\"&B5),2)+1)+AA11","v":"2020-04-28"},{"$f":"(DATEVALUE(\"01/\"&P18&\"/\"&B5)-WEEKDAY(DATEVALUE(\"01/\"&P18&\"/\"&B5),2)+1)+AB11","v":"2020-04-29"},{"$f":"(DATEVALUE(\"01/\"&P18&\"/\"&B5)-WEEKDAY(DATEVALUE(\"01/\"&P18&\"/\"&B5),2)+1)+AC11","v":"2020-04-30"},{"$f":"(DATEVALUE(\"01/\"&P18&\"/\"&B5)-WEEKDAY(DATEVALUE(\"01/\"&P18&\"/\"&B5),2)+1)+AD11","v":"2020-05-01"},{"$f":"(DATEVALUE(\"01/\"&P18&\"/\"&B5)-WEEKDAY(DATEVALUE(\"01/\"&P18&\"/\"&B5),2)+1)+AE11","v":"2020-05-02"},{"$f":"(DATEVALUE(\"01/\"&P18&\"/\"&B5)-WEEKDAY(DATEVALUE(\"01/\"&P18&\"/\"&B5),2)+1)+AF11","v":"2020-05-03"},null,{"$f":"(DATEVALUE(\"01/\"&X18&\"/\"&B5)-WEEKDAY(DATEVALUE(\"01/\"&X18&\"/\"&B5),2)+1)+Z11","v":"2020-06-01"},{"$f":"(DATEVALUE(\"01/\"&X18&\"/\"&B5)-WEEKDAY(DATEVALUE(\"01/\"&X18&\"/\"&B5),2)+1)+AA11","v":"2020-06-02"},{"$f":"(DATEVALUE(\"01/\"&X18&\"/\"&B5)-WEEKDAY(DATEVALUE(\"01/\"&X18&\"/\"&B5),2)+1)+AB11","v":"2020-06-03"},{"$f":"(DATEVALUE(\"01/\"&X18&\"/\"&B5)-WEEKDAY(DATEVALUE(\"01/\"&X18&\"/\"&B5),2)+1)+AC11","v":"2020-06-04"},{"$f":"(DATEVALUE(\"01/\"&X18&\"/\"&B5)-WEEKDAY(DATEVALUE(\"01/\"&X18&\"/\"&B5),2)+1)+AD11","v":"2020-06-05"},{"$f":"(DATEVALUE(\"01/\"&X18&\"/\"&B5)-WEEKDAY(DATEVALUE(\"01/\"&X18&\"/\"&B5),2)+1)+AE11","v":"2020-06-06"},{"$f":"(DATEVALUE(\"01/\"&X18&\"/\"&B5)-WEEKDAY(DATEVALUE(\"01/\"&X18&\"/\"&B5),2)+1)+AF11","v":"2020-06-07"},null,{"$f":"(ROWS(Z$20:Z20)-1)*7+COLUMNS($Z20:Z20)-1","v":0},{"$f":"(ROWS(AA$20:AA20)-1)*7+COLUMNS($Z20:AA20)-1","v":1},{"$f":"(ROWS(AB$20:AB20)-1)*7+COLUMNS($Z20:AB20)-1","v":2},{"$f":"(ROWS(AC$20:AC20)-1)*7+COLUMNS($Z20:AC20)-1","v":3},{"$f":"(ROWS(AD$20:AD20)-1)*7+COLUMNS($Z20:AD20)-1","v":4},{"$f":"(ROWS(AE$20:AE20)-1)*7+COLUMNS($Z20:AE20)-1","v":5},{"$f":"(ROWS(AF$20:AF20)-1)*7+COLUMNS($Z20:AF20)-1","v":6}]
[null,{"$f":"(DATEVALUE(\"01/\"&H18&\"/\"&B5)-WEEKDAY(DATEVALUE(\"01/\"&H18&\"/\"&B5),2)+1)+Z12","v":"2020-04-06"},{"$f":"(DATEVALUE(\"01/\"&H18&\"/\"&B5)-WEEKDAY(DATEVALUE(\"01/\"&H18&\"/\"&B5),2)+1)+AA12","v":"2020-04-07"},{"$f":"(DATEVALUE(\"01/\"&H18&\"/\"&B5)-WEEKDAY(DATEVALUE(\"01/\"&H18&\"/\"&B5),2)+1)+AB12","v":"2020-04-08"},{"$f":"(DATEVALUE(\"01/\"&H18&\"/\"&B5)-WEEKDAY(DATEVALUE(\"01/\"&H18&\"/\"&B5),2)+1)+AC12","v":"2020-04-09"},{"$f":"(DATEVALUE(\"01/\"&H18&\"/\"&B5)-WEEKDAY(DATEVALUE(\"01/\"&H18&\"/\"&B5),2)+1)+AD12","v":"2020-04-10"},{"$f":"(DATEVALUE(\"01/\"&H18&\"/\"&B5)-WEEKDAY(DATEVALUE(\"01/\"&H18&\"/\"&B5),2)+1)+AE12","v":"2020-04-11"},{"$f":"(DATEVALUE(\"01/\"&H18&\"/\"&B5)-WEEKDAY(DATEVALUE(\"01/\"&H18&\"/\"&B5),2)+1)+AF12","v":"2020-04-12"},null,{"$f":"(DATEVALUE(\"01/\"&P18&\"/\"&B5)-WEEKDAY(DATEVALUE(\"01/\"&P18&\"/\"&B5),2)+1)+Z12","v":"2020-05-04"},{"$f":"(DATEVALUE(\"01/\"&P18&\"/\"&B5)-WEEKDAY(DATEVALUE(\"01/\"&P18&\"/\"&B5),2)+1)+AA12","v":"2020-05-05"},{"$f":"(DATEVALUE(\"01/\"&P18&\"/\"&B5)-WEEKDAY(DATEVALUE(\"01/\"&P18&\"/\"&B5),2)+1)+AB12","v":"2020-05-06"},{"$f":"(DATEVALUE(\"01/\"&P18&\"/\"&B5)-WEEKDAY(DATEVALUE(\"01/\"&P18&\"/\"&B5),2)+1)+AC12","v":"2020-05-07"},{"$f":"(DATEVALUE(\"01/\"&P18&\"/\"&B5)-WEEKDAY(DATEVALUE(\"01/\"&P18&\"/\"&B5),2)+1)+AD12","v":"2020-05-08"},{"$f":"(DATEVALUE(\"01/\"&P18&\"/\"&B5)-WEEKDAY(DATEVALUE(\"01/\"&P18&\"/\"&B5),2)+1)+AE12","v":"2020-05-09"},{"$f":"(DATEVALUE(\"01/\"&P18&\"/\"&B5)-WEEKDAY(DATEVALUE(\"01/\"&P18&\"/\"&B5),2)+1)+AF12","v":"2020-05-10"},null,{"$f":"(DATEVALUE(\"01/\"&X18&\"/\"&B5)-WEEKDAY(DATEVALUE(\"01/\"&X18&\"/\"&B5),2)+1)+Z12","v":"2020-06-08"},{"$f":"(DATEVALUE(\"01/\"&X18&\"/\"&B5)-WEEKDAY(DATEVALUE(\"01/\"&X18&\"/\"&B5),2)+1)+AA12","v":"2020-06-09"},{"$f":"(DATEVALUE(\"01/\"&X18&\"/\"&B5)-WEEKDAY(DATEVALUE(\"01/\"&X18&\"/\"&B5),2)+1)+AB12","v":"2020-06-10"},{"$f":"(DATEVALUE(\"01/\"&X18&\"/\"&B5)-WEEKDAY(DATEVALUE(\"01/\"&X18&\"/\"&B5),2)+1)+AC12","v":"2020-06-11"},{"$f":"(DATEVALUE(\"01/\"&X18&\"/\"&B5)-WEEKDAY(DATEVALUE(\"01/\"&X18&\"/\"&B5),2)+1)+AD12","v":"2020-06-12"},{"$f":"(DATEVALUE(\"01/\"&X18&\"/\"&B5)-WEEKDAY(DATEVALUE(\"01/\"&X18&\"/\"&B5),2)+1)+AE12","v":"2020-06-13"},{"$f":"(DATEVALUE(\"01/\"&X18&\"/\"&B5)-WEEKDAY(DATEVALUE(\"01/\"&X18&\"/\"&B5),2)+1)+AF12","v":"2020-06-14"},null,{"$f":"(ROWS(Z$20:Z21)-1)*7+COLUMNS($Z21:Z21)-1","v":7},{"$f":"(ROWS(AA$20:AA21)-1)*7+COLUMNS($Z21:AA21)-1","v":8},{"$f":"(ROWS(AB$20:AB21)-1)*7+COLUMNS($Z21:AB21)-1","v":9},{"$f":"(ROWS(AC$20:AC21)-1)*7+COLUMNS($Z21:AC21)-1","v":10},{"$f":"(ROWS(AD$20:AD21)-1)*7+COLUMNS($Z21:AD21)-1","v":11},{"$f":"(ROWS(AE$20:AE21)-1)*7+COLUMNS($Z21:AE21)-1","v":12},{"$f":"(ROWS(AF$20:AF21)-1)*7+COLUMNS($Z21:AF21)-1","v":13}]
[null,{"$f":"(DATEVALUE(\"01/\"&H18&\"/\"&B5)-WEEKDAY(DATEVALUE(\"01/\"&H18&\"/\"&B5),2)+1)+Z13","v":"2020-04-13"},{"$f":"(DATEVALUE(\"01/\"&H18&\"/\"&B5)-WEEKDAY(DATEVALUE(\"01/\"&H18&\"/\"&B5),2)+1)+AA13","v":"2020-04-14"},{"$f":"(DATEVALUE(\"01/\"&H18&\"/\"&B5)-WEEKDAY(DATEVALUE(\"01/\"&H18&\"/\"&B5),2)+1)+AB13","v":"2020-04-15"},{"$f":"(DATEVALUE(\"01/\"&H18&\"/\"&B5)-WEEKDAY(DATEVALUE(\"01/\"&H18&\"/\"&B5),2)+1)+AC13","v":"2020-04-16"},{"$f":"(DATEVALUE(\"01/\"&H18&\"/\"&B5)-WEEKDAY(DATEVALUE(\"01/\"&H18&\"/\"&B5),2)+1)+AD13","v":"2020-04-17"},{"$f":"(DATEVALUE(\"01/\"&H18&\"/\"&B5)-WEEKDAY(DATEVALUE(\"01/\"&H18&\"/\"&B5),2)+1)+AE13","v":"2020-04-18"},{"$f":"(DATEVALUE(\"01/\"&H18&\"/\"&B5)-WEEKDAY(DATEVALUE(\"01/\"&H18&\"/\"&B5),2)+1)+AF13","v":"2020-04-19"},null,{"$f":"(DATEVALUE(\"01/\"&P18&\"/\"&B5)-WEEKDAY(DATEVALUE(\"01/\"&P18&\"/\"&B5),2)+1)+Z13","v":"2020-05-11"},{"$f":"(DATEVALUE(\"01/\"&P18&\"/\"&B5)-WEEKDAY(DATEVALUE(\"01/\"&P18&\"/\"&B5),2)+1)+AA13","v":"2020-05-12"},{"$f":"(DATEVALUE(\"01/\"&P18&\"/\"&B5)-WEEKDAY(DATEVALUE(\"01/\"&P18&\"/\"&B5),2)+1)+AB13","v":"2020-05-13"},{"$f":"(DATEVALUE(\"01/\"&P18&\"/\"&B5)-WEEKDAY(DATEVALUE(\"01/\"&P18&\"/\"&B5),2)+1)+AC13","v":"2020-05-14"},{"$f":"(DATEVALUE(\"01/\"&P18&\"/\"&B5)-WEEKDAY(DATEVALUE(\"01/\"&P18&\"/\"&B5),2)+1)+AD13","v":"2020-05-15"},{"$f":"(DATEVALUE(\"01/\"&P18&\"/\"&B5)-WEEKDAY(DATEVALUE(\"01/\"&P18&\"/\"&B5),2)+1)+AE13","v":"2020-05-16"},{"$f":"(DATEVALUE(\"01/\"&P18&\"/\"&B5)-WEEKDAY(DATEVALUE(\"01/\"&P18&\"/\"&B5),2)+1)+AF13","v":"2020-05-17"},null,{"$f":"(DATEVALUE(\"01/\"&X18&\"/\"&B5)-WEEKDAY(DATEVALUE(\"01/\"&X18&\"/\"&B5),2)+1)+Z13","v":"2020-06-15"},{"$f":"(DATEVALUE(\"01/\"&X18&\"/\"&B5)-WEEKDAY(DATEVALUE(\"01/\"&X18&\"/\"&B5),2)+1)+AA13","v":"2020-06-16"},{"$f":"(DATEVALUE(\"01/\"&X18&\"/\"&B5)-WEEKDAY(DATEVALUE(\"01/\"&X18&\"/\"&B5),2)+1)+AB13","v":"2020-06-17"},{"$f":"(DATEVALUE(\"01/\"&X18&\"/\"&B5)-WEEKDAY(DATEVALUE(\"01/\"&X18&\"/\"&B5),2)+1)+AC13","v":"2020-06-18"},{"$f":"(DATEVALUE(\"01/\"&X18&\"/\"&B5)-WEEKDAY(DATEVALUE(\"01/\"&X18&\"/\"&B5),2)+1)+AD13","v":"2020-06-19"},{"$f":"(DATEVALUE(\"01/\"&X18&\"/\"&B5)-WEEKDAY(DATEVALUE(\"01/\"&X18&\"/\"&B5),2)+1)+AE13","v":"2020-06-20"},{"$f":"(DATEVALUE(\"01/\"&X18&\"/\"&B5)-WEEKDAY(DATEVALUE(\"01/\"&X18&\"/\"&B5),2)+1)+AF13","v":"2020-06-21"},null,{"$f":"(ROWS(Z$20:Z22)-1)*7+COLUMNS($Z22:Z22)-1","v":14},{"$f":"(ROWS(AA$20:AA22)-1)*7+COLUMNS($Z22:AA22)-1","v":15},{"$f":"(ROWS(AB$20:AB22)-1)*7+COLUMNS($Z22:AB22)-1","v":16},{"$f":"(ROWS(AC$20:AC22)-1)*7+COLUMNS($Z22:AC22)-1","v":17},{"$f":"(ROWS(AD$20:AD22)-1)*7+COLUMNS($Z22:AD22)-1","v":18},{"$f":"(ROWS(AE$20:AE22)-1)*7+COLUMNS($Z22:AE22)-1","v":19},{"$f":"(ROWS(AF$20:AF22)-1)*7+COLUMNS($Z22:AF22)-1","v":20}]
[null,{"$f":"(DATEVALUE(\"01/\"&H18&\"/\"&B5)-WEEKDAY(DATEVALUE(\"01/\"&H18&\"/\"&B5),2)+1)+Z14","v":"2020-04-20"},{"$f":"(DATEVALUE(\"01/\"&H18&\"/\"&B5)-WEEKDAY(DATEVALUE(\"01/\"&H18&\"/\"&B5),2)+1)+AA14","v":"2020-04-21"},{"$f":"(DATEVALUE(\"01/\"&H18&\"/\"&B5)-WEEKDAY(DATEVALUE(\"01/\"&H18&\"/\"&B5),2)+1)+AB14","v":"2020-04-22"},{"$f":"(DATEVALUE(\"01/\"&H18&\"/\"&B5)-WEEKDAY(DATEVALUE(\"01/\"&H18&\"/\"&B5),2)+1)+AC14","v":"2020-04-23"},{"$f":"(DATEVALUE(\"01/\"&H18&\"/\"&B5)-WEEKDAY(DATEVALUE(\"01/\"&H18&\"/\"&B5),2)+1)+AD14","v":"2020-04-24"},{"$f":"(DATEVALUE(\"01/\"&H18&\"/\"&B5)-WEEKDAY(DATEVALUE(\"01/\"&H18&\"/\"&B5),2)+1)+AE14","v":"2020-04-25"},{"$f":"(DATEVALUE(\"01/\"&H18&\"/\"&B5)-WEEKDAY(DATEVALUE(\"01/\"&H18&\"/\"&B5),2)+1)+AF14","v":"2020-04-26"},null,{"$f":"(DATEVALUE(\"01/\"&P18&\"/\"&B5)-WEEKDAY(DATEVALUE(\"01/\"&P18&\"/\"&B5),2)+1)+Z14","v":"2020-05-18"},{"$f":"(DATEVALUE(\"01/\"&P18&\"/\"&B5)-WEEKDAY(DATEVALUE(\"01/\"&P18&\"/\"&B5),2)+1)+AA14","v":"2020-05-19"},{"$f":"(DATEVALUE(\"01/\"&P18&\"/\"&B5)-WEEKDAY(DATEVALUE(\"01/\"&P18&\"/\"&B5),2)+1)+AB14","v":"2020-05-20"},{"$f":"(DATEVALUE(\"01/\"&P18&\"/\"&B5)-WEEKDAY(DATEVALUE(\"01/\"&P18&\"/\"&B5),2)+1)+AC14","v":"2020-05-21"},{"$f":"(DATEVALUE(\"01/\"&P18&\"/\"&B5)-WEEKDAY(DATEVALUE(\"01/\"&P18&\"/\"&B5),2)+1)+AD14","v":"2020-05-22"},{"$f":"(DATEVALUE(\"01/\"&P18&\"/\"&B5)-WEEKDAY(DATEVALUE(\"01/\"&P18&\"/\"&B5),2)+1)+AE14","v":"2020-05-23"},{"$f":"(DATEVALUE(\"01/\"&P18&\"/\"&B5)-WEEKDAY(DATEVALUE(\"01/\"&P18&\"/\"&B5),2)+1)+AF14","v":"2020-05-24"},null,{"$f":"(DATEVALUE(\"01/\"&X18&\"/\"&B5)-WEEKDAY(DATEVALUE(\"01/\"&X18&\"/\"&B5),2)+1)+Z14","v":"2020-06-22"},{"$f":"(DATEVALUE(\"01/\"&X18&\"/\"&B5)-WEEKDAY(DATEVALUE(\"01/\"&X18&\"/\"&B5),2)+1)+AA14","v":"2020-06-23"},{"$f":"(DATEVALUE(\"01/\"&X18&\"/\"&B5)-WEEKDAY(DATEVALUE(\"01/\"&X18&\"/\"&B5),2)+1)+AB14","v":"2020-06-24"},{"$f":"(DATEVALUE(\"01/\"&X18&\"/\"&B5)-WEEKDAY(DATEVALUE(\"01/\"&X18&\"/\"&B5),2)+1)+AC14","v":"2020-06-25"},{"$f":"(DATEVALUE(\"01/\"&X18&\"/\"&B5)-WEEKDAY(DATEVALUE(\"01/\"&X18&\"/\"&B5),2)+1)+AD14","v":"2020-06-26"},{"$f":"(DATEVALUE(\"01/\"&X18&\"/\"&B5)-WEEKDAY(DATEVALUE(\"01/\"&X18&\"/\"&B5),2)+1)+AE14","v":"2020-06-27"},{"$f":"(DATEVALUE(\"01/\"&X18&\"/\"&B5)-WEEKDAY(DATEVALUE(\"01/\"&X18&\"/\"&B5),2)+1)+AF14","v":"2020-06-28"},null,{"$f":"(ROWS(Z$20:Z23)-1)*7+COLUMNS($Z23:Z23)-1","v":21},{"$f":"(ROWS(AA$20:AA23)-1)*7+COLUMNS($Z23:AA23)-1","v":22},{"$f":"(ROWS(AB$20:AB23)-1)*7+COLUMNS($Z23:AB23)-1","v":23},{"$f":"(ROWS(AC$20:AC23)-1)*7+COLUMNS($Z23:AC23)-1","v":24},{"$f":"(ROWS(AD$20:AD23)-1)*7+COLUMNS($Z23:AD23)-1","v":25},{"$f":"(ROWS(AE$20:AE23)-1)*7+COLUMNS($Z23:AE23)-1","v":26},{"$f":"(ROWS(AF$20:AF23)-1)*7+COLUMNS($Z23:AF23)-1","v":27}]
[null,{"$f":"(DATEVALUE(\"01/\"&H18&\"/\"&B5)-WEEKDAY(DATEVALUE(\"01/\"&H18&\"/\"&B5),2)+1)+Z15","v":"2020-04-27"},{"$f":"(DATEVALUE(\"01/\"&H18&\"/\"&B5)-WEEKDAY(DATEVALUE(\"01/\"&H18&\"/\"&B5),2)+1)+AA15","v":"2020-04-28"},{"$f":"(DATEVALUE(\"01/\"&H18&\"/\"&B5)-WEEKDAY(DATEVALUE(\"01/\"&H18&\"/\"&B5),2)+1)+AB15","v":"2020-04-29"},{"$f":"(DATEVALUE(\"01/\"&H18&\"/\"&B5)-WEEKDAY(DATEVALUE(\"01/\"&H18&\"/\"&B5),2)+1)+AC15","v":"2020-04-30"},{"$f":"(DATEVALUE(\"01/\"&H18&\"/\"&B5)-WEEKDAY(DATEVALUE(\"01/\"&H18&\"/\"&B5),2)+1)+AD15","v":"2020-05-01"},{"$f":"(DATEVALUE(\"01/\"&H18&\"/\"&B5)-WEEKDAY(DATEVALUE(\"01/\"&H18&\"/\"&B5),2)+1)+AE15","v":"2020-05-02"},{"$f":"(DATEVALUE(\"01/\"&H18&\"/\"&B5)-WEEKDAY(DATEVALUE(\"01/\"&H18&\"/\"&B5),2)+1)+AF15","v":"2020-05-03"},null,{"$f":"(DATEVALUE(\"01/\"&P18&\"/\"&B5)-WEEKDAY(DATEVALUE(\"01/\"&P18&\"/\"&B5),2)+1)+Z15","v":"2020-05-25"},{"$f":"(DATEVALUE(\"01/\"&P18&\"/\"&B5)-WEEKDAY(DATEVALUE(\"01/\"&P18&\"/\"&B5),2)+1)+AA15","v":"2020-05-26"},{"$f":"(DATEVALUE(\"01/\"&P18&\"/\"&B5)-WEEKDAY(DATEVALUE(\"01/\"&P18&\"/\"&B5),2)+1)+AB15","v":"2020-05-27"},{"$f":"(DATEVALUE(\"01/\"&P18&\"/\"&B5)-WEEKDAY(DATEVALUE(\"01/\"&P18&\"/\"&B5),2)+1)+AC15","v":"2020-05-28"},{"$f":"(DATEVALUE(\"01/\"&P18&\"/\"&B5)-WEEKDAY(DATEVALUE(\"01/\"&P18&\"/\"&B5),2)+1)+AD15","v":"2020-05-29"},{"$f":"(DATEVALUE(\"01/\"&P18&\"/\"&B5)-WEEKDAY(DATEVALUE(\"01/\"&P18&\"/\"&B5),2)+1)+AE15","v":"2020-05-30"},{"$f":"(DATEVALUE(\"01/\"&P18&\"/\"&B5)-WEEKDAY(DATEVALUE(\"01/\"&P18&\"/\"&B5),2)+1)+AF15","v":"2020-05-31"},null,{"$f":"(DATEVALUE(\"01/\"&X18&\"/\"&B5)-WEEKDAY(DATEVALUE(\"01/\"&X18&\"/\"&B5),2)+1)+Z15","v":"2020-06-29"},{"$f":"(DATEVALUE(\"01/\"&X18&\"/\"&B5)-WEEKDAY(DATEVALUE(\"01/\"&X18&\"/\"&B5),2)+1)+AA15","v":"2020-06-30"},{"$f":"(DATEVALUE(\"01/\"&X18&\"/\"&B5)-WEEKDAY(DATEVALUE(\"01/\"&X18&\"/\"&B5),2)+1)+AB15","v":"2020-07-01"},{"$f":"(DATEVALUE(\"01/\"&X18&\"/\"&B5)-WEEKDAY(DATEVALUE(\"01/\"&X18&\"/\"&B5),2)+1)+AC15","v":"2020-07-02"},{"$f":"(DATEVALUE(\"01/\"&X18&\"/\"&B5)-WEEKDAY(DATEVALUE(\"01/\"&X18&\"/\"&B5),2)+1)+AD15","v":"2020-07-03"},{"$f":"(DATEVALUE(\"01/\"&X18&\"/\"&B5)-WEEKDAY(DATEVALUE(\"01/\"&X18&\"/\"&B5),2)+1)+AE15","v":"2020-07-04"},{"$f":"(DATEVALUE(\"01/\"&X18&\"/\"&B5)-WEEKDAY(DATEVALUE(\"01/\"&X18&\"/\"&B5),2)+1)+AF15","v":"2020-07-05"},null,{"$f":"(ROWS(Z$20:Z24)-1)*7+COLUMNS($Z24:Z24)-1","v":28},{"$f":"(ROWS(AA$20:AA24)-1)*7+COLUMNS($Z24:AA24)-1","v":29},{"$f":"(ROWS(AB$20:AB24)-1)*7+COLUMNS($Z24:AB24)-1","v":30},{"$f":"(ROWS(AC$20:AC24)-1)*7+COLUMNS($Z24:AC24)-1","v":31},{"$f":"(ROWS(AD$20:AD24)-1)*7+COLUMNS($Z24:AD24)-1","v":32},{"$f":"(ROWS(AE$20:AE24)-1)*7+COLUMNS($Z24:AE24)-1","v":33},{"$f":"(ROWS(AF$20:AF24)-1)*7+COLUMNS($Z24:AF24)-1","v":34}]
[null,{"$f":"(DATEVALUE(\"01/\"&H18&\"/\"&B5)-WEEKDAY(DATEVALUE(\"01/\"&H18&\"/\"&B5),2)+1)+Z16","v":"2020-05-04"},{"$f":"(DATEVALUE(\"01/\"&H18&\"/\"&B5)-WEEKDAY(DATEVALUE(\"01/\"&H18&\"/\"&B5),2)+1)+AA16","v":"2020-05-05"},{"$f":"(DATEVALUE(\"01/\"&H18&\"/\"&B5)-WEEKDAY(DATEVALUE(\"01/\"&H18&\"/\"&B5),2)+1)+AB16","v":"2020-05-06"},{"$f":"(DATEVALUE(\"01/\"&H18&\"/\"&B5)-WEEKDAY(DATEVALUE(\"01/\"&H18&\"/\"&B5),2)+1)+AC16","v":"2020-05-07"},{"$f":"(DATEVALUE(\"01/\"&H18&\"/\"&B5)-WEEKDAY(DATEVALUE(\"01/\"&H18&\"/\"&B5),2)+1)+AD16","v":"2020-05-08"},{"$f":"(DATEVALUE(\"01/\"&H18&\"/\"&B5)-WEEKDAY(DATEVALUE(\"01/\"&H18&\"/\"&B5),2)+1)+AE16","v":"2020-05-09"},{"$f":"(DATEVALUE(\"01/\"&H18&\"/\"&B5)-WEEKDAY(DATEVALUE(\"01/\"&H18&\"/\"&B5),2)+1)+AF16","v":"2020-05-10"},null,{"$f":"(DATEVALUE(\"01/\"&P18&\"/\"&B5)-WEEKDAY(DATEVALUE(\"01/\"&P18&\"/\"&B5),2)+1)+Z16","v":"2020-06-01"},{"$f":"(DATEVALUE(\"01/\"&P18&\"/\"&B5)-WEEKDAY(DATEVALUE(\"01/\"&P18&\"/\"&B5),2)+1)+AA16","v":"2020-06-02"},{"$f":"(DATEVALUE(\"01/\"&P18&\"/\"&B5)-WEEKDAY(DATEVALUE(\"01/\"&P18&\"/\"&B5),2)+1)+AB16","v":"2020-06-03"},{"$f":"(DATEVALUE(\"01/\"&P18&\"/\"&B5)-WEEKDAY(DATEVALUE(\"01/\"&P18&\"/\"&B5),2)+1)+AC16","v":"2020-06-04"},{"$f":"(DATEVALUE(\"01/\"&P18&\"/\"&B5)-WEEKDAY(DATEVALUE(\"01/\"&P18&\"/\"&B5),2)+1)+AD16","v":"2020-06-05"},{"$f":"(DATEVALUE(\"01/\"&P18&\"/\"&B5)-WEEKDAY(DATEVALUE(\"01/\"&P18&\"/\"&B5),2)+1)+AE16","v":"2020-06-06"},{"$f":"(DATEVALUE(\"01/\"&P18&\"/\"&B5)-WEEKDAY(DATEVALUE(\"01/\"&P18&\"/\"&B5),2)+1)+AF16","v":"2020-06-07"},null,{"$f":"(DATEVALUE(\"01/\"&X18&\"/\"&B5)-WEEKDAY(DATEVALUE(\"01/\"&X18&\"/\"&B5),2)+1)+Z16","v":"2020-07-06"},{"$f":"(DATEVALUE(\"01/\"&X18&\"/\"&B5)-WEEKDAY(DATEVALUE(\"01/\"&X18&\"/\"&B5),2)+1)+AA16","v":"2020-07-07"},{"$f":"(DATEVALUE(\"01/\"&X18&\"/\"&B5)-WEEKDAY(DATEVALUE(\"01/\"&X18&\"/\"&B5),2)+1)+AB16","v":"2020-07-08"},{"$f":"(DATEVALUE(\"01/\"&X18&\"/\"&B5)-WEEKDAY(DATEVALUE(\"01/\"&X18&\"/\"&B5),2)+1)+AC16","v":"2020-07-09"},{"$f":"(DATEVALUE(\"01/\"&X18&\"/\"&B5)-WEEKDAY(DATEVALUE(\"01/\"&X18&\"/\"&B5),2)+1)+AD16","v":"2020-07-10"},{"$f":"(DATEVALUE(\"01/\"&X18&\"/\"&B5)-WEEKDAY(DATEVALUE(\"01/\"&X18&\"/\"&B5),2)+1)+AE16","v":"2020-07-11"},{"$f":"(DATEVALUE(\"01/\"&X18&\"/\"&B5)-WEEKDAY(DATEVALUE(\"01/\"&X18&\"/\"&B5),2)+1)+AF16","v":"2020-07-12"},null,{"$f":"(ROWS(Z$20:Z25)-1)*7+COLUMNS($Z25:Z25)-1","v":35},{"$f":"(ROWS(AA$20:AA25)-1)*7+COLUMNS($Z25:AA25)-1","v":36},{"$f":"(ROWS(AB$20:AB25)-1)*7+COLUMNS($Z25:AB25)-1","v":37},{"$f":"(ROWS(AC$20:AC25)-1)*7+COLUMNS($Z25:AC25)-1","v":38},{"$f":"(ROWS(AD$20:AD25)-1)*7+COLUMNS($Z25:AD25)-1","v":39},{"$f":"(ROWS(AE$20:AE25)-1)*7+COLUMNS($Z25:AE25)-1","v":40},{"$f":"(ROWS(AF$20:AF25)-1)*7+COLUMNS($Z25:AF25)-1","v":41}]
[]
[null,{"$f":"\"Julio\"&\" • \"&IF(B5=\"\",YEAR(TODAY()),B5)","v":"Julio • 2020"},{"$nulls":5},7,null,{"$f":"\"Agosto\"&\" • \"&IF(B5=\"\",YEAR(TODAY()),B5)","v":"Agosto • 2020"},{"$nulls":5},8,null,{"$f":"\"Septiembre\"&\" • \"&IF(B5=\"\",YEAR(TODAY()),B5)","v":"Septiembre • 2020"},{"$nulls":5},9]
[null,"Lu","Ma","Mi","Ju","Vi","Sá","Do",null,"Lu","Ma","Mi","Ju","Vi","Sá","Do",null,"Lu","Ma","Mi","Ju","Vi","Sá","Do"]
[null,{"$f":"(DATEVALUE(\"01/\"&H27&\"/\"&B5)-WEEKDAY(DATEVALUE(\"01/\"&H27&\"/\"&B5),2)+1)+Z11","v":"2020-06-29"},{"$f":"(DATEVALUE(\"01/\"&H27&\"/\"&B5)-WEEKDAY(DATEVALUE(\"01/\"&H27&\"/\"&B5),2)+1)+AA11","v":"2020-06-30"},{"$f":"(DATEVALUE(\"01/\"&H27&\"/\"&B5)-WEEKDAY(DATEVALUE(\"01/\"&H27&\"/\"&B5),2)+1)+AB11","v":"2020-07-01"},{"$f":"(DATEVALUE(\"01/\"&H27&\"/\"&B5)-WEEKDAY(DATEVALUE(\"01/\"&H27&\"/\"&B5),2)+1)+AC11","v":"2020-07-02"},{"$f":"(DATEVALUE(\"01/\"&H27&\"/\"&B5)-WEEKDAY(DATEVALUE(\"01/\"&H27&\"/\"&B5),2)+1)+AD11","v":"2020-07-03"},{"$f":"(DATEVALUE(\"01/\"&H27&\"/\"&B5)-WEEKDAY(DATEVALUE(\"01/\"&H27&\"/\"&B5),2)+1)+AE11","v":"2020-07-04"},{"$f":"(DATEVALUE(\"01/\"&H27&\"/\"&B5)-WEEKDAY(DATEVALUE(\"01/\"&H27&\"/\"&B5),2)+1)+AF11","v":"2020-07-05"},null,{"$f":"(DATEVALUE(\"01/\"&P27&\"/\"&B5)-WEEKDAY(DATEVALUE(\"01/\"&P27&\"/\"&B5),2)+1)+Z11","v":"2020-07-27"},{"$f":"(DATEVALUE(\"01/\"&P27&\"/\"&B5)-WEEKDAY(DATEVALUE(\"01/\"&P27&\"/\"&B5),2)+1)+AA11","v":"2020-07-28"},{"$f":"(DATEVALUE(\"01/\"&P27&\"/\"&B5)-WEEKDAY(DATEVALUE(\"01/\"&P27&\"/\"&B5),2)+1)+AB11","v":"2020-07-29"},{"$f":"(DATEVALUE(\"01/\"&P27&\"/\"&B5)-WEEKDAY(DATEVALUE(\"01/\"&P27&\"/\"&B5),2)+1)+AC11","v":"2020-07-30"},{"$f":"(DATEVALUE(\"01/\"&P27&\"/\"&B5)-WEEKDAY(DATEVALUE(\"01/\"&P27&\"/\"&B5),2)+1)+AD11","v":"2020-07-31"},{"$f":"(DATEVALUE(\"01/\"&P27&\"/\"&B5)-WEEKDAY(DATEVALUE(\"01/\"&P27&\"/\"&B5),2)+1)+AE11","v":"2020-08-01"},{"$f":"(DATEVALUE(\"01/\"&P27&\"/\"&B5)-WEEKDAY(DATEVALUE(\"01/\"&P27&\"/\"&B5),2)+1)+AF11","v":"2020-08-02"},null,{"$f":"(DATEVALUE(\"01/\"&X27&\"/\"&B5)-WEEKDAY(DATEVALUE(\"01/\"&X27&\"/\"&B5),2)+1)+Z11","v":"2020-08-31"},{"$f":"(DATEVALUE(\"01/\"&X27&\"/\"&B5)-WEEKDAY(DATEVALUE(\"01/\"&X27&\"/\"&B5),2)+1)+AA11","v":"2020-09-01"},{"$f":"(DATEVALUE(\"01/\"&X27&\"/\"&B5)-WEEKDAY(DATEVALUE(\"01/\"&X27&\"/\"&B5),2)+1)+AB11","v":"2020-09-02"},{"$f":"(DATEVALUE(\"01/\"&X27&\"/\"&B5)-WEEKDAY(DATEVALUE(\"01/\"&X27&\"/\"&B5),2)+1)+AC11","v":"2020-09-03"},{"$f":"(DATEVALUE(\"01/\"&X27&\"/\"&B5)-WEEKDAY(DATEVALUE(\"01/\"&X27&\"/\"&B5),2)+1)+AD11","v":"2020-09-04"},{"$f":"(DATEVALUE(\"01/\"&X27&\"/\"&B5)-WEEKDAY(DATEVALUE(\"01/\"&X27&\"/\"&B5),2)+1)+AE11","v":"2020-09-05"},{"$f":"(DATEVALUE(\"01/\"&X27&\"/\"&B5)-WEEKDAY(DATEVALUE(\"01/\"&X27&\"/\"&B5),2)+1)+AF11","v":"2020-09-06"}]
[null,{"$f":"(DATEVALUE(\"01/\"&H27&\"/\"&B5)-WEEKDAY(DATEVALUE(\"01/\"&H27&\"/\"&B5),2)+1)+Z12","v":"2020-07-06"},{"$f":"(DATEVALUE(\"01/\"&H27&\"/\"&B5)-WEEKDAY(DATEVALUE(\"01/\"&H27&\"/\"&B5),2)+1)+AA12","v":"2020-07-07"},{"$f":"(DATEVALUE(\"01/\"&H27&\"/\"&B5)-WEEKDAY(DATEVALUE(\"01/\"&H27&\"/\"&B5),2)+1)+AB12","v":"2020-07-08"},{"$f":"(DATEVALUE(\"01/\"&H27&\"/\"&B5)-WEEKDAY(DATEVALUE(\"01/\"&H27&\"/\"&B5),2)+1)+AC12","v":"2020-07-09"},{"$f":"(DATEVALUE(\"01/\"&H27&\"/\"&B5)-WEEKDAY(DATEVALUE(\"01/\"&H27&\"/\"&B5),2)+1)+AD12","v":"2020-07-10"},{"$f":"(DATEVALUE(\"01/\"&H27&\"/\"&B5)-WEEKDAY(DATEVALUE(\"01/\"&H27&\"/\"&B5),2)+1)+AE12","v":"2020-07-11"},{"$f":"(DATEVALUE(\"01/\"&H27&\"/\"&B5)-WEEKDAY(DATEVALUE(\"01/\"&H27&\"/\"&B5),2)+1)+AF12","v":"2020-07-12"},null,{"$f":"(DATEVALUE(\"01/\"&P27&\"/\"&B5)-WEEKDAY(DATEVALUE(\"01/\"&P27&\"/\"&B5),2)+1)+Z12","v":"2020-08-03"},{"$f":"(DATEVALUE(\"01/\"&P27&\"/\"&B5)-WEEKDAY(DATEVALUE(\"01/\"&P27&\"/\"&B5),2)+1)+AA12","v":"2020-08-04"},{"$f":"(DATEVALUE(\"01/\"&P27&\"/\"&B5)-WEEKDAY(DATEVALUE(\"01/\"&P27&\"/\"&B5),2)+1)+AB12","v":"2020-08-05"},{"$f":"(DATEVALUE(\"01/\"&P27&\"/\"&B5)-WEEKDAY(DATEVALUE(\"01/\"&P27&\"/\"&B5),2)+1)+AC12","v":"2020-08-06"},{"$f":"(DATEVALUE(\"01/\"&P27&\"/\"&B5)-WEEKDAY(DATEVALUE(\"01/\"&P27&\"/\"&B5),2)+1)+AD12","v":"2020-08-07"},{"$f":"(DATEVALUE(\"01/\"&P27&\"/\"&B5)-WEEKDAY(DATEVALUE(\"01/\"&P27&\"/\"&B5),2)+1)+AE12","v":"2020-08-08"},{"$f":"(DATEVALUE(\"01/\"&P27&\"/\"&B5)-WEEKDAY(DATEVALUE(\"01/\"&P27&\"/\"&B5),2)+1)+AF12","v":"2020-08-09"},null,{"$f":"(DATEVALUE(\"01/\"&X27&\"/\"&B5)-WEEKDAY(DATEVALUE(\"01/\"&X27&\"/\"&B5),2)+1)+Z12","v":"2020-09-07"},{"$f":"(DATEVALUE(\"01/\"&X27&\"/\"&B5)-WEEKDAY(DATEVALUE(\"01/\"&X27&\"/\"&B5),2)+1)+AA12","v":"2020-09-08"},{"$f":"(DATEVALUE(\"01/\"&X27&\"/\"&B5)-WEEKDAY(DATEVALUE(\"01/\"&X27&\"/\"&B5),2)+1)+AB12","v":"2020-09-09"},{"$f":"(DATEVALUE(\"01/\"&X27&\"/\"&B5)-WEEKDAY(DATEVALUE(\"01/\"&X27&\"/\"&B5),2)+1)+AC12","v":"2020-09-10"},{"$f":"(DATEVALUE(\"01/\"&X27&\"/\"&B5)-WEEKDAY(DATEVALUE(\"01/\"&X27&\"/\"&B5),2)+1)+AD12","v":"2020-09-11"},{"$f":"(DATEVALUE(\"01/\"&X27&\"/\"&B5)-WEEKDAY(DATEVALUE(\"01/\"&X27&\"/\"&B5),2)+1)+AE12","v":"2020-09-12"},{"$f":"(DATEVALUE(\"01/\"&X27&\"/\"&B5)-WEEKDAY(DATEVALUE(\"01/\"&X27&\"/\"&B5),2)+1)+AF12","v":"2020-09-13"}]
[null,{"$f":"(DATEVALUE(\"01/\"&H27&\"/\"&B5)-WEEKDAY(DATEVALUE(\"01/\"&H27&\"/\"&B5),2)+1)+Z13","v":"2020-07-13"},{"$f":"(DATEVALUE(\"01/\"&H27&\"/\"&B5)-WEEKDAY(DATEVALUE(\"01/\"&H27&\"/\"&B5),2)+1)+AA13","v":"2020-07-14"},{"$f":"(DATEVALUE(\"01/\"&H27&\"/\"&B5)-WEEKDAY(DATEVALUE(\"01/\"&H27&\"/\"&B5),2)+1)+AB13","v":"2020-07-15"},{"$f":"(DATEVALUE(\"01/\"&H27&\"/\"&B5)-WEEKDAY(DATEVALUE(\"01/\"&H27&\"/\"&B5),2)+1)+AC13","v":"2020-07-16"},{"$f":"(DATEVALUE(\"01/\"&H27&\"/\"&B5)-WEEKDAY(DATEVALUE(\"01/\"&H27&\"/\"&B5),2)+1)+AD13","v":"2020-07-17"},{"$f":"(DATEVALUE(\"01/\"&H27&\"/\"&B5)-WEEKDAY(DATEVALUE(\"01/\"&H27&\"/\"&B5),2)+1)+AE13","v":"2020-07-18"},{"$f":"(DATEVALUE(\"01/\"&H27&\"/\"&B5)-WEEKDAY(DATEVALUE(\"01/\"&H27&\"/\"&B5),2)+1)+AF13","v":"2020-07-19"},null,{"$f":"(DATEVALUE(\"01/\"&P27&\"/\"&B5)-WEEKDAY(DATEVALUE(\"01/\"&P27&\"/\"&B5),2)+1)+Z13","v":"2020-08-10"},{"$f":"(DATEVALUE(\"01/\"&P27&\"/\"&B5)-WEEKDAY(DATEVALUE(\"01/\"&P27&\"/\"&B5),2)+1)+AA13","v":"2020-08-11"},{"$f":"(DATEVALUE(\"01/\"&P27&\"/\"&B5)-WEEKDAY(DATEVALUE(\"01/\"&P27&\"/\"&B5),2)+1)+AB13","v":"2020-08-12"},{"$f":"(DATEVALUE(\"01/\"&P27&\"/\"&B5)-WEEKDAY(DATEVALUE(\"01/\"&P27&\"/\"&B5),2)+1)+AC13","v":"2020-08-13"},{"$f":"(DATEVALUE(\"01/\"&P27&\"/\"&B5)-WEEKDAY(DATEVALUE(\"01/\"&P27&\"/\"&B5),2)+1)+AD13","v":"2020-08-14"},{"$f":"(DATEVALUE(\"01/\"&P27&\"/\"&B5)-WEEKDAY(DATEVALUE(\"01/\"&P27&\"/\"&B5),2)+1)+AE13","v":"2020-08-15"},{"$f":"(DATEVALUE(\"01/\"&P27&\"/\"&B5)-WEEKDAY(DATEVALUE(\"01/\"&P27&\"/\"&B5),2)+1)+AF13","v":"2020-08-16"},null,{"$f":"(DATEVALUE(\"01/\"&X27&\"/\"&B5)-WEEKDAY(DATEVALUE(\"01/\"&X27&\"/\"&B5),2)+1)+Z13","v":"2020-09-14"},{"$f":"(DATEVALUE(\"01/\"&X27&\"/\"&B5)-WEEKDAY(DATEVALUE(\"01/\"&X27&\"/\"&B5),2)+1)+AA13","v":"2020-09-15"},{"$f":"(DATEVALUE(\"01/\"&X27&\"/\"&B5)-WEEKDAY(DATEVALUE(\"01/\"&X27&\"/\"&B5),2)+1)+AB13","v":"2020-09-16"},{"$f":"(DATEVALUE(\"01/\"&X27&\"/\"&B5)-WEEKDAY(DATEVALUE(\"01/\"&X27&\"/\"&B5),2)+1)+AC13","v":"2020-09-17"},{"$f":"(DATEVALUE(\"01/\"&X27&\"/\"&B5)-WEEKDAY(DATEVALUE(\"01/\"&X27&\"/\"&B5),2)+1)+AD13","v":"2020-09-18"},{"$f":"(DATEVALUE(\"01/\"&X27&\"/\"&B5)-WEEKDAY(DATEVALUE(\"01/\"&X27&\"/\"&B5),2)+1)+AE13","v":"2020-09-19"},{"$f":"(DATEVALUE(\"01/\"&X27&\"/\"&B5)-WEEKDAY(DATEVALUE(\"01/\"&X27&\"/\"&B5),2)+1)+AF13","v":"2020-09-20"}]
[null,{"$f":"(DATEVALUE(\"01/\"&H27&\"/\"&B5)-WEEKDAY(DATEVALUE(\"01/\"&H27&\"/\"&B5),2)+1)+Z14","v":"2020-07-20"},{"$f":"(DATEVALUE(\"01/\"&H27&\"/\"&B5)-WEEKDAY(DATEVALUE(\"01/\"&H27&\"/\"&B5),2)+1)+AA14","v":"2020-07-21"},{"$f":"(DATEVALUE(\"01/\"&H27&\"/\"&B5)-WEEKDAY(DATEVALUE(\"01/\"&H27&\"/\"&B5),2)+1)+AB14","v":"2020-07-22"},{"$f":"(DATEVALUE(\"01/\"&H27&\"/\"&B5)-WEEKDAY(DATEVALUE(\"01/\"&H27&\"/\"&B5),2)+1)+AC14","v":"2020-07-23"},{"$f":"(DATEVALUE(\"01/\"&H27&\"/\"&B5)-WEEKDAY(DATEVALUE(\"01/\"&H27&\"/\"&B5),2)+1)+AD14","v":"2020-07-24"},{"$f":"(DATEVALUE(\"01/\"&H27&\"/\"&B5)-WEEKDAY(DATEVALUE(\"01/\"&H27&\"/\"&B5),2)+1)+AE14","v":"2020-07-25"},{"$f":"(DATEVALUE(\"01/\"&H27&\"/\"&B5)-WEEKDAY(DATEVALUE(\"01/\"&H27&\"/\"&B5),2)+1)+AF14","v":"2020-07-26"},null,{"$f":"(DATEVALUE(\"01/\"&P27&\"/\"&B5)-WEEKDAY(DATEVALUE(\"01/\"&P27&\"/\"&B5),2)+1)+Z14","v":"2020-08-17"},{"$f":"(DATEVALUE(\"01/\"&P27&\"/\"&B5)-WEEKDAY(DATEVALUE(\"01/\"&P27&\"/\"&B5),2)+1)+AA14","v":"2020-08-18"},{"$f":"(DATEVALUE(\"01/\"&P27&\"/\"&B5)-WEEKDAY(DATEVALUE(\"01/\"&P27&\"/\"&B5),2)+1)+AB14","v":"2020-08-19"},{"$f":"(DATEVALUE(\"01/\"&P27&\"/\"&B5)-WEEKDAY(DATEVALUE(\"01/\"&P27&\"/\"&B5),2)+1)+AC14","v":"2020-08-20"},{"$f":"(DATEVALUE(\"01/\"&P27&\"/\"&B5)-WEEKDAY(DATEVALUE(\"01/\"&P27&\"/\"&B5),2)+1)+AD14","v":"2020-08-21"},{"$f":"(DATEVALUE(\"01/\"&P27&\"/\"&B5)-WEEKDAY(DATEVALUE(\"01/\"&P27&\"/\"&B5),2)+1)+AE14","v":"2020-08-22"},{"$f":"(DATEVALUE(\"01/\"&P27&\"/\"&B5)-WEEKDAY(DATEVALUE(\"01/\"&P27&\"/\"&B5),2)+1)+AF14","v":"2020-08-23"},null,{"$f":"(DATEVALUE(\"01/\"&X27&\"/\"&B5)-WEEKDAY(DATEVALUE(\"01/\"&X27&\"/\"&B5),2)+1)+Z14","v":"2020-09-21"},{"$f":"(DATEVALUE(\"01/\"&X27&\"/\"&B5)-WEEKDAY(DATEVALUE(\"01/\"&X27&\"/\"&B5),2)+1)+AA14","v":"2020-09-22"},{"$f":"(DATEVALUE(\"01/\"&X27&\"/\"&B5)-WEEKDAY(DATEVALUE(\"01/\"&X27&\"/\"&B5),2)+1)+AB14","v":"2020-09-23"},{"$f":"(DATEVALUE(\"01/\"&X27&\"/\"&B5)-WEEKDAY(DATEVALUE(\"01/\"&X27&\"/\"&B5),2)+1)+AC14","v":"2020-09-24"},{"$f":"(DATEVALUE(\"01/\"&X27&\"/\"&B5)-WEEKDAY(DATEVALUE(\"01/\"&X27&\"/\"&B5),2)+1)+AD14","v":"2020-09-25"},{"$f":"(DATEVALUE(\"01/\"&X27&\"/\"&B5)-WEEKDAY(DATEVALUE(\"01/\"&X27&\"/\"&B5),2)+1)+AE14","v":"2020-09-26"},{"$f":"(DATEVALUE(\"01/\"&X27&\"/\"&B5)-WEEKDAY(DATEVALUE(\"01/\"&X27&\"/\"&B5),2)+1)+AF14","v":"2020-09-27"}]
[null,{"$f":"(DATEVALUE(\"01/\"&H27&\"/\"&B5)-WEEKDAY(DATEVALUE(\"01/\"&H27&\"/\"&B5),2)+1)+Z15","v":"2020-07-27"},{"$f":"(DATEVALUE(\"01/\"&H27&\"/\"&B5)-WEEKDAY(DATEVALUE(\"01/\"&H27&\"/\"&B5),2)+1)+AA15","v":"2020-07-28"},{"$f":"(DATEVALUE(\"01/\"&H27&\"/\"&B5)-WEEKDAY(DATEVALUE(\"01/\"&H27&\"/\"&B5),2)+1)+AB15","v":"2020-07-29"},{"$f":"(DATEVALUE(\"01/\"&H27&\"/\"&B5)-WEEKDAY(DATEVALUE(\"01/\"&H27&\"/\"&B5),2)+1)+AC15","v":"2020-07-30"},{"$f":"(DATEVALUE(\"01/\"&H27&\"/\"&B5)-WEEKDAY(DATEVALUE(\"01/\"&H27&\"/\"&B5),2)+1)+AD15","v":"2020-07-31"},{"$f":"(DATEVALUE(\"01/\"&H27&\"/\"&B5)-WEEKDAY(DATEVALUE(\"01/\"&H27&\"/\"&B5),2)+1)+AE15","v":"2020-08-01"},{"$f":"(DATEVALUE(\"01/\"&H27&\"/\"&B5)-WEEKDAY(DATEVALUE(\"01/\"&H27&\"/\"&B5),2)+1)+AF15","v":"2020-08-02"},null,{"$f":"(DATEVALUE(\"01/\"&P27&\"/\"&B5)-WEEKDAY(DATEVALUE(\"01/\"&P27&\"/\"&B5),2)+1)+Z15","v":"2020-08-24"},{"$f":"(DATEVALUE(\"01/\"&P27&\"/\"&B5)-WEEKDAY(DATEVALUE(\"01/\"&P27&\"/\"&B5),2)+1)+AA15","v":"2020-08-25"},{"$f":"(DATEVALUE(\"01/\"&P27&\"/\"&B5)-WEEKDAY(DATEVALUE(\"01/\"&P27&\"/\"&B5),2)+1)+AB15","v":"2020-08-26"},{"$f":"(DATEVALUE(\"01/\"&P27&\"/\"&B5)-WEEKDAY(DATEVALUE(\"01/\"&P27&\"/\"&B5),2)+1)+AC15","v":"2020-08-27"},{"$f":"(DATEVALUE(\"01/\"&P27&\"/\"&B5)-WEEKDAY(DATEVALUE(\"01/\"&P27&\"/\"&B5),2)+1)+AD15","v":"2020-08-28"},{"$f":"(DATEVALUE(\"01/\"&P27&\"/\"&B5)-WEEKDAY(DATEVALUE(\"01/\"&P27&\"/\"&B5),2)+1)+AE15","v":"2020-08-29"},{"$f":"(DATEVALUE(\"01/\"&P27&\"/\"&B5)-WEEKDAY(DATEVALUE(\"01/\"&P27&\"/\"&B5),2)+1)+AF15","v":"2020-08-30"},null,{"$f":"(DATEVALUE(\"01/\"&X27&\"/\"&B5)-WEEKDAY(DATEVALUE(\"01/\"&X27&\"/\"&B5),2)+1)+Z15","v":"2020-09-28"},{"$f":"(DATEVALUE(\"01/\"&X27&\"/\"&B5)-WEEKDAY(DATEVALUE(\"01/\"&X27&\"/\"&B5),2)+1)+AA15","v":"2020-09-29"},{"$f":"(DATEVALUE(\"01/\"&X27&\"/\"&B5)-WEEKDAY(DATEVALUE(\"01/\"&X27&\"/\"&B5),2)+1)+AB15","v":"2020-09-30"},{"$f":"(DATEVALUE(\"01/\"&X27&\"/\"&B5)-WEEKDAY(DATEVALUE(\"01/\"&X27&\"/\"&B5),2)+1)+AC15","v":"2020-10-01"},{"$f":"(DATEVALUE(\"01/\"&X27&\"/\"&B5)-WEEKDAY(DATEVALUE(\"01/\"&X27&\"/\"&B5),2)+1)+AD15","v":"2020-10-02"},{"$f":"(DATEVALUE(\"01/\"&X27&\"/\"&B5)-WEEKDAY(DATEVALUE(\"01/\"&X27&\"/\"&B5),2)+1)+AE15","v":"2020-10-03"},{"$f":"(DATEVALUE(\"01/\"&X27&\"/\"&B5)-WEEKDAY(DATEVALUE(\"01/\"&X27&\"/\"&B5),2)+1)+AF15","v":"2020-10-04"}]
[null,{"$f":"(DATEVALUE(\"01/\"&H27&\"/\"&B5)-WEEKDAY(DATEVALUE(\"01/\"&H27&\"/\"&B5),2)+1)+Z16","v":"2020-08-03"},{"$f":"(DATEVALUE(\"01/\"&H27&\"/\"&B5)-WEEKDAY(DATEVALUE(\"01/\"&H27&\"/\"&B5),2)+1)+AA16","v":"2020-08-04"},{"$f":"(DATEVALUE(\"01/\"&H27&\"/\"&B5)-WEEKDAY(DATEVALUE(\"01/\"&H27&\"/\"&B5),2)+1)+AB16","v":"2020-08-05"},{"$f":"(DATEVALUE(\"01/\"&H27&\"/\"&B5)-WEEKDAY(DATEVALUE(\"01/\"&H27&\"/\"&B5),2)+1)+AC16","v":"2020-08-06"},{"$f":"(DATEVALUE(\"01/\"&H27&\"/\"&B5)-WEEKDAY(DATEVALUE(\"01/\"&H27&\"/\"&B5),2)+1)+AD16","v":"2020-08-07"},{"$f":"(DATEVALUE(\"01/\"&H27&\"/\"&B5)-WEEKDAY(DATEVALUE(\"01/\"&H27&\"/\"&B5),2)+1)+AE16","v":"2020-08-08"},{"$f":"(DATEVALUE(\"01/\"&H27&\"/\"&B5)-WEEKDAY(DATEVALUE(\"01/\"&H27&\"/\"&B5),2)+1)+AF16","v":"2020-08-09"},null,{"$f":"(DATEVALUE(\"01/\"&P27&\"/\"&B5)-WEEKDAY(DATEVALUE(\"01/\"&P27&\"/\"&B5),2)+1)+Z16","v":"2020-08-31"},{"$f":"(DATEVALUE(\"01/\"&P27&\"/\"&B5)-WEEKDAY(DATEVALUE(\"01/\"&P27&\"/\"&B5),2)+1)+AA16","v":"2020-09-01"},{"$f":"(DATEVALUE(\"01/\"&P27&\"/\"&B5)-WEEKDAY(DATEVALUE(\"01/\"&P27&\"/\"&B5),2)+1)+AB16","v":"2020-09-02"},{"$f":"(DATEVALUE(\"01/\"&P27&\"/\"&B5)-WEEKDAY(DATEVALUE(\"01/\"&P27&\"/\"&B5),2)+1)+AC16","v":"2020-09-03"},{"$f":"(DATEVALUE(\"01/\"&P27&\"/\"&B5)-WEEKDAY(DATEVALUE(\"01/\"&P27&\"/\"&B5),2)+1)+AD16","v":"2020-09-04"},{"$f":"(DATEVALUE(\"01/\"&P27&\"/\"&B5)-WEEKDAY(DATEVALUE(\"01/\"&P27&\"/\"&B5),2)+1)+AE16","v":"2020-09-05"},{"$f":"(DATEVALUE(\"01/\"&P27&\"/\"&B5)-WEEKDAY(DATEVALUE(\"01/\"&P27&\"/\"&B5),2)+1)+AF16","v":"2020-09-06"},null,{"$f":"(DATEVALUE(\"01/\"&X27&\"/\"&B5)-WEEKDAY(DATEVALUE(\"01/\"&X27&\"/\"&B5),2)+1)+Z16","v":"2020-10-05"},{"$f":"(DATEVALUE(\"01/\"&X27&\"/\"&B5)-WEEKDAY(DATEVALUE(\"01/\"&X27&\"/\"&B5),2)+1)+AA16","v":"2020-10-06"},{"$f":"(DATEVALUE(\"01/\"&X27&\"/\"&B5)-WEEKDAY(DATEVALUE(\"01/\"&X27&\"/\"&B5),2)+1)+AB16","v":"2020-10-07"},{"$f":"(DATEVALUE(\"01/\"&X27&\"/\"&B5)-WEEKDAY(DATEVALUE(\"01/\"&X27&\"/\"&B5),2)+1)+AC16","v":"2020-10-08"},{"$f":"(DATEVALUE(\"01/\"&X27&\"/\"&B5)-WEEKDAY(DATEVALUE(\"01/\"&X27&\"/\"&B5),2)+1)+AD16","v":"2020-10-09"},{"$f":"(DATEVALUE(\"01/\"&X27&\"/\"&B5)-WEEKDAY(DATEVALUE(\"01/\"&X27&\"/\"&B5),2)+1)+AE16","v":"2020-10-10"},{"$f":"(DATEVALUE(\"01/\"&X27&\"/\"&B5)-WEEKDAY(DATEVALUE(\"01/\"&X27&\"/\"&B5),2)+1)+AF16","v":"2020-10-11"}]
[]
[null,{"$f":"\"Octubre\"&\" • \"&IF(B5=\"\",YEAR(TODAY()),B5)","v":"Octubre • 2020"},{"$nulls":5},10,null,{"$f":"\"Noviembre\"&\" • \"&IF(B5=\"\",YEAR(TODAY()),B5)","v":"Noviembre • 2020"},{"$nulls":5},11,null,{"$f":"\"Diciembre\"&\" • \"&IF(B5=\"\",YEAR(TODAY()),B5)","v":"Diciembre • 2020"},{"$nulls":5},12]
[null,"Lu","Ma","Mi","Ju","Vi","Sá","Do",null,"Lu","Ma","Mi","Ju","Vi","Sá","Do",null,"Lu","Ma","Mi","Ju","Vi","Sá","Do"]
[null,{"$f":"(DATEVALUE(\"01/\"&H36&\"/\"&B5)-WEEKDAY(DATEVALUE(\"01/\"&H36&\"/\"&B5),2)+1)+Z11","v":"2020-09-28"},{"$f":"(DATEVALUE(\"01/\"&H36&\"/\"&B5)-WEEKDAY(DATEVALUE(\"01/\"&H36&\"/\"&B5),2)+1)+AA11","v":"2020-09-29"},{"$f":"(DATEVALUE(\"01/\"&H36&\"/\"&B5)-WEEKDAY(DATEVALUE(\"01/\"&H36&\"/\"&B5),2)+1)+AB11","v":"2020-09-30"},{"$f":"(DATEVALUE(\"01/\"&H36&\"/\"&B5)-WEEKDAY(DATEVALUE(\"01/\"&H36&\"/\"&B5),2)+1)+AC11","v":"2020-10-01"},{"$f":"(DATEVALUE(\"01/\"&H36&\"/\"&B5)-WEEKDAY(DATEVALUE(\"01/\"&H36&\"/\"&B5),2)+1)+AD11","v":"2020-10-02"},{"$f":"(DATEVALUE(\"01/\"&H36&\"/\"&B5)-WEEKDAY(DATEVALUE(\"01/\"&H36&\"/\"&B5),2)+1)+AE11","v":"2020-10-03"},{"$f":"(DATEVALUE(\"01/\"&H36&\"/\"&B5)-WEEKDAY(DATEVALUE(\"01/\"&H36&\"/\"&B5),2)+1)+AF11","v":"2020-10-04"},null,{"$f":"(DATEVALUE(\"01/\"&P36&\"/\"&B5)-WEEKDAY(DATEVALUE(\"01/\"&P36&\"/\"&B5),2)+1)+Z11","v":"2020-10-26"},{"$f":"(DATEVALUE(\"01/\"&P36&\"/\"&B5)-WEEKDAY(DATEVALUE(\"01/\"&P36&\"/\"&B5),2)+1)+AA11","v":"2020-10-27"},{"$f":"(DATEVALUE(\"01/\"&P36&\"/\"&B5)-WEEKDAY(DATEVALUE(\"01/\"&P36&\"/\"&B5),2)+1)+AB11","v":"2020-10-28"},{"$f":"(DATEVALUE(\"01/\"&P36&\"/\"&B5)-WEEKDAY(DATEVALUE(\"01/\"&P36&\"/\"&B5),2)+1)+AC11","v":"2020-10-29"},{"$f":"(DATEVALUE(\"01/\"&P36&\"/\"&B5)-WEEKDAY(DATEVALUE(\"01/\"&P36&\"/\"&B5),2)+1)+AD11","v":"2020-10-30"},{"$f":"(DATEVALUE(\"01/\"&P36&\"/\"&B5)-WEEKDAY(DATEVALUE(\"01/\"&P36&\"/\"&B5),2)+1)+AE11","v":"2020-10-31"},{"$f":"(DATEVALUE(\"01/\"&P36&\"/\"&B5)-WEEKDAY(DATEVALUE(\"01/\"&P36&\"/\"&B5),2)+1)+AF11","v":"2020-11-01"},null,{"$f":"(DATEVALUE(\"01/\"&X36&\"/\"&B5)-WEEKDAY(DATEVALUE(\"01/\"&X36&\"/\"&B5),2)+1)+Z11","v":"2020-11-30"},{"$f":"(DATEVALUE(\"01/\"&X36&\"/\"&B5)-WEEKDAY(DATEVALUE(\"01/\"&X36&\"/\"&B5),2)+1)+AA11","v":"2020-12-01"},{"$f":"(DATEVALUE(\"01/\"&X36&\"/\"&B5)-WEEKDAY(DATEVALUE(\"01/\"&X36&\"/\"&B5),2)+1)+AB11","v":"2020-12-02"},{"$f":"(DATEVALUE(\"01/\"&X36&\"/\"&B5)-WEEKDAY(DATEVALUE(\"01/\"&X36&\"/\"&B5),2)+1)+AC11","v":"2020-12-03"},{"$f":"(DATEVALUE(\"01/\"&X36&\"/\"&B5)-WEEKDAY(DATEVALUE(\"01/\"&X36&\"/\"&B5),2)+1)+AD11","v":"2020-12-04"},{"$f":"(DATEVALUE(\"01/\"&X36&\"/\"&B5)-WEEKDAY(DATEVALUE(\"01/\"&X36&\"/\"&B5),2)+1)+AE11","v":"2020-12-05"},{"$f":"(DATEVALUE(\"01/\"&X36&\"/\"&B5)-WEEKDAY(DATEVALUE(\"01/\"&X36&\"/\"&B5),2)+1)+AF11","v":"2020-12-06"}]
[null,{"$f":"(DATEVALUE(\"01/\"&H36&\"/\"&B5)-WEEKDAY(DATEVALUE(\"01/\"&H36&\"/\"&B5),2)+1)+Z12","v":"2020-10-05"},{"$f":"(DATEVALUE(\"01/\"&H36&\"/\"&B5)-WEEKDAY(DATEVALUE(\"01/\"&H36&\"/\"&B5),2)+1)+AA12","v":"2020-10-06"},{"$f":"(DATEVALUE(\"01/\"&H36&\"/\"&B5)-WEEKDAY(DATEVALUE(\"01/\"&H36&\"/\"&B5),2)+1)+AB12","v":"2020-10-07"},{"$f":"(DATEVALUE(\"01/\"&H36&\"/\"&B5)-WEEKDAY(DATEVALUE(\"01/\"&H36&\"/\"&B5),2)+1)+AC12","v":"2020-10-08"},{"$f":"(DATEVALUE(\"01/\"&H36&\"/\"&B5)-WEEKDAY(DATEVALUE(\"01/\"&H36&\"/\"&B5),2)+1)+AD12","v":"2020-10-09"},{"$f":"(DATEVALUE(\"01/\"&H36&\"/\"&B5)-WEEKDAY(DATEVALUE(\"01/\"&H36&\"/\"&B5),2)+1)+AE12","v":"2020-10-10"},{"$f":"(DATEVALUE(\"01/\"&H36&\"/\"&B5)-WEEKDAY(DATEVALUE(\"01/\"&H36&\"/\"&B5),2)+1)+AF12","v":"2020-10-11"},null,{"$f":"(DATEVALUE(\"01/\"&P36&\"/\"&B5)-WEEKDAY(DATEVALUE(\"01/\"&P36&\"/\"&B5),2)+1)+Z12","v":"2020-11-02"},{"$f":"(DATEVALUE(\"01/\"&P36&\"/\"&B5)-WEEKDAY(DATEVALUE(\"01/\"&P36&\"/\"&B5),2)+1)+AA12","v":"2020-11-03"},{"$f":"(DATEVALUE(\"01/\"&P36&\"/\"&B5)-WEEKDAY(DATEVALUE(\"01/\"&P36&\"/\"&B5),2)+1)+AB12","v":"2020-11-04"},{"$f":"(DATEVALUE(\"01/\"&P36&\"/\"&B5)-WEEKDAY(DATEVALUE(\"01/\"&P36&\"/\"&B5),2)+1)+AC12","v":"2020-11-05"},{"$f":"(DATEVALUE(\"01/\"&P36&\"/\"&B5)-WEEKDAY(DATEVALUE(\"01/\"&P36&\"/\"&B5),2)+1)+AD12","v":"2020-11-06"},{"$f":"(DATEVALUE(\"01/\"&P36&\"/\"&B5)-WEEKDAY(DATEVALUE(\"01/\"&P36&\"/\"&B5),2)+1)+AE12","v":"2020-11-07"},{"$f":"(DATEVALUE(\"01/\"&P36&\"/\"&B5)-WEEKDAY(DATEVALUE(\"01/\"&P36&\"/\"&B5),2)+1)+AF12","v":"2020-11-08"},null,{"$f":"(DATEVALUE(\"01/\"&X36&\"/\"&B5)-WEEKDAY(DATEVALUE(\"01/\"&X36&\"/\"&B5),2)+1)+Z12","v":"2020-12-07"},{"$f":"(DATEVALUE(\"01/\"&X36&\"/\"&B5)-WEEKDAY(DATEVALUE(\"01/\"&X36&\"/\"&B5),2)+1)+AA12","v":"2020-12-08"},{"$f":"(DATEVALUE(\"01/\"&X36&\"/\"&B5)-WEEKDAY(DATEVALUE(\"01/\"&X36&\"/\"&B5),2)+1)+AB12","v":"2020-12-09"},{"$f":"(DATEVALUE(\"01/\"&X36&\"/\"&B5)-WEEKDAY(DATEVALUE(\"01/\"&X36&\"/\"&B5),2)+1)+AC12","v":"2020-12-10"},{"$f":"(DATEVALUE(\"01/\"&X36&\"/\"&B5)-WEEKDAY(DATEVALUE(\"01/\"&X36&\"/\"&B5),2)+1)+AD12","v":"2020-12-11"},{"$f":"(DATEVALUE(\"01/\"&X36&\"/\"&B5)-WEEKDAY(DATEVALUE(\"01/\"&X36&\"/\"&B5),2)+1)+AE12","v":"2020-12-12"},{"$f":"(DATEVALUE(\"01/\"&X36&\"/\"&B5)-WEEKDAY(DATEVALUE(\"01/\"&X36&\"/\"&B5),2)+1)+AF12","v":"2020-12-13"}]
[null,{"$f":"(DATEVALUE(\"01/\"&H36&\"/\"&B5)-WEEKDAY(DATEVALUE(\"01/\"&H36&\"/\"&B5),2)+1)+Z13","v":"2020-10-12"},{"$f":"(DATEVALUE(\"01/\"&H36&\"/\"&B5)-WEEKDAY(DATEVALUE(\"01/\"&H36&\"/\"&B5),2)+1)+AA13","v":"2020-10-13"},{"$f":"(DATEVALUE(\"01/\"&H36&\"/\"&B5)-WEEKDAY(DATEVALUE(\"01/\"&H36&\"/\"&B5),2)+1)+AB13","v":"2020-10-14"},{"$f":"(DATEVALUE(\"01/\"&H36&\"/\"&B5)-WEEKDAY(DATEVALUE(\"01/\"&H36&\"/\"&B5),2)+1)+AC13","v":"2020-10-15"},{"$f":"(DATEVALUE(\"01/\"&H36&\"/\"&B5)-WEEKDAY(DATEVALUE(\"01/\"&H36&\"/\"&B5),2)+1)+AD13","v":"2020-10-16"},{"$f":"(DATEVALUE(\"01/\"&H36&\"/\"&B5)-WEEKDAY(DATEVALUE(\"01/\"&H36&\"/\"&B5),2)+1)+AE13","v":"2020-10-17"},{"$f":"(DATEVALUE(\"01/\"&H36&\"/\"&B5)-WEEKDAY(DATEVALUE(\"01/\"&H36&\"/\"&B5),2)+1)+AF13","v":"2020-10-18"},null,{"$f":"(DATEVALUE(\"01/\"&P36&\"/\"&B5)-WEEKDAY(DATEVALUE(\"01/\"&P36&\"/\"&B5),2)+1)+Z13","v":"2020-11-09"},{"$f":"(DATEVALUE(\"01/\"&P36&\"/\"&B5)-WEEKDAY(DATEVALUE(\"01/\"&P36&\"/\"&B5),2)+1)+AA13","v":"2020-11-10"},{"$f":"(DATEVALUE(\"01/\"&P36&\"/\"&B5)-WEEKDAY(DATEVALUE(\"01/\"&P36&\"/\"&B5),2)+1)+AB13","v":"2020-11-11"},{"$f":"(DATEVALUE(\"01/\"&P36&\"/\"&B5)-WEEKDAY(DATEVALUE(\"01/\"&P36&\"/\"&B5),2)+1)+AC13","v":"2020-11-12"},{"$f":"(DATEVALUE(\"01/\"&P36&\"/\"&B5)-WEEKDAY(DATEVALUE(\"01/\"&P36&\"/\"&B5),2)+1)+AD13","v":"2020-11-13"},{"$f":"(DATEVALUE(\"01/\"&P36&\"/\"&B5)-WEEKDAY(DATEVALUE(\"01/\"&P36&\"/\"&B5),2)+1)+AE13","v":"2020-11-14"},{"$f":"(DATEVALUE(\"01/\"&P36&\"/\"&B5)-WEEKDAY(DATEVALUE(\"01/\"&P36&\"/\"&B5),2)+1)+AF13","v":"2020-11-15"},null,{"$f":"(DATEVALUE(\"01/\"&X36&\"/\"&B5)-WEEKDAY(DATEVALUE(\"01/\"&X36&\"/\"&B5),2)+1)+Z13","v":"2020-12-14"},{"$f":"(DATEVALUE(\"01/\"&X36&\"/\"&B5)-WEEKDAY(DATEVALUE(\"01/\"&X36&\"/\"&B5),2)+1)+AA13","v":"2020-12-15"},{"$f":"(DATEVALUE(\"01/\"&X36&\"/\"&B5)-WEEKDAY(DATEVALUE(\"01/\"&X36&\"/\"&B5),2)+1)+AB13","v":"2020-12-16"},{"$f":"(DATEVALUE(\"01/\"&X36&\"/\"&B5)-WEEKDAY(DATEVALUE(\"01/\"&X36&\"/\"&B5),2)+1)+AC13","v":"2020-12-17"},{"$f":"(DATEVALUE(\"01/\"&X36&\"/\"&B5)-WEEKDAY(DATEVALUE(\"01/\"&X36&\"/\"&B5),2)+1)+AD13","v":"2020-12-18"},{"$f":"(DATEVALUE(\"01/\"&X36&\"/\"&B5)-WEEKDAY(DATEVALUE(\"01/\"&X36&\"/\"&B5),2)+1)+AE13","v":"2020-12-19"},{"$f":"(DATEVALUE(\"01/\"&X36&\"/\"&B5)-WEEKDAY(DATEVALUE(\"01/\"&X36&\"/\"&B5),2)+1)+AF13","v":"2020-12-20"}]
[null,{"$f":"(DATEVALUE(\"01/\"&H36&\"/\"&B5)-WEEKDAY(DATEVALUE(\"01/\"&H36&\"/\"&B5),2)+1)+Z14","v":"2020-10-19"},{"$f":"(DATEVALUE(\"01/\"&H36&\"/\"&B5)-WEEKDAY(DATEVALUE(\"01/\"&H36&\"/\"&B5),2)+1)+AA14","v":"2020-10-20"},{"$f":"(DATEVALUE(\"01/\"&H36&\"/\"&B5)-WEEKDAY(DATEVALUE(\"01/\"&H36&\"/\"&B5),2)+1)+AB14","v":"2020-10-21"},{"$f":"(DATEVALUE(\"01/\"&H36&\"/\"&B5)-WEEKDAY(DATEVALUE(\"01/\"&H36&\"/\"&B5),2)+1)+AC14","v":"2020-10-22"},{"$f":"(DATEVALUE(\"01/\"&H36&\"/\"&B5)-WEEKDAY(DATEVALUE(\"01/\"&H36&\"/\"&B5),2)+1)+AD14","v":"2020-10-23"},{"$f":"(DATEVALUE(\"01/\"&H36&\"/\"&B5)-WEEKDAY(DATEVALUE(\"01/\"&H36&\"/\"&B5),2)+1)+AE14","v":"2020-10-24"},{"$f":"(DATEVALUE(\"01/\"&H36&\"/\"&B5)-WEEKDAY(DATEVALUE(\"01/\"&H36&\"/\"&B5),2)+1)+AF14","v":"2020-10-25"},null,{"$f":"(DATEVALUE(\"01/\"&P36&\"/\"&B5)-WEEKDAY(DATEVALUE(\"01/\"&P36&\"/\"&B5),2)+1)+Z14","v":"2020-11-16"},{"$f":"(DATEVALUE(\"01/\"&P36&\"/\"&B5)-WEEKDAY(DATEVALUE(\"01/\"&P36&\"/\"&B5),2)+1)+AA14","v":"2020-11-17"},{"$f":"(DATEVALUE(\"01/\"&P36&\"/\"&B5)-WEEKDAY(DATEVALUE(\"01/\"&P36&\"/\"&B5),2)+1)+AB14","v":"2020-11-18"},{"$f":"(DATEVALUE(\"01/\"&P36&\"/\"&B5)-WEEKDAY(DATEVALUE(\"01/\"&P36&\"/\"&B5),2)+1)+AC14","v":"2020-11-19"},{"$f":"(DATEVALUE(\"01/\"&P36&\"/\"&B5)-WEEKDAY(DATEVALUE(\"01/\"&P36&\"/\"&B5),2)+1)+AD14","v":"2020-11-20"},{"$f":"(DATEVALUE(\"01/\"&P36&\"/\"&B5)-WEEKDAY(DATEVALUE(\"01/\"&P36&\"/\"&B5),2)+1)+AE14","v":"2020-11-21"},{"$f":"(DATEVALUE(\"01/\"&P36&\"/\"&B5)-WEEKDAY(DATEVALUE(\"01/\"&P36&\"/\"&B5),2)+1)+AF14","v":"2020-11-22"},null,{"$f":"(DATEVALUE(\"01/\"&X36&\"/\"&B5)-WEEKDAY(DATEVALUE(\"01/\"&X36&\"/\"&B5),2)+1)+Z14","v":"2020-12-21"},{"$f":"(DATEVALUE(\"01/\"&X36&\"/\"&B5)-WEEKDAY(DATEVALUE(\"01/\"&X36&\"/\"&B5),2)+1)+AA14","v":"2020-12-22"},{"$f":"(DATEVALUE(\"01/\"&X36&\"/\"&B5)-WEEKDAY(DATEVALUE(\"01/\"&X36&\"/\"&B5),2)+1)+AB14","v":"2020-12-23"},{"$f":"(DATEVALUE(\"01/\"&X36&\"/\"&B5)-WEEKDAY(DATEVALUE(\"01/\"&X36&\"/\"&B5),2)+1)+AC14","v":"2020-12-24"},{"$f":"(DATEVALUE(\"01/\"&X36&\"/\"&B5)-WEEKDAY(DATEVALUE(\"01/\"&X36&\"/\"&B5),2)+1)+AD14","v":"2020-12-25"},{"$f":"(DATEVALUE(\"01/\"&X36&\"/\"&B5)-WEEKDAY(DATEVALUE(\"01/\"&X36&\"/\"&B5),2)+1)+AE14","v":"2020-12-26"},{"$f":"(DATEVALUE(\"01/\"&X36&\"/\"&B5)-WEEKDAY(DATEVALUE(\"01/\"&X36&\"/\"&B5),2)+1)+AF14","v":"2020-12-27"}]
[null,{"$f":"(DATEVALUE(\"01/\"&H36&\"/\"&B5)-WEEKDAY(DATEVALUE(\"01/\"&H36&\"/\"&B5),2)+1)+Z15","v":"2020-10-26"},{"$f":"(DATEVALUE(\"01/\"&H36&\"/\"&B5)-WEEKDAY(DATEVALUE(\"01/\"&H36&\"/\"&B5),2)+1)+AA15","v":"2020-10-27"},{"$f":"(DATEVALUE(\"01/\"&H36&\"/\"&B5)-WEEKDAY(DATEVALUE(\"01/\"&H36&\"/\"&B5),2)+1)+AB15","v":"2020-10-28"},{"$f":"(DATEVALUE(\"01/\"&H36&\"/\"&B5)-WEEKDAY(DATEVALUE(\"01/\"&H36&\"/\"&B5),2)+1)+AC15","v":"2020-10-29"},{"$f":"(DATEVALUE(\"01/\"&H36&\"/\"&B5)-WEEKDAY(DATEVALUE(\"01/\"&H36&\"/\"&B5),2)+1)+AD15","v":"2020-10-30"},{"$f":"(DATEVALUE(\"01/\"&H36&\"/\"&B5)-WEEKDAY(DATEVALUE(\"01/\"&H36&\"/\"&B5),2)+1)+AE15","v":"2020-10-31"},{"$f":"(DATEVALUE(\"01/\"&H36&\"/\"&B5)-WEEKDAY(DATEVALUE(\"01/\"&H36&\"/\"&B5),2)+1)+AF15","v":"2020-11-01"},null,{"$f":"(DATEVALUE(\"01/\"&P36&\"/\"&B5)-WEEKDAY(DATEVALUE(\"01/\"&P36&\"/\"&B5),2)+1)+Z15","v":"2020-11-23"},{"$f":"(DATEVALUE(\"01/\"&P36&\"/\"&B5)-WEEKDAY(DATEVALUE(\"01/\"&P36&\"/\"&B5),2)+1)+AA15","v":"2020-11-24"},{"$f":"(DATEVALUE(\"01/\"&P36&\"/\"&B5)-WEEKDAY(DATEVALUE(\"01/\"&P36&\"/\"&B5),2)+1)+AB15","v":"2020-11-25"},{"$f":"(DATEVALUE(\"01/\"&P36&\"/\"&B5)-WEEKDAY(DATEVALUE(\"01/\"&P36&\"/\"&B5),2)+1)+AC15","v":"2020-11-26"},{"$f":"(DATEVALUE(\"01/\"&P36&\"/\"&B5)-WEEKDAY(DATEVALUE(\"01/\"&P36&\"/\"&B5),2)+1)+AD15","v":"2020-11-27"},{"$f":"(DATEVALUE(\"01/\"&P36&\"/\"&B5)-WEEKDAY(DATEVALUE(\"01/\"&P36&\"/\"&B5),2)+1)+AE15","v":"2020-11-28"},{"$f":"(DATEVALUE(\"01/\"&P36&\"/\"&B5)-WEEKDAY(DATEVALUE(\"01/\"&P36&\"/\"&B5),2)+1)+AF15","v":"2020-11-29"},null,{"$f":"(DATEVALUE(\"01/\"&X36&\"/\"&B5)-WEEKDAY(DATEVALUE(\"01/\"&X36&\"/\"&B5),2)+1)+Z15","v":"2020-12-28"},{"$f":"(DATEVALUE(\"01/\"&X36&\"/\"&B5)-WEEKDAY(DATEVALUE(\"01/\"&X36&\"/\"&B5),2)+1)+AA15","v":"2020-12-29"},{"$f":"(DATEVALUE(\"01/\"&X36&\"/\"&B5)-WEEKDAY(DATEVALUE(\"01/\"&X36&\"/\"&B5),2)+1)+AB15","v":"2020-12-30"},{"$f":"(DATEVALUE(\"01/\"&X36&\"/\"&B5)-WEEKDAY(DATEVALUE(\"01/\"&X36&\"/\"&B5),2)+1)+AC15","v":"2020-12-31"},{"$f":"(DATEVALUE(\"01/\"&X36&\"/\"&B5)-WEEKDAY(DATEVALUE(\"01/\"&X36&\"/\"&B5),2)+1)+AD15","v":"2021-01-01"},{"$f":"(DATEVALUE(\"01/\"&X36&\"/\"&B5)-WEEKDAY(DATEVALUE(\"01/\"&X36&\"/\"&B5),2)+1)+AE15","v":"2021-01-02"},{"$f":"(DATEVALUE(\"01/\"&X36&\"/\"&B5)-WEEKDAY(DATEVALUE(\"01/\"&X36&\"/\"&B5),2)+1)+AF15","v":"2021-01-03"}]
[null,{"$f":"(DATEVALUE(\"01/\"&H36&\"/\"&B5)-WEEKDAY(DATEVALUE(\"01/\"&H36&\"/\"&B5),2)+1)+Z16","v":"2020-11-02"},{"$f":"(DATEVALUE(\"01/\"&H36&\"/\"&B5)-WEEKDAY(DATEVALUE(\"01/\"&H36&\"/\"&B5),2)+1)+AA16","v":"2020-11-03"},{"$f":"(DATEVALUE(\"01/\"&H36&\"/\"&B5)-WEEKDAY(DATEVALUE(\"01/\"&H36&\"/\"&B5),2)+1)+AB16","v":"2020-11-04"},{"$f":"(DATEVALUE(\"01/\"&H36&\"/\"&B5)-WEEKDAY(DATEVALUE(\"01/\"&H36&\"/\"&B5),2)+1)+AC16","v":"2020-11-05"},{"$f":"(DATEVALUE(\"01/\"&H36&\"/\"&B5)-WEEKDAY(DATEVALUE(\"01/\"&H36&\"/\"&B5),2)+1)+AD16","v":"2020-11-06"},{"$f":"(DATEVALUE(\"01/\"&H36&\"/\"&B5)-WEEKDAY(DATEVALUE(\"01/\"&H36&\"/\"&B5),2)+1)+AE16","v":"2020-11-07"},{"$f":"(DATEVALUE(\"01/\"&H36&\"/\"&B5)-WEEKDAY(DATEVALUE(\"01/\"&H36&\"/\"&B5),2)+1)+AF16","v":"2020-11-08"},null,{"$f":"(DATEVALUE(\"01/\"&P36&\"/\"&B5)-WEEKDAY(DATEVALUE(\"01/\"&P36&\"/\"&B5),2)+1)+Z16","v":"2020-11-30"},{"$f":"(DATEVALUE(\"01/\"&P36&\"/\"&B5)-WEEKDAY(DATEVALUE(\"01/\"&P36&\"/\"&B5),2)+1)+AA16","v":"2020-12-01"},{"$f":"(DATEVALUE(\"01/\"&P36&\"/\"&B5)-WEEKDAY(DATEVALUE(\"01/\"&P36&\"/\"&B5),2)+1)+AB16","v":"2020-12-02"},{"$f":"(DATEVALUE(\"01/\"&P36&\"/\"&B5)-WEEKDAY(DATEVALUE(\"01/\"&P36&\"/\"&B5),2)+1)+AC16","v":"2020-12-03"},{"$f":"(DATEVALUE(\"01/\"&P36&\"/\"&B5)-WEEKDAY(DATEVALUE(\"01/\"&P36&\"/\"&B5),2)+1)+AD16","v":"2020-12-04"},{"$f":"(DATEVALUE(\"01/\"&P36&\"/\"&B5)-WEEKDAY(DATEVALUE(\"01/\"&P36&\"/\"&B5),2)+1)+AE16","v":"2020-12-05"},{"$f":"(DATEVALUE(\"01/\"&P36&\"/\"&B5)-WEEKDAY(DATEVALUE(\"01/\"&P36&\"/\"&B5),2)+1)+AF16","v":"2020-12-06"},null,{"$f":"(DATEVALUE(\"01/\"&X36&\"/\"&B5)-WEEKDAY(DATEVALUE(\"01/\"&X36&\"/\"&B5),2)+1)+Z16","v":"2021-01-04"},{"$f":"(DATEVALUE(\"01/\"&X36&\"/\"&B5)-WEEKDAY(DATEVALUE(\"01/\"&X36&\"/\"&B5),2)+1)+AA16","v":"2021-01-05"},{"$f":"(DATEVALUE(\"01/\"&X36&\"/\"&B5)-WEEKDAY(DATEVALUE(\"01/\"&X36&\"/\"&B5),2)+1)+AB16","v":"2021-01-06"},{"$f":"(DATEVALUE(\"01/\"&X36&\"/\"&B5)-WEEKDAY(DATEVALUE(\"01/\"&X36&\"/\"&B5),2)+1)+AC16","v":"2021-01-07"},{"$f":"(DATEVALUE(\"01/\"&X36&\"/\"&B5)-WEEKDAY(DATEVALUE(\"01/\"&X36&\"/\"&B5),2)+1)+AD16","v":"2021-01-08"},{"$f":"(DATEVALUE(\"01/\"&X36&\"/\"&B5)-WEEKDAY(DATEVALUE(\"01/\"&X36&\"/\"&B5),2)+1)+AE16","v":"2021-01-09"},{"$f":"(DATEVALUE(\"01/\"&X36&\"/\"&B5)-WEEKDAY(DATEVALUE(\"01/\"&X36&\"/\"&B5),2)+1)+AF16","v":"2021-01-10"}]

{"sheet":"Dias (Editable)","index":2,"n_rows":69,"n_cols":9,"rows_kept":69,"merged":[[3,1,3,8]]}
[null,"Excel No Convencional"]
[null,"MOS Expert - CPC Martín Cruz - +51 998401784"]
[]
[null,"Tablas de feriados, dias no laborables y obligaciones"]
[]
[null,"Tabla de feriados y dias no laborables",null,null,"Tabla de obligaciones mensuales",null,null,"tabla de feriados y dias no laborables casa matriz"]
[null,"DIA","NOMBRE",null,"DIA","NOMBRE",null,"DIA","NOMBRE"]
[null,"2019-01-01","Año nuevo",null,"2019-01-03","Reporting",null,"2019-01-01","Año nuevo"]
[null,"2019-04-18","Jueves santo",null,"2019-01-07","Declaración AFP",null,"2019-04-19","Viernes santo"]
[null,"2019-04-19","Viernes santo",null,"2019-01-11","Libros Electrónicos",null,"2019-05-01","Dia de trabajo"]
[null,"2019-05-01","Dia de trabajo",null,"2019-01-14","Declaración SUNAT",null,"2019-08-15","Asunción de la Virgen"]
[null,"2019-05-28","Mi cumpleaños",null,"2019-01-16","INEI",null,"2019-10-12","Día de la Hispanidad"]
[null,"2019-06-29","San Pedro y San Pablo",null,"2019-02-04","Reporting",null,"2019-11-01","Dia de Todos los Santos"]
[null,"2019-07-26","No Laborable Panamericanos",null,"2019-02-07","Declaración AFP",null,"2019-12-06","Dia de la Constitución"]
[null,"2019-07-27","No Laborable Panamericanos",null,"2019-02-13","Libros Electrónicos",null,"2019-12-25","Navidad"]
[null,"2019-07-28","Fiestras patrias",null,"2019-02-14","Declaración SUNAT"]
[null,"2019-07-29","Fiestras patrias",null,"2019-02-18","INEI"]
[null,"2019-07-30","No Laborable Panamericanos",null,"2019-03-04","Reporting"]
[null,"2019-08-29","No Laborable (declarado)",null,"2019-03-07","Declaración AFP"]
[null,"2019-08-30","Santa Rosa de Lima",null,"2019-03-13","Libros Electrónicos"]
[null,"2019-10-08","Combate de Angamos",null,"2019-03-14","Declaración SUNAT"]
[null,"2019-10-31","No Laborable (declarado)",null,"2019-03-18","INEI"]
[null,"2019-11-01","Dia de Todos los Santos",null,"2019-04-02","Reporting"]
[null,"2019-12-08","Inmaculada Concepción",null,"2019-04-05","Declaración AFP"]
[null,"2019-12-25","Navidad",null,"2019-04-09","SUNAT IR"]
[{"$nulls":4},"2019-04-11","Libros Electrónicos"]
[{"$nulls":4},"2019-04-12","Declaración SUNAT"]
[{"$nulls":4},"2019-04-16","INEI"]
[{"$nulls":4},"2019-05-03","Reporting"]
[{"$nulls":4},"2019-05-07","Declaración AFP"]
[{"$nulls":4},"2019-05-13","Libros Electrónicos"]
[{"$nulls":4},"2019-05-14","Declaración SUNAT"]
[{"$nulls":4},"2019-05-16","INEI"]
[{"$nulls":4},"2019-06-04","Reporting"]
[{"$nulls":4},"2019-06-07","Declaración AFP"]
[{"$nulls":4},"2019-06-13","Libros Electrónicos"]
[{"$nulls":4},"2019-06-14","Declaración SUNAT"]
[{"$nulls":4},"2019-06-18","INEI"]
[{"$nulls":4},"2019-07-02","Reporting"]
[{"$nulls":4},"2019-07-05","Declaración AFP"]
[{"$nulls":4},"2019-07-11","Libros Electrónicos"]
[{"$nulls":4},"2019-07-12","Declaración SUNAT"]
[{"$nulls":4},"2019-07-16","INEI"]
[{"$nulls":4},"2019-08-02","Reporting"]
[{"$nulls":4},"2019-08-07","Declaración AFP"]
[{"$nulls":4},"2019-08-13","Libros Electrónicos"]
[{"$nulls":4},"2019-08-14","Declaración SUNAT"]
[{"$nulls":4},"2019-08-16","INEI"]
[{"$nulls":4},"2019-09-03","Reporting"]
[{"$nulls":4},"2019-09-06","Declaración AFP"]
[{"$nulls":4},"2019-09-12","Libros Electrónicos"]
[{"$nulls":4},"2019-09-13","Declaración SUNAT"]
[{"$nulls":4},"2019-09-17","INEI"]
[{"$nulls":4},"2019-10-02","Reporting"]
[{"$nulls":4},"2019-10-07","Declaración AFP"]
[{"$nulls":4},"2019-10-11","Libros Electrónicos"]
[{"$nulls":4},"2019-10-14","Declaración SUNAT"]
[{"$nulls":4},"2019-10-16","INEI"]
[{"$nulls":4},"2019-11-05","Reporting"]
[{"$nulls":4},"2019-11-07","Declaración AFP"]
[{"$nulls":4},"2019-11-13","Libros Electrónicos"]
[{"$nulls":4},"2019-11-14","Declaración SUNAT"]
[{"$nulls":4},"2019-11-18","INEI"]
[{"$nulls":4},"2019-12-03","Reporting"]
[{"$nulls":4},"2019-12-06","Declaración AFP"]
[{"$nulls":4},"2019-12-12","Libros Electrónicos"]
[{"$nulls":4},"2019-12-13","Declaración SUNAT"]
[{"$nulls":4},"2019-12-17","INEI"]
[{"$nulls":4},"2020-01-02","Reporting"]

{"sheet":"Calendario Casa Matriz","index":3,"n_rows":35,"n_cols":22,"rows_kept":35,"merged":[[3,1,3,3],[4,1,4,3],[6,1,6,20],[8,1,8,7],[18,1,18,6],[18,8,18,13],[18,15,18,20],[27,1,27,7],[27,8,27,14],[27,15,27,21]]}
[null,"Excel No Convencional"]
[null,"MOS Expert - CPC Martín Cruz - +51 998401784"]
[]
[null,"Seleccione un mes"]
[null,"Agosto",null,null,6]
[]
[null,"Calendario de obligaciones mensuales"]
[]
[null,{"$f":"lista01.1","v":"AGOSTO•2019"}]
[null,{"$f":"lista01.2","v":"L"},"M","X","J","V","S","D"]
[null,"2019-07-29","2019-07-30","2019-07-31","2019-08-01","2019-08-02","2019-08-03","2019-08-04"]
[null,"2019-08-05","2019-08-06","2019-08-07","2019-08-08","2019-08-09","2019-08-10","2019-08-11"]
[null,"2019-08-12","2019-08-13","2019-08-14","2019-08-15","2019-08-16","2019-08-17","2019-08-18"]
[null,"2019-08-19","2019-08-20","2019-08-21","2019-08-22","2019-08-23","2019-08-24","2019-08-25"]
[null,"2019-08-26","2019-08-27","2019-08-28","2019-08-29","2019-08-30","2019-08-31","2019-09-01"]
[null,"2019-09-02","2019-09-03","2019-09-04","2019-09-05","2019-09-06","2019-09-07","2019-09-08"]
[]
[]
[null,"Feriados y no laborables",{"$nulls":6},"Obligaciones mensuales",{"$nulls":6},"Festivos Matriz (España)"]
[null,{"$f":"lista01.3","v":"1900-01-29"},"No Laborable (declarado)",{"$nulls":5},{"$f":"lista01.4","v":"1900-01-02"},"Reporting",{"$nulls":5},{"$f":"lista01.9","v":"1900-01-15"},"Asunción de la Virgen"]
[null,"1900-01-30","Santa Rosa de Lima",{"$nulls":5},"1900-01-07","Declaración AFP",{"$nulls":5},"",""]
[null,"","",{"$nulls":5},"1900-01-13","Libros Electrónicos",{"$nulls":5},"",""]
[null,"","",{"$nulls":5},"1900-01-14","Declaración SUNAT",{"$nulls":5},"",""]
[null,"","",{"$nulls":5},"1900-01-16","INEI",{"$nulls":5},"",""]
[null,"","",{"$nulls":5},"","",{"$nulls":5},"",""]
[]
[]
[null,{"$f":"lista01.5","v":"JULIO•2019"},{"$nulls":6},{"$f":"lista01.6","v":"AGOSTO•2019"},{"$nulls":6},{"$f":"lista01.7","v":"SEPTIEMBRE•2019"}]
[null,{"$f":"lista01.8","v":"L"},"M","X","J","V","S","D","L","M","X","J","V","S","D","L","M","X","J","V","S","D"]
[null,"2019-07-01","2019-07-02","2019-07-03","2019-07-04","2019-07-05","2019-07-06","2019-07-07","2019-07-29","2019-07-30","2019-07-31","2019-08-01","2019-08-02","2019-08-03","2019-08-04","2019-08-26","2019-08-27","2019-08-28","2019-08-29","2019-08-30","2019-08-31","2019-09-01"]
[null,"2019-07-08","2019-07-09","2019-07-10","2019-07-11","2019-07-12","2019-07-13","2019-07-14","2019-08-05","2019-08-06","2019-08-07","2019-08-08","2019-08-09","2019-08-10","2019-08-11","2019-09-02","2019-09-03","2019-09-04","2019-09-05","2019-09-06","2019-09-07","2019-09-08"]
[null,"2019-07-15","2019-07-16","2019-07-17","2019-07-18","2019-07-19","2019-07-20","2019-07-21","2019-08-12","2019-08-13","2019-08-14","2019-08-15","2019-08-16","2019-08-17","2019-08-18","2019-09-09","2019-09-10","2019-09-11","2019-09-12","2019-09-13","2019-09-14","2019-09-15"]
[null,"2019-07-22","2019-07-23","2019-07-24","2019-07-25","2019-07-26","2019-07-27","2019-07-28","2019-08-19","2019-08-20","2019-08-21","2019-08-22","2019-08-23","2019-08-24","2019-08-25","2019-09-16","2019-09-17","2019-09-18","2019-09-19","2019-09-20","2019-09-21","2019-09-22"]
[null,"2019-07-29","2019-07-30","2019-07-31","2019-08-01","2019-08-02","2019-08-03","2019-08-04","2019-08-26","2019-08-27","2019-08-28","2019-08-29","2019-08-30","2019-08-31","2019-09-01","2019-09-23","2019-09-24","2019-09-25","2019-09-26","2019-09-27","2019-09-28","2019-09-29"]
[null,"2019-08-05","2019-08-06","2019-08-07","2019-08-08","2019-08-09","2019-08-10","2019-08-11","2019-09-02","2019-09-03","2019-09-04","2019-09-05","2019-09-06","2019-09-07","2019-09-08","2019-09-30","2019-10-01","2019-10-02","2019-10-03","2019-10-04","2019-10-05","2019-10-06"]

{"sheet":"DO_2","index":4,"n_rows":44,"n_cols":37,"rows_kept":44,"hidden":true}
[]
[null,{"$f":"TODAY()","v":"2019-09-28"},null,"Inicio",{"$f":"'Calendario Actual'!B5","v":"Lunes"},null,"Lu","Do"]
[null,{"$f":"EOMONTH(B2,-2)+1","v":"2019-08-01"},null,null,{"$f":"IF(E2=\"Lunes\",2,1)","v":2},null,"Ma","Lu"]
[null,{"$f":"WEEKDAY(B3,E3)","v":4},{"$nulls":4},"Mi","Ma"]
[null,{"$f":"B3-B4+1","v":"2019-07-29"},{"$nulls":4},"Ju","Mi"]
[{"$nulls":6},"Vi","Ju"]
[{"$nulls":6},"Sá","Vi"]
[{"$nulls":6},"Do","Sá"]
[{"$nulls":14},{"$f":"B10","v":"Agosto • 2019"},{"$nulls":7},{"$f":"B11","v":"Septiembre • 2019"},{"$nulls":7},{"$f":"B12","v":"Octubre • 2019"}]
[null,{"$f":"PROPER(TEXT(EOMONTH($B$5,ROWS(B$10:B10)),\"mmmm\"))&\" • \"&YEAR(EOMONTH($B$5,ROWS(B$10:B10)))","v":"Agosto • 2019"},{"$f":"EOMONTH($B$5,ROWS(B$10:B10)-1)-WEEKDAY(EOMONTH($B$5,ROWS(B$10:B10)-1)+1,$E$3)+2","v":"2019-07-29"},{"$nulls":3},{"$f":"INDEX(INDIRECT(\"lista03.\"&$E$3),COLUMNS($G$10:G$10))","v":"Lu"},{"$f":"INDEX(INDIRECT(\"lista03.\"&$E$3),COLUMNS($G$10:H$10))","v":"Ma"},{"$f":"INDEX(INDIRECT(\"lista03.\"&$E$3),COLUMNS($G$10:I$10))","v":"Mi"},{"$f":"INDEX(INDIRECT(\"lista03.\"&$E$3),COLUMNS($G$10:J$10))","v":"Ju"},{"$f":"INDEX(INDIRECT(\"lista03.\"&$E$3),COLUMNS($G$10:K$10))","v":"Vi"},{"$f":"INDEX(INDIRECT(\"lista03.\"&$E$3),COLUMNS($G$10:L$10))","v":"Sá"},{"$f":"INDEX(INDIRECT(\"lista03.\"&$E$3),COLUMNS($G$10:M$10))","v":"Do"},null,{"$f":"lista03.3","v":"Lu"},"Ma","Mi","Ju","Vi","Sá","Do",null,{"$f":"lista03.3","v":"Lu"},"Ma","Mi","Ju","Vi","Sá","Do",null,{"$f":"lista03.3","v":"Lu"},"Ma","Mi","Ju","Vi","Sá","Do"]
[null,{"$f":"PROPER(TEXT(EOMONTH($B$5,ROWS(B$10:B11)),\"mmmm\"))&\" • \"&YEAR(EOMONTH($B$5,ROWS(B$10:B11)))","v":"Septiembre • 2019"},{"$f":"EOMONTH($B$5,ROWS(B$10:B11)-1)-WEEKDAY(EOMONTH($B$5,ROWS(B$10:B11)-1)+1,$E$3)+2","v":"2019-08-26"},{"$nulls":11},{"$f":"VLOOKUP(O9,$B$10:$C$21,2,0)+((ROWS(O11:O11)-1)*7)+(COLUMNS(O11:O11)-1)","v":"2019-07-29"},{"$f":"VLOOKUP(O9,$B$10:$C$21,2,0)+((ROWS(O11:O11)-1)*7)+(COLUMNS(O11:P11)-1)","v":"2019-07-30"},{"$f":"VLOOKUP(O9,$B$10:$C$21,2,0)+((ROWS(O11:O11)-1)*7)+(COLUMNS(O11:Q11)-1)","v":"2019-07-31"},{"$f":"VLOOKUP(O9,$B$10:$C$21,2,0)+((ROWS(O11:O11)-1)*7)+(COLUMNS(O11:R11)-1)","v":"2019-08-01"},{"$f":"VLOOKUP(O9,$B$10:$C$21,2,0)+((ROWS(O11:O11)-1)*7)+(COLUMNS(O11:S11)-1)","v":"2019-08-02"},{"$f":"VLOOKUP(O9,$B$10:$C$21,2,0)+((ROWS(O11:O11)-1)*7)+(COLUMNS(O11:T11)-1)","v":"2019-08-03"},{"$f":"VLOOKUP(O9,$B$10:$C$21,2,0)+((ROWS(O11:O11)-1)*7)+(COLUMNS(O11:U11)-1)","v":"2019-08-04"},null,{"$f":"VLOOKUP(W9,$B$10:$C$21,2,0)+((ROWS(W11:W11)-1)*7)+(COLUMNS(W11:W11)-1)","v":"2019-08-26"},{"$f":"VLOOKUP(W9,$B$10:$C$21,2,0)+((ROWS(W11:W11)-1)*7)+(COLUMNS(W11:X11)-1)","v":"2019-08-27"},{"$f":"VLOOKUP(W9,$B$10:$C$21,2,0)+((ROWS(W11:W11)-1)*7)+(COLUMNS(W11:Y11)-1)","v":"2019-08-28"},{"$f":"VLOOKUP(W9,$B$10:$C$21,2,0)+((ROWS(W11:W11)-1)*7)+(COLUMNS(W11:Z11)-1)","v":"2019-08-29"},{"$f":"VLOOKUP(W9,$B$10:$C$21,2,0)+((ROWS(W11:W11)-1)*7)+(COLUMNS(W11:AA11)-1)","v":"2019-08-30"},{"$f":"VLOOKUP(W9,$B$10:$C$21,2,0)+((ROWS(W11:W11)-1)*7)+(COLUMNS(W11:AB11)-1)","v":"2019-08-31"},{"$f":"VLOOKUP(W9,$B$10:$C$21,2,0)+((ROWS(W11:W11)-1)*7)+(COLUMNS(W11:AC11)-1)","v":"2019-09-01"},null,{"$f":"VLOOKUP(AE9,$B$10:$C$21,2,0)+((ROWS(AE11:AE11)-1)*7)+(COLUMNS(AE11:AE11)-1)","v":"2019-09-30"},{"$f":"VLOOKUP(AE9,$B$10:$C$21,2,0)+((ROWS(AE11:AE11)-1)*7)+(COLUMNS(AE11:AF11)-1)","v":"2019-10-01"},{"$f":"VLOOKUP(AE9,$B$10:$C$21,2,0)+((ROWS(AE11:AE11)-1)*7)+(COLUMNS(AE11:AG11)-1)","v":"2019-10-02"},{"$f":"VLOOKUP(AE9,$B$10:$C$21,2,0)+((ROWS(AE11:AE11)-1)*7)+(COLUMNS(AE11:AH11)-1)","v":"2019-10-03"},{"$f":"VLOOKUP(AE9,$B$10:$C$21,2,0)+((ROWS(AE11:AE11)-1)*7)+(COLUMNS(AE11:AI11)-1)","v":"2019-10-04"},{"$f":"VLOOKUP(AE9,$B$10:$C$21,2,0)+((ROWS(AE11:AE11)-1)*7)+(COLUMNS(AE11:AJ11)-1)","v":"2019-10-05"},{"$f":"VLOOKUP(AE9,$B$10:$C$21,2,0)+((ROWS(AE11:AE11)-1)*7)+(COLUMNS(AE11:AK11)-1)","v":"2019-10-06"}]
[null,{"$f":"PROPER(TEXT(EOMONTH($B$5,ROWS(B$10:B12)),\"mmmm\"))&\" • \"&YEAR(EOMONTH($B$5,ROWS(B$10:B12)))","v":"Octubre • 2019"},{"$f":"EOMONTH($B$5,ROWS(B$10:B12)-1)-WEEKDAY(EOMONTH($B$5,ROWS(B$10:B12)-1)+1,$E$3)+2","v":"2019-09-30"},{"$nulls":11},{"$f":"VLOOKUP(O9,$B$10:$C$21,2,0)+((ROWS(O11:O12)-1)*7)+(COLUMNS(O11:O11)-1)","v":"2019-08-05"},{"$f":"VLOOKUP(O9,$B$10:$C$21,2,0)+((ROWS(O11:O12)-1)*7)+(COLUMNS(O11:P11)-1)","v":"2019-08-06"},{"$f":"VLOOKUP(O9,$B$10:$C$21,2,0)+((ROWS(O11:O12)-1)*7)+(COLUMNS(O11:Q11)-1)","v":"2019-08-07"},{"$f":"VLOOKUP(O9,$B$10:$C$21,2,0)+((ROWS(O11:O12)-1)*7)+(COLUMNS(O11:R11)-1)","v":"2019-08-08"},{"$f":"VLOOKUP(O9,$B$10:$C$21,2,0)+((ROWS(O11:O12)-1)*7)+(COLUMNS(O11:S11)-1)","v":"2019-08-09"},{"$f":"VLOOKUP(O9,$B$10:$C$21,2,0)+((ROWS(O11:O12)-1)*7)+(COLUMNS(O11:T11)-1)","v":"2019-08-10"},{"$f":"VLOOKUP(O9,$B$10:$C$21,2,0)+((ROWS(O11:O12)-1)*7)+(COLUMNS(O11:U11)-1)","v":"2019-08-11"},null,{"$f":"VLOOKUP(W9,$B$10:$C$21,2,0)+((ROWS(W11:W12)-1)*7)+(COLUMNS(W11:W11)-1)","v":"2019-09-02"},{"$f":"VLOOKUP(W9,$B$10:$C$21,2,0)+((ROWS(W11:W12)-1)*7)+(COLUMNS(W11:X11)-1)","v":"2019-09-03"},{"$f":"VLOOKUP(W9,$B$10:$C$21,2,0)+((ROWS(W11:W12)-1)*7)+(COLUMNS(W11:Y11)-1)","v":"2019-09-04"},{"$f":"VLOOKUP(W9,$B$10:$C$21,2,0)+((ROWS(W11:W12)-1)*7)+(COLUMNS(W11:Z11)-1)","v":"2019-09-05"},{"$f":"VLOOKUP(W9,$B$10:$C$21,2,0)+((ROWS(W11:W12)-1)*7)+(COLUMNS(W11:AA11)-1)","v":"2019-09-06"},{"$f":"VLOOKUP(W9,$B$10:$C$21,2,0)+((ROWS(W11:W12)-1)*7)+(COLUMNS(W11:AB11)-1)","v":"2019-09-07"},{"$f":"VLOOKUP(W9,$B$10:$C$21,2,0)+((ROWS(W11:W12)-1)*7)+(COLUMNS(W11:AC11)-1)","v":"2019-09-08"},null,{"$f":"VLOOKUP(AE9,$B$10:$C$21,2,0)+((ROWS(AE11:AE12)-1)*7)+(COLUMNS(AE11:AE11)-1)","v":"2019-10-07"},{"$f":"VLOOKUP(AE9,$B$10:$C$21,2,0)+((ROWS(AE11:AE12)-1)*7)+(COLUMNS(AE11:AF11)-1)","v":"2019-10-08"},{"$f":"VLOOKUP(AE9,$B$10:$C$21,2,0)+((ROWS(AE11:AE12)-1)*7)+(COLUMNS(AE11:AG11)-1)","v":"2019-10-09"},{"$f":"VLOOKUP(AE9,$B$10:$C$21,2,0)+((ROWS(AE11:AE12)-1)*7)+(COLUMNS(AE11:AH11)-1)","v":"2019-10-10"},{"$f":"VLOOKUP(AE9,$B$10:$C$21,2,0)+((ROWS(AE11:AE12)-1)*7)+(COLUMNS(AE11:AI11)-1)","v":"2019-10-11"},{"$f":"VLOOKUP(AE9,$B$10:$C$21,2,0)+((ROWS(AE11:AE12)-1)*7)+(COLUMNS(AE11:AJ11)-1)","v":"2019-10-12"},{"$f":"VLOOKUP(AE9,$B$10:$C$21,2,0)+((ROWS(AE11:AE12)-1)*7)+(COLUMNS(AE11:AK11)-1)","v":"2019-10-13"}]
[null,{"$f":"PROPER(TEXT(EOMONTH($B$5,ROWS(B$10:B13)),\"mmmm\"))&\" • \"&YEAR(EOMONTH($B$5,ROWS(B$10:B13)))","v":"Noviembre • 2019"},{"$f":"EOMONTH($B$5,ROWS(B$10:B13)-1)-WEEKDAY(EOMONTH($B$5,ROWS(B$10:B13)-1)+1,$E$3)+2","v":"2019-10-28"},{"$nulls":11},{"$f":"VLOOKUP(O9,$B$10:$C$21,2,0)+((ROWS(O11:O13)-1)*7)+(COLUMNS(O11:O11)-1)","v":"2019-08-12"},{"$f":"VLOOKUP(O9,$B$10:$C$21,2,0)+((ROWS(O11:O13)-1)*7)+(COLUMNS(O11:P11)-1)","v":"2019-08-13"},{"$f":"VLOOKUP(O9,$B$10:$C$21,2,0)+((ROWS(O11:O13)-1)*7)+(COLUMNS(O11:Q11)-1)","v":"2019-08-14"},{"$f":"VLOOKUP(O9,$B$10:$C$21,2,0)+((ROWS(O11:O13)-1)*7)+(COLUMNS(O11:R11)-1)","v":"2019-08-15"},{"$f":"VLOOKUP(O9,$B$10:$C$21,2,0)+((ROWS(O11:O13)-1)*7)+(COLUMNS(O11:S11)-1)","v":"2019-08-16"},{"$f":"VLOOKUP(O9,$B$10:$C$21,2,0)+((ROWS(O11:O13)-1)*7)+(COLUMNS(O11:T11)-1)","v":"2019-08-17"},{"$f":"VLOOKUP(O9,$B$10:$C$21,2,0)+((ROWS(O11:O13)-1)*7)+(COLUMNS(O11:U11)-1)","v":"2019-08-18"},null,{"$f":"VLOOKUP(W9,$B$10:$C$21,2,0)+((ROWS(W11:W13)-1)*7)+(COLUMNS(W11:W11)-1)","v":"2019-09-09"},{"$f":"VLOOKUP(W9,$B$10:$C$21,2,0)+((ROWS(W11:W13)-1)*7)+(COLUMNS(W11:X11)-1)","v":"2019-09-10"},{"$f":"VLOOKUP(W9,$B$10:$C$21,2,0)+((ROWS(W11:W13)-1)*7)+(COLUMNS(W11:Y11)-1)","v":"2019-09-11"},{"$f":"VLOOKUP(W9,$B$10:$C$21,2,0)+((ROWS(W11:W13)-1)*7)+(COLUMNS(W11:Z11)-1)","v":"2019-09-12"},{"$f":"VLOOKUP(W9,$B$10:$C$21,2,0)+((ROWS(W11:W13)-1)*7)+(COLUMNS(W11:AA11)-1)","v":"2019-09-13"},{"$f":"VLOOKUP(W9,$B$10:$C$21,2,0)+((ROWS(W11:W13)-1)*7)+(COLUMNS(W11:AB11)-1)","v":"2019-09-14"},{"$f":"VLOOKUP(W9,$B$10:$C$21,2,0)+((ROWS(W11:W13)-1)*7)+(COLUMNS(W11:AC11)-1)","v":"2019-09-15"},null,{"$f":"VLOOKUP(AE9,$B$10:$C$21,2,0)+((ROWS(AE11:AE13)-1)*7)+(COLUMNS(AE11:AE11)-1)","v":"2019-10-14"},{"$f":"VLOOKUP(AE9,$B$10:$C$21,2,0)+((ROWS(AE11:AE13)-1)*7)+(COLUMNS(AE11:AF11)-1)","v":"2019-10-15"},{"$f":"VLOOKUP(AE9,$B$10:$C$21,2,0)+((ROWS(AE11:AE13)-1)*7)+(COLUMNS(AE11:AG11)-1)","v":"2019-10-16"},{"$f":"VLOOKUP(AE9,$B$10:$C$21,2,0)+((ROWS(AE11:AE13)-1)*7)+(COLUMNS(AE11:AH11)-1)","v":"2019-10-17"},{"$f":"VLOOKUP(AE9,$B$10:$C$21,2,0)+((ROWS(AE11:AE13)-1)*7)+(COLUMNS(AE11:AI11)-1)","v":"2019-10-18"},{"$f":"VLOOKUP(AE9,$B$10:$C$21,2,0)+((ROWS(AE11:AE13)-1)*7)+(COLUMNS(AE11:AJ11)-1)","v":"2019-10-19"},{"$f":"VLOOKUP(AE9,$B$10:$C$21,2,0)+((ROWS(AE11:AE13)-1)*7)+(COLUMNS(AE11:AK11)-1)","v":"2019-10-20"}]
[null,{"$f":"PROPER(TEXT(EOMONTH($B$5,ROWS(B$10:B14)),\"mmmm\"))&\" • \"&YEAR(EOMONTH($B$5,ROWS(B$10:B14)))","v":"Diciembre • 2019"},{"$f":"EOMONTH($B$5,ROWS(B$10:B14)-1)-WEEKDAY(EOMONTH($B$5,ROWS(B$10:B14)-1)+1,$E$3)+2","v":"2019-11-25"},{"$nulls":11},{"$f":"VLOOKUP(O9,$B$10:$C$21,2,0)+((ROWS(O11:O14)-1)*7)+(COLUMNS(O11:O11)-1)","v":"2019-08-19"},{"$f":"VLOOKUP(O9,$B$10:$C$21,2,0)+((ROWS(O11:O14)-1)*7)+(COLUMNS(O11:P11)-1)","v":"2019-08-20"},{"$f":"VLOOKUP(O9,$B$10:$C$21,2,0)+((ROWS(O11:O14)-1)*7)+(COLUMNS(O11:Q11)-1)","v":"2019-08-21"},{"$f":"VLOOKUP(O9,$B$10:$C$21,2,0)+((ROWS(O11:O14)-1)*7)+(COLUMNS(O11:R11)-1)","v":"2019-08-22"},{"$f":"VLOOKUP(O9,$B$10:$C$21,2,0)+((ROWS(O11:O14)-1)*7)+(COLUMNS(O11:S11)-1)","v":"2019-08-23"},{"$f":"VLOOKUP(O9,$B$10:$C$21,2,0)+((ROWS(O11:O14)-1)*7)+(COLUMNS(O11:T11)-1)","v":"2019-08-24"},{"$f":"VLOOKUP(O9,$B$10:$C$21,2,0)+((ROWS(O11:O14)-1)*7)+(COLUMNS(O11:U11)-1)","v":"2019-08-25"},null,{"$f":"VLOOKUP(W9,$B$10:$C$21,2,0)+((ROWS(W11:W14)-1)*7)+(COLUMNS(W11:W11)-1)","v":"2019-09-16"},{"$f":"VLOOKUP(W9,$B$10:$C$21,2,0)+((ROWS(W11:W14)-1)*7)+(COLUMNS(W11:X11)-1)","v":"2019-09-17"},{"$f":"VLOOKUP(W9,$B$10:$C$21,2,0)+((ROWS(W11:W14)-1)*7)+(COLUMNS(W11:Y11)-1)","v":"2019-09-18"},{"$f":"VLOOKUP(W9,$B$10:$C$21,2,0)+((ROWS(W11:W14)-1)*7)+(COLUMNS(W11:Z11)-1)","v":"2019-09-19"},{"$f":"VLOOKUP(W9,$B$10:$C$21,2,0)+((ROWS(W11:W14)-1)*7)+(COLUMNS(W11:AA11)-1)","v":"2019-09-20"},{"$f":"VLOOKUP(W9,$B$10:$C$21,2,0)+((ROWS(W11:W14)-1)*7)+(COLUMNS(W11:AB11)-1)","v":"2019-09-21"},{"$f":"VLOOKUP(W9,$B$10:$C$21,2,0)+((ROWS(W11:W14)-1)*7)+(COLUMNS(W11:AC11)-1)","v":"2019-09-22"},null,{"$f":"VLOOKUP(AE9,$B$10:$C$21,2,0)+((ROWS(AE11:AE14)-1)*7)+(COLUMNS(AE11:AE11)-1)","v":"2019-10-21"},{"$f":"VLOOKUP(AE9,$B$10:$C$21,2,0)+((ROWS(AE11:AE14)-1)*7)+(COLUMNS(AE11:AF11)-1)","v":"2019-10-22"},{"$f":"VLOOKUP(AE9,$B$10:$C$21,2,0)+((ROWS(AE11:AE14)-1)*7)+(COLUMNS(AE11:AG11)-1)","v":"2019-10-23"},{"$f":"VLOOKUP(AE9,$B$10:$C$21,2,0)+((ROWS(AE11:AE14)-1)*7)+(COLUMNS(AE11:AH11)-1)","v":"2019-10-24"},{"$f":"VLOOKUP(AE9,$B$10:$C$21,2,0)+((ROWS(AE11:AE14)-1)*7)+(COLUMNS(AE11:AI11)-1)","v":"2019-10-25"},{"$f":"VLOOKUP(AE9,$B$10:$C$21,2,0)+((ROWS(AE11:AE14)-1)*7)+(COLUMNS(AE11:AJ11)-1)","v":"2019-10-26"},{"$f":"VLOOKUP(AE9,$B$10:$C$21,2,0)+((ROWS(AE11:AE14)-1)*7)+(COLUMNS(AE11:AK11)-1)","v":"2019-10-27"}]
[null,{"$f":"PROPER(TEXT(EOMONTH($B$5,ROWS(B$10:B15)),\"mmmm\"))&\" • \"&YEAR(EOMONTH($B$5,ROWS(B$10:B15)))","v":"Enero • 2020"},{"$f":"EOMONTH($B$5,ROWS(B$10:B15)-1)-WEEKDAY(EOMONTH($B$5,ROWS(B$10:B15)-1)+1,$E$3)+2","v":"2019-12-30"},{"$nulls":11},{"$f":"VLOOKUP(O9,$B$10:$C$21,2,0)+((ROWS(O11:O15)-1)*7)+(COLUMNS(O11:O11)-1)","v":"2019-08-26"},{"$f":"VLOOKUP(O9,$B$10:$C$21,2,0)+((ROWS(O11:O15)-1)*7)+(COLUMNS(O11:P11)-1)","v":"2019-08-27"},{"$f":"VLOOKUP(O9,$B$10:$C$21,2,0)+((ROWS(O11:O15)-1)*7)+(COLUMNS(O11:Q11)-1)","v":"2019-08-28"},{"$f":"VLOOKUP(O9,$B$10:$C$21,2,0)+((ROWS(O11:O15)-1)*7)+(COLUMNS(O11:R11)-1)","v":"2019-08-29"},{"$f":"VLOOKUP(O9,$B$10:$C$21,2,0)+((ROWS(O11:O15)-1)*7)+(COLUMNS(O11:S11)-1)","v":"2019-08-30"},{"$f":"VLOOKUP(O9,$B$10:$C$21,2,0)+((ROWS(O11:O15)-1)*7)+(COLUMNS(O11:T11)-1)","v":"2019-08-31"},{"$f":"VLOOKUP(O9,$B$10:$C$21,2,0)+((ROWS(O11:O15)-1)*7)+(COLUMNS(O11:U11)-1)","v":"2019-09-01"},null,{"$f":"VLOOKUP(W9,$B$10:$C$21,2,0)+((ROWS(W11:W15)-1)*7)+(COLUMNS(W11:W11)-1)","v":"2019-09-23"},{"$f":"VLOOKUP(W9,$B$10:$C$21,2,0)+((ROWS(W11:W15)-1)*7)+(COLUMNS(W11:X11)-1)","v":"2019-09-24"},{"$f":"VLOOKUP(W9,$B$10:$C$21,2,0)+((ROWS(W11:W15)-1)*7)+(COLUMNS(W11:Y11)-1)","v":"2019-09-25"},{"$f":"VLOOKUP(W9,$B$10:$C$21,2,0)+((ROWS(W11:W15)-1)*7)+(COLUMNS(W11:Z11)-1)","v":"2019-09-26"},{"$f":"VLOOKUP(W9,$B$10:$C$21,2,0)+((ROWS(W11:W15)-1)*7)+(COLUMNS(W11:AA11)-1)","v":"2019-09-27"},{"$f":"VLOOKUP(W9,$B$10:$C$21,2,0)+((ROWS(W11:W15)-1)*7)+(COLUMNS(W11:AB11)-1)","v":"2019-09-28"},{"$f":"VLOOKUP(W9,$B$10:$C$21,2,0)+((ROWS(W11:W15)-1)*7)+(COLUMNS(W11:AC11)-1)","v":"2019-09-29"},null,{"$f":"VLOOKUP(AE9,$B$10:$C$21,2,0)+((ROWS(AE11:AE15)-1)*7)+(COLUMNS(AE11:AE11)-1)","v":"2019-10-28"},{"$f":"VLOOKUP(AE9,$B$10:$C$21,2,0)+((ROWS(AE11:AE15)-1)*7)+(COLUMNS(AE11:AF11)-1)","v":"2019-10-29"},{"$f":"VLOOKUP(AE9,$B$10:$C$21,2,0)+((ROWS(AE11:AE15)-1)*7)+(COLUMNS(AE11:AG11)-1)","v":"2019-10-30"},{"$f":"VLOOKUP(AE9,$B$10:$C$21,2,0)+((ROWS(AE11:AE15)-1)*7)+(COLUMNS(AE11:AH11)-1)","v":"2019-10-31"},{"$f":"VLOOKUP(AE9,$B$10:$C$21,2,0)+((ROWS(AE11:AE15)-1)*7)+(COLUMNS(AE11:AI11)-1)","v":"2019-11-01"},{"$f":"VLOOKUP(AE9,$B$10:$C$21,2,0)+((ROWS(AE11:AE15)-1)*7)+(COLUMNS(AE11:AJ11)-1)","v":"2019-11-02"},{"$f":"VLOOKUP(AE9,$B$10:$C$21,2,0)+((ROWS(AE11:AE15)-1)*7)+(COLUMNS(AE11:AK11)-1)","v":"2019-11-03"}]
[null,{"$f":"PROPER(TEXT(EOMONTH($B$5,ROWS(B$10:B16)),\"mmmm\"))&\" • \"&YEAR(EOMONTH($B$5,ROWS(B$10:B16)))","v":"Febrero • 2020"},{"$f":"EOMONTH($B$5,ROWS(B$10:B16)-1)-WEEKDAY(EOMONTH($B$5,ROWS(B$10:B16)-1)+1,$E$3)+2","v":"2020-01-27"},{"$nulls":11},{"$f":"VLOOKUP(O9,$B$10:$C$21,2,0)+((ROWS(O11:O16)-1)*7)+(COLUMNS(O11:O11)-1)","v":"2019-09-02"},{"$f":"VLOOKUP(O9,$B$10:$C$21,2,0)+((ROWS(O11:O16)-1)*7)+(COLUMNS(O11:P11)-1)","v":"2019-09-03"},{"$f":"VLOOKUP(O9,$B$10:$C$21,2,0)+((ROWS(O11:O16)-1)*7)+(COLUMNS(O11:Q11)-1)","v":"2019-09-04"},{"$f":"VLOOKUP(O9,$B$10:$C$21,2,0)+((ROWS(O11:O16)-1)*7)+(COLUMNS(O11:R11)-1)","v":"2019-09-05"},{"$f":"VLOOKUP(O9,$B$10:$C$21,2,0)+((ROWS(O11:O16)-1)*7)+(COLUMNS(O11:S11)-1)","v":"2019-09-06"},{"$f":"VLOOKUP(O9,$B$10:$C$21,2,0)+((ROWS(O11:O16)-1)*7)+(COLUMNS(O11:T11)-1)","v":"2019-09-07"},{"$f":"VLOOKUP(O9,$B$10:$C$21,2,0)+((ROWS(O11:O16)-1)*7)+(COLUMNS(O11:U11)-1)","v":"2019-09-08"},null,{"$f":"VLOOKUP(W9,$B$10:$C$21,2,0)+((ROWS(W11:W16)-1)*7)+(COLUMNS(W11:W11)-1)","v":"2019-09-30"},{"$f":"VLOOKUP(W9,$B$10:$C$21,2,0)+((ROWS(W11:W16)-1)*7)+(COLUMNS(W11:X11)-1)","v":"2019-10-01"},{"$f":"VLOOKUP(W9,$B$10:$C$21,2,0)+((ROWS(W11:W16)-1)*7)+(COLUMNS(W11:Y11)-1)","v":"2019-10-02"},{"$f":"VLOOKUP(W9,$B$10:$C$21,2,0)+((ROWS(W11:W16)-1)*7)+(COLUMNS(W11:Z11)-1)","v":"2019-10-03"},{"$f":"VLOOKUP(W9,$B$10:$C$21,2,0)+((ROWS(W11:W16)-1)*7)+(COLUMNS(W11:AA11)-1)","v":"2019-10-04"},{"$f":"VLOOKUP(W9,$B$10:$C$21,2,0)+((ROWS(W11:W16)-1)*7)+(COLUMNS(W11:AB11)-1)","v":"2019-10-05"},{"$f":"VLOOKUP(W9,$B$10:$C$21,2,0)+((ROWS(W11:W16)-1)*7)+(COLUMNS(W11:AC11)-1)","v":"2019-10-06"},null,{"$f":"VLOOKUP(AE9,$B$10:$C$21,2,0)+((ROWS(AE11:AE16)-1)*7)+(COLUMNS(AE11:AE11)-1)","v":"2019-11-04"},{"$f":"VLOOKUP(AE9,$B$10:$C$21,2,0)+((ROWS(AE11:AE16)-1)*7)+(COLUMNS(AE11:AF11)-1)","v":"2019-11-05"},{"$f":"VLOOKUP(AE9,$B$10:$C$21,2,0)+((ROWS(AE11:AE16)-1)*7)+(COLUMNS(AE11:AG11)-1)","v":"2019-11-06"},{"$f":"VLOOKUP(AE9,$B$10:$C$21,2,0)+((ROWS(AE11:AE16)-1)*7)+(COLUMNS(AE11:AH11)-1)","v":"2019-11-07"},{"$f":"VLOOKUP(AE9,$B$10:$C$21,2,0)+((ROWS(AE11:AE16)-1)*7)+(COLUMNS(AE11:AI11)-1)","v":"2019-11-08"},{"$f":"VLOOKUP(AE9,$B$10:$C$21,2,0)+((ROWS(AE11:AE16)-1)*7)+(COLUMNS(AE11:AJ11)-1)","v":"2019-11-09"},{"$f":"VLOOKUP(AE9,$B$10:$C$21,2,0)+((ROWS(AE11:AE16)-1)*7)+(COLUMNS(AE11:AK11)-1)","v":"2019-11-10"}]
[null,{"$f":"PROPER(TEXT(EOMONTH($B$5,ROWS(B$10:B17)),\"mmmm\"))&\" • \"&YEAR(EOMONTH($B$5,ROWS(B$10:B17)))","v":"Marzo • 2020"},{"$f":"EOMONTH($B$5,ROWS(B$10:B17)-1)-WEEKDAY(EOMONTH($B$5,ROWS(B$10:B17)-1)+1,$E$3)+2","v":"2020-02-24"}]
[null,{"$f":"PROPER(TEXT(EOMONTH($B$5,ROWS(B$10:B18)),\"mmmm\"))&\" • \"&YEAR(EOMONTH($B$5,ROWS(B$10:B18)))","v":"Abril • 2020"},{"$f":"EOMONTH($B$5,ROWS(B$10:B18)-1)-WEEKDAY(EOMONTH($B$5,ROWS(B$10:B18)-1)+1,$E$3)+2","v":"2020-03-30"},{"$nulls":11},{"$f":"B13","v":"Noviembre • 2019"},{"$nulls":7},{"$f":"B14","v":"Diciembre • 2019"},{"$nulls":7},{"$f":"B15","v":"Enero • 2020"}]
[null,{"$f":"PROPER(TEXT(EOMONTH($B$5,ROWS(B$10:B19)),\"mmmm\"))&\" • \"&YEAR(EOMONTH($B$5,ROWS(B$10:B19)))","v":"Mayo • 2020"},{"$f":"EOMONTH($B$5,ROWS(B$10:B19)-1)-WEEKDAY(EOMONTH($B$5,ROWS(B$10:B19)-1)+1,$E$3)+2","v":"2020-04-27"},{"$nulls":11},{"$f":"lista03.3","v":"Lu"},"Ma","Mi","Ju","Vi","Sá","Do",null,{"$f":"lista03.3","v":"Lu"},"Ma","Mi","Ju","Vi","Sá","Do",null,{"$f":"lista03.3","v":"Lu"},"Ma","Mi","Ju","Vi","Sá","Do"]
[null,{"$f":"PROPER(TEXT(EOMONTH($B$5,ROWS(B$10:B20)),\"mmmm\"))&\" • \"&YEAR(EOMONTH($B$5,ROWS(B$10:B20)))","v":"Junio • 2020"},{"$f":"EOMONTH($B$5,ROWS(B$10:B20)-1)-WEEKDAY(EOMONTH($B$5,ROWS(B$10:B20)-1)+1,$E$3)+2","v":"2020-06-01"},{"$nulls":11},{"$f":"VLOOKUP(O18,$B$10:$C$21,2,0)+((ROWS(O20:O20)-1)*7)+(COLUMNS(O20:O20)-1)","v":"2019-10-28"},{"$f":"VLOOKUP(O18,$B$10:$C$21,2,0)+((ROWS(O20:O20)-1)*7)+(COLUMNS(O20:P20)-1)","v":"2019-10-29"},{"$f":"VLOOKUP(O18,$B$10:$C$21,2,0)+((ROWS(O20:O20)-1)*7)+(COLUMNS(O20:Q20)-1)","v":"2019-10-30"},{"$f":"VLOOKUP(O18,$B$10:$C$21,2,0)+((ROWS(O20:O20)-1)*7)+(COLUMNS(O20:R20)-1)","v":"2019-10-31"},{"$f":"VLOOKUP(O18,$B$10:$C$21,2,0)+((ROWS(O20:O20)-1)*7)+(COLUMNS(O20:S20)-1)","v":"2019-11-01"},{"$f":"VLOOKUP(O18,$B$10:$C$21,2,0)+((ROWS(O20:O20)-1)*7)+(COLUMNS(O20:T20)-1)","v":"2019-11-02"},{"$f":"VLOOKUP(O18,$B$10:$C$21,2,0)+((ROWS(O20:O20)-1)*7)+(COLUMNS(O20:U20)-1)","v":"2019-11-03"},null,{"$f":"VLOOKUP(W18,$B$10:$C$21,2,0)+((ROWS(W20:W20)-1)*7)+(COLUMNS(W20:W20)-1)","v":"2019-11-25"},{"$f":"VLOOKUP(W18,$B$10:$C$21,2,0)+((ROWS(W20:W20)-1)*7)+(COLUMNS(W20:X20)-1)","v":"2019-11-26"},{"$f":"VLOOKUP(W18,$B$10:$C$21,2,0)+((ROWS(W20:W20)-1)*7)+(COLUMNS(W20:Y20)-1)","v":"2019-11-27"},{"$f":"VLOOKUP(W18,$B$10:$C$21,2,0)+((ROWS(W20:W20)-1)*7)+(COLUMNS(W20:Z20)-1)","v":"2019-11-28"},{"$f":"VLOOKUP(W18,$B$10:$C$21,2,0)+((ROWS(W20:W20)-1)*7)+(COLUMNS(W20:AA20)-1)","v":"2019-11-29"},{"$f":"VLOOKUP(W18,$B$10:$C$21,2,0)+((ROWS(W20:W20)-1)*7)+(COLUMNS(W20:AB20)-1)","v":"2019-11-30"},{"$f":"VLOOKUP(W18,$B$10:$C$21,2,0)+((ROWS(W20:W20)-1)*7)+(COLUMNS(W20:AC20)-1)","v":"2019-12-01"},null,{"$f":"VLOOKUP(AE18,$B$10:$C$21,2,0)+((ROWS(AE20:AE20)-1)*7)+(COLUMNS(AE20:AE20)-1)","v":"2019-12-30"},{"$f":"VLOOKUP(AE18,$B$10:$C$21,2,0)+((ROWS(AE20:AE20)-1)*7)+(COLUMNS(AE20:AF20)-1)","v":"2019-12-31"},{"$f":"VLOOKUP(AE18,$B$10:$C$21,2,0)+((ROWS(AE20:AE20)-1)*7)+(COLUMNS(AE20:AG20)-1)","v":"2020-01-01"},{"$f":"VLOOKUP(AE18,$B$10:$C$21,2,0)+((ROWS(AE20:AE20)-1)*7)+(COLUMNS(AE20:AH20)-1)","v":"2020-01-02"},{"$f":"VLOOKUP(AE18,$B$10:$C$21,2,0)+((ROWS(AE20:AE20)-1)*7)+(COLUMNS(AE20:AI20)-1)","v":"2020-01-03"},{"$f":"VLOOKUP(AE18,$B$10:$C$21,2,0)+((ROWS(AE20:AE20)-1)*7)+(COLUMNS(AE20:AJ20)-1)","v":"2020-01-04"},{"$f":"VLOOKUP(AE18,$B$10:$C$21,2,0)+((ROWS(AE20:AE20)-1)*7)+(COLUMNS(AE20:AK20)-1)","v":"2020-01-05"}]
[null,{"$f":"PROPER(TEXT(EOMONTH($B$5,ROWS(B$10:B21)),\"mmmm\"))&\" • \"&YEAR(EOMONTH($B$5,ROWS(B$10:B21)))","v":"Julio • 2020"},{"$f":"EOMONTH($B$5,ROWS(B$10:B21)-1)-WEEKDAY(EOMONTH($B$5,ROWS(B$10:B21)-1)+1,$E$3)+2","v":"2020-06-29"},{"$nulls":11},{"$f":"VLOOKUP(O18,$B$10:$C$21,2,0)+((ROWS(O20:O21)-1)*7)+(COLUMNS(O20:O20)-1)","v":"2019-11-04"},{"$f":"VLOOKUP(O18,$B$10:$C$21,2,0)+((ROWS(O20:O21)-1)*7)+(COLUMNS(O20:P20)-1)","v":"2019-11-05"},{"$f":"VLOOKUP(O18,$B$10:$C$21,2,0)+((ROWS(O20:O21)-1)*7)+(COLUMNS(O20:Q20)-1)","v":"2019-11-06"},{"$f":"VLOOKUP(O18,$B$10:$C$21,2,0)+((ROWS(O20:O21)-1)*7)+(COLUMNS(O20:R20)-1)","v":"2019-11-07"},{"$f":"VLOOKUP(O18,$B$10:$C$21,2,0)+((ROWS(O20:O21)-1)*7)+(COLUMNS(O20:S20)-1)","v":"2019-11-08"},{"$f":"VLOOKUP(O18,$B$10:$C$21,2,0)+((ROWS(O20:O21)-1)*7)+(COLUMNS(O20:T20)-1)","v":"2019-11-09"},{"$f":"VLOOKUP(O18,$B$10:$C$21,2,0)+((ROWS(O20:O21)-1)*7)+(COLUMNS(O20:U20)-1)","v":"2019-11-10"},null,{"$f":"VLOOKUP(W18,$B$10:$C$21,2,0)+((ROWS(W20:W21)-1)*7)+(COLUMNS(W20:W20)-1)","v":"2019-12-02"},{"$f":"VLOOKUP(W18,$B$10:$C$21,2,0)+((ROWS(W20:W21)-1)*7)+(COLUMNS(W20:X20)-1)","v":"2019-12-03"},{"$f":"VLOOKUP(W18,$B$10:$C$21,2,0)+((ROWS(W20:W21)-1)*7)+(COLUMNS(W20:Y20)-1)","v":"2019-12-04"},{"$f":"VLOOKUP(W18,$B$10:$C$21,2,0)+((ROWS(W20:W21)-1)*7)+(COLUMNS(W20:Z20)-1)","v":"2019-12-05"},{"$f":"VLOOKUP(W18,$B$10:$C$21,2,0)+((ROWS(W20:W21)-1)*7)+(COLUMNS(W20:AA20)-1)","v":"2019-12-06"},{"$f":"VLOOKUP(W18,$B$10:$C$21,2,0)+((ROWS(W20:W21)-1)*7)+(COLUMNS(W20:AB20)-1)","v":"2019-12-07"},{"$f":"VLOOKUP(W18,$B$10:$C$21,2,0)+((ROWS(W20:W21)-1)*7)+(COLUMNS(W20:AC20)-1)","v":"2019-12-08"},null,{"$f":"VLOOKUP(AE18,$B$10:$C$21,2,0)+((ROWS(AE20:AE21)-1)*7)+(COLUMNS(AE20:AE20)-1)","v":"2020-01-06"},{"$f":"VLOOKUP(AE18,$B$10:$C$21,2,0)+((ROWS(AE20:AE21)-1)*7)+(COLUMNS(AE20:AF20)-1)","v":"2020-01-07"},{"$f":"VLOOKUP(AE18,$B$10:$C$21,2,0)+((ROWS(AE20:AE21)-1)*7)+(COLUMNS(AE20:AG20)-1)","v":"2020-01-08"},{"$f":"VLOOKUP(AE18,$B$10:$C$21,2,0)+((ROWS(AE20:AE21)-1)*7)+(COLUMNS(AE20:AH20)-1)","v":"2020-01-09"},{"$f":"VLOOKUP(AE18,$B$10:$C$21,2,0)+((ROWS(AE20:AE21)-1)*7)+(COLUMNS(AE20:AI20)-1)","v":"2020-01-10"},{"$f":"VLOOKUP(AE18,$B$10:$C$21,2,0)+((ROWS(AE20:AE21)-1)*7)+(COLUMNS(AE20:AJ20)-1)","v":"2020-01-11"},{"$f":"VLOOKUP(AE18,$B$10:$C$21,2,0)+((ROWS(AE20:AE21)-1)*7)+(COLUMNS(AE20:AK20)-1)","v":"2020-01-12"}]
[{"$nulls":14},{"$f":"VLOOKUP(O18,$B$10:$C$21,2,0)+((ROWS(O20:O22)-1)*7)+(COLUMNS(O20:O20)-1)","v":"2019-11-11"},{"$f":"VLOOKUP(O18,$B$10:$C$21,2,0)+((ROWS(O20:O22)-1)*7)+(COLUMNS(O20:P20)-1)","v":"2019-11-12"},{"$f":"VLOOKUP(O18,$B$10:$C$21,2,0)+((ROWS(O20:O22)-1)*7)+(COLUMNS(O20:Q20)-1)","v":"2019-11-13"},{"$f":"VLOOKUP(O18,$B$10:$C$21,2,0)+((ROWS(O20:O22)-1)*7)+(COLUMNS(O20:R20)-1)","v":"2019-11-14"},{"$f":"VLOOKUP(O18,$B$10:$C$21,2,0)+((ROWS(O20:O22)-1)*7)+(COLUMNS(O20:S20)-1)","v":"2019-11-15"},{"$f":"VLOOKUP(O18,$B$10:$C$21,2,0)+((ROWS(O20:O22)-1)*7)+(COLUMNS(O20:T20)-1)","v":"2019-11-16"},{"$f":"VLOOKUP(O18,$B$10:$C$21,2,0)+((ROWS(O20:O22)-1)*7)+(COLUMNS(O20:U20)-1)","v":"2019-11-17"},null,{"$f":"VLOOKUP(W18,$B$10:$C$21,2,0)+((ROWS(W20:W22)-1)*7)+(COLUMNS(W20:W20)-1)","v":"2019-12-09"},{"$f":"VLOOKUP(W18,$B$10:$C$21,2,0)+((ROWS(W20:W22)-1)*7)+(COLUMNS(W20:X20)-1)","v":"2019-12-10"},{"$f":"VLOOKUP(W18,$B$10:$C$21,2,0)+((ROWS(W20:W22)-1)*7)+(COLUMNS(W20:Y20)-1)","v":"2019-12-11"},{"$f":"VLOOKUP(W18,$B$10:$C$21,2,0)+((ROWS(W20:W22)-1)*7)+(COLUMNS(W20:Z20)-1)","v":"2019-12-12"},{"$f":"VLOOKUP(W18,$B$10:$C$21,2,0)+((ROWS(W20:W22)-1)*7)+(COLUMNS(W20:AA20)-1)","v":"2019-12-13"},{"$f":"VLOOKUP(W18,$B$10:$C$21,2,0)+((ROWS(W20:W22)-1)*7)+(COLUMNS(W20:AB20)-1)","v":"2019-12-14"},{"$f":"VLOOKUP(W18,$B$10:$C$21,2,0)+((ROWS(W20:W22)-1)*7)+(COLUMNS(W20:AC20)-1)","v":"2019-12-15"},null,{"$f":"VLOOKUP(AE18,$B$10:$C$21,2,0)+((ROWS(AE20:AE22)-1)*7)+(COLUMNS(AE20:AE20)-1)","v":"2020-01-13"},{"$f":"VLOOKUP(AE18,$B$10:$C$21,2,0)+((ROWS(AE20:AE22)-1)*7)+(COLUMNS(AE20:AF20)-1)","v":"2020-01-14"},{"$f":"VLOOKUP(AE18,$B$10:$C$21,2,0)+((ROWS(AE20:AE22)-1)*7)+(COLUMNS(AE20:AG20)-1)","v":"2020-01-15"},{"$f":"VLOOKUP(AE18,$B$10:$C$21,2,0)+((ROWS(AE20:AE22)-1)*7)+(COLUMNS(AE20:AH20)-1)","v":"2020-01-16"},{"$f":"VLOOKUP(AE18,$B$10:$C$21,2,0)+((ROWS(AE20:AE22)-1)*7)+(COLUMNS(AE20:AI20)-1)","v":"2020-01-17"},{"$f":"VLOOKUP(AE18,$B$10:$C$21,2,0)+((ROWS(AE20:AE22)-1)*7)+(COLUMNS(AE20:AJ20)-1)","v":"2020-01-18"},{"$f":"VLOOKUP(AE18,$B$10:$C$21,2,0)+((ROWS(AE20:AE22)-1)*7)+(COLUMNS(AE20:AK20)-1)","v":"2020-01-19"}]
[{"$nulls":14},{"$f":"VLOOKUP(O18,$B$10:$C$21,2,0)+((ROWS(O20:O23)-1)*7)+(COLUMNS(O20:O20)-1)","v":"2019-11-18"},{"$f":"VLOOKUP(O18,$B$10:$C$21,2,0)+((ROWS(O20:O23)-1)*7)+(COLUMNS(O20:P20)-1)","v":"2019-11-19"},{"$f":"VLOOKUP(O18,$B$10:$C$21,2,0)+((ROWS(O20:O23)-1)*7)+(COLUMNS(O20:Q20)-1)","v":"2019-11-20"},{"$f":"VLOOKUP(O18,$B$10:$C$21,2,0)+((ROWS(O20:O23)-1)*7)+(COLUMNS(O20:R20)-1)","v":"2019-11-21"},{"$f":"VLOOKUP(O18,$B$10:$C$21,2,0)+((ROWS(O20:O23)-1)*7)+(COLUMNS(O20:S20)-1)","v":"2019-11-22"},{"$f":"VLOOKUP(O18,$B$10:$C$21,2,0)+((ROWS(O20:O23)-1)*7)+(COLUMNS(O20:T20)-1)","v":"2019-11-23"},{"$f":"VLOOKUP(O18,$B$10:$C$21,2,0)+((ROWS(O20:O23)-1)*7)+(COLUMNS(O20:U20)-1)","v":"2019-11-24"},null,{"$f":"VLOOKUP(W18,$B$10:$C$21,2,0)+((ROWS(W20:W23)-1)*7)+(COLUMNS(W20:W20)-1)","v":"2019-12-16"},{"$f":"VLOOKUP(W18,$B$10:$C$21,2,0)+((ROWS(W20:W23)-1)*7)+(COLUMNS(W20:X20)-1)","v":"2019-12-17"},{"$f":"VLOOKUP(W18,$B$10:$C$21,2,0)+((ROWS(W20:W23)-1)*7)+(COLUMNS(W20:Y20)-1)","v":"2019-12-18"},{"$f":"VLOOKUP(W18,$B$10:$C$21,2,0)+((ROWS(W20:W23)-1)*7)+(COLUMNS(W20:Z20)-1)","v":"2019-12-19"},{"$f":"VLOOKUP(W18,$B$10:$C$21,2,0)+((ROWS(W20:W23)-1)*7)+(COLUMNS(W20:AA20)-1)","v":"2019-12-20"},{"$f":"VLOOKUP(W18,$B$10:$C$21,2,0)+((ROWS(W20:W23)-1)*7)+(COLUMNS(W20:AB20)-1)","v":"2019-12-21"},{"$f":"VLOOKUP(W18,$B$10:$C$21,2,0)+((ROWS(W20:W23)-1)*7)+(COLUMNS(W20:AC20)-1)","v":"2019-12-22"},null,{"$f":"VLOOKUP(AE18,$B$10:$C$21,2,0)+((ROWS(AE20:AE23)-1)*7)+(COLUMNS(AE20:AE20)-1)","v":"2020-01-20"},{"$f":"VLOOKUP(AE18,$B$10:$C$21,2,0)+((ROWS(AE20:AE23)-1)*7)+(COLUMNS(AE20:AF20)-1)","v":"2020-01-21"},{"$f":"VLOOKUP(AE18,$B$10:$C$21,2,0)+((ROWS(AE20:AE23)-1)*7)+(COLUMNS(AE20:AG20)-1)","v":"2020-01-22"},{"$f":"VLOOKUP(AE18,$B$10:$C$21,2,0)+((ROWS(AE20:AE23)-1)*7)+(COLUMNS(AE20:AH20)-1)","v":"2020-01-23"},{"$f":"VLOOKUP(AE18,$B$10:$C$21,2,0)+((ROWS(AE20:AE23)-1)*7)+(COLUMNS(AE20:AI20)-1)","v":"2020-01-24"},{"$f":"VLOOKUP(AE18,$B$10:$C$21,2,0)+((ROWS(AE20:AE23)-1)*7)+(COLUMNS(AE20:AJ20)-1)","v":"2020-01-25"},{"$f":"VLOOKUP(AE18,$B$10:$C$21,2,0)+((ROWS(AE20:AE23)-1)*7)+(COLUMNS(AE20:AK20)-1)","v":"2020-01-26"}]
[{"$nulls":14},{"$f":"VLOOKUP(O18,$B$10:$C$21,2,0)+((ROWS(O20:O24)-1)*7)+(COLUMNS(O20:O20)-1)","v":"2019-11-25"},{"$f":"VLOOKUP(O18,$B$10:$C$21,2,0)+((ROWS(O20:O24)-1)*7)+(COLUMNS(O20:P20)-1)","v":"2019-11-26"},{"$f":"VLOOKUP(O18,$B$10:$C$21,2,0)+((ROWS(O20:O24)-1)*7)+(COLUMNS(O20:Q20)-1)","v":"2019-11-27"},{"$f":"VLOOKUP(O18,$B$10:$C$21,2,0)+((ROWS(O20:O24)-1)*7)+(COLUMNS(O20:R20)-1)","v":"2019-11-28"},{"$f":"VLOOKUP(O18,$B$10:$C$21,2,0)+((ROWS(O20:O24)-1)*7)+(COLUMNS(O20:S20)-1)","v":"2019-11-29"},{"$f":"VLOOKUP(O18,$B$10:$C$21,2,0)+((ROWS(O20:O24)-1)*7)+(COLUMNS(O20:T20)-1)","v":"2019-11-30"},{"$f":"VLOOKUP(O18,$B$10:$C$21,2,0)+((ROWS(O20:O24)-1)*7)+(COLUMNS(O20:U20)-1)","v":"2019-12-01"},null,{"$f":"VLOOKUP(W18,$B$10:$C$21,2,0)+((ROWS(W20:W24)-1)*7)+(COLUMNS(W20:W20)-1)","v":"2019-12-23"},{"$f":"VLOOKUP(W18,$B$10:$C$21,2,0)+((ROWS(W20:W24)-1)*7)+(COLUMNS(W20:X20)-1)","v":"2019-12-24"},{"$f":"VLOOKUP(W18,$B$10:$C$21,2,0)+((ROWS(W20:W24)-1)*7)+(COLUMNS(W20:Y20)-1)","v":"2019-12-25"},{"$f":"VLOOKUP(W18,$B$10:$C$21,2,0)+((ROWS(W20:W24)-1)*7)+(COLUMNS(W20:Z20)-1)","v":"2019-12-26"},{"$f":"VLOOKUP(W18,$B$10:$C$21,2,0)+((ROWS(W20:W24)-1)*7)+(COLUMNS(W20:AA20)-1)","v":"2019-12-27"},{"$f":"VLOOKUP(W18,$B$10:$C$21,2,0)+((ROWS(W20:W24)-1)*7)+(COLUMNS(W20:AB20)-1)","v":"2019-12-28"},{"$f":"VLOOKUP(W18,$B$10:$C$21,2,0)+((ROWS(W20:W24)-1)*7)+(COLUMNS(W20:AC20)-1)","v":"2019-12-29"},null,{"$f":"VLOOKUP(AE18,$B$10:$C$21,2,0)+((ROWS(AE20:AE24)-1)*7)+(COLUMNS(AE20:AE20)-1)","v":"2020-01-27"},{"$f":"VLOOKUP(AE18,$B$10:$C$21,2,0)+((ROWS(AE20:AE24)-1)*7)+(COLUMNS(AE20:AF20)-1)","v":"2020-01-28"},{"$f":"VLOOKUP(AE18,$B$10:$C$21,2,0)+((ROWS(AE20:AE24)-1)*7)+(COLUMNS(AE20:AG20)-1)","v":"2020-01-29"},{"$f":"VLOOKUP(AE18,$B$10:$C$21,2,0)+((ROWS(AE20:AE24)-1)*7)+(COLUMNS(AE20:AH20)-1)","v":"2020-01-30"},{"$f":"VLOOKUP(AE18,$B$10:$C$21,2,0)+((ROWS(AE20:AE24)-1)*7)+(COLUMNS(AE20:AI20)-1)","v":"2020-01-31"},{"$f":"VLOOKUP(AE18,$B$10:$C$21,2,0)+((ROWS(AE20:AE24)-1)*7)+(COLUMNS(AE20:AJ20)-1)","v":"2020-02-01"},{"$f":"VLOOKUP(AE18,$B$10:$C$21,2,0)+((ROWS(AE20:AE24)-1)*7)+(COLUMNS(AE20:AK20)-1)","v":"2020-02-02"}]
[{"$nulls":14},{"$f":"VLOOKUP(O18,$B$10:$C$21,2,0)+((ROWS(O20:O25)-1)*7)+(COLUMNS(O20:O20)-1)","v":"2019-12-02"},{"$f":"VLOOKUP(O18,$B$10:$C$21,2,0)+((ROWS(O20:O25)-1)*7)+(COLUMNS(O20:P20)-1)","v":"2019-12-03"},{"$f":"VLOOKUP(O18,$B$10:$C$21,2,0)+((ROWS(O20:O25)-1)*7)+(COLUMNS(O20:Q20)-1)","v":"2019-12-04"},{"$f":"VLOOKUP(O18,$B$10:$C$21,2,0)+((ROWS(O20:O25)-1)*7)+(COLUMNS(O20:R20)-1)","v":"2019-12-05"},{"$f":"VLOOKUP(O18,$B$10:$C$21,2,0)+((ROWS(O20:O25)-1)*7)+(COLUMNS(O20:S20)-1)","v":"2019-12-06"},{"$f":"VLOOKUP(O18,$B$10:$C$21,2,0)+((ROWS(O20:O25)-1)*7)+(COLUMNS(O20:T20)-1)","v":"2019-12-07"},{"$f":"VLOOKUP(O18,$B$10:$C$21,2,0)+((ROWS(O20:O25)-1)*7)+(COLUMNS(O20:U20)-1)","v":"2019-12-08"},null,{"$f":"VLOOKUP(W18,$B$10:$C$21,2,0)+((ROWS(W20:W25)-1)*7)+(COLUMNS(W20:W20)-1)","v":"2019-12-30"},{"$f":"VLOOKUP(W18,$B$10:$C$21,2,0)+((ROWS(W20:W25)-1)*7)+(COLUMNS(W20:X20)-1)","v":"2019-12-31"},{"$f":"VLOOKUP(W18,$B$10:$C$21,2,0)+((ROWS(W20:W25)-1)*7)+(COLUMNS(W20:Y20)-1)","v":"2020-01-01"},{"$f":"VLOOKUP(W18,$B$10:$C$21,2,0)+((ROWS(W20:W25)-1)*7)+(COLUMNS(W20:Z20)-1)","v":"2020-01-02"},{"$f":"VLOOKUP(W18,$B$10:$C$21,2,0)+((ROWS(W20:W25)-1)*7)+(COLUMNS(W20:AA20)-1)","v":"2020-01-03"},{"$f":"VLOOKUP(W18,$B$10:$C$21,2,0)+((ROWS(W20:W25)-1)*7)+(COLUMNS(W20:AB20)-1)","v":"2020-01-04"},{"$f":"VLOOKUP(W18,$B$10:$C$21,2,0)+((ROWS(W20:W25)-1)*7)+(COLUMNS(W20:AC20)-1)","v":"2020-01-05"},null,{"$f":"VLOOKUP(AE18,$B$10:$C$21,2,0)+((ROWS(AE20:AE25)-1)*7)+(COLUMNS(AE20:AE20)-1)","v":"2020-02-03"},{"$f":"VLOOKUP(AE18,$B$10:$C$21,2,0)+((ROWS(AE20:AE25)-1)*7)+(COLUMNS(AE20:AF20)-1)","v":"2020-02-04"},{"$f":"VLOOKUP(AE18,$B$10:$C$21,2,0)+((ROWS(AE20:AE25)-1)*7)+(COLUMNS(AE20:AG20)-1)","v":"2020-02-05"},{"$f":"VLOOKUP(AE18,$B$10:$C$21,2,0)+((ROWS(AE20:AE25)-1)*7)+(COLUMNS(AE20:AH20)-1)","v":"2020-02-06"},{"$f":"VLOOKUP(AE18,$B$10:$C$21,2,0)+((ROWS(AE20:AE25)-1)*7)+(COLUMNS(AE20:AI20)-1)","v":"2020-02-07"},{"$f":"VLOOKUP(AE18,$B$10:$C$21,2,0)+((ROWS(AE20:AE25)-1)*7)+(COLUMNS(AE20:AJ20)-1)","v":"2020-02-08"},{"$f":"VLOOKUP(AE18,$B$10:$C$21,2,0)+((ROWS(AE20:AE25)-1)*7)+(COLUMNS(AE20:AK20)-1)","v":"2020-02-09"}]
[]
[{"$nulls":14},{"$f":"B16","v":"Febrero • 2020"},{"$nulls":7},{"$f":"B17","v":"Marzo • 2020"},{"$nulls":7},{"$f":"B18","v":"Abril • 2020"}]
[{"$nulls":14},{"$f":"lista03.3","v":"Lu"},"Ma","Mi","Ju","Vi","Sá","Do",null,{"$f":"lista03.3","v":"Lu"},"Ma","Mi","Ju","Vi","Sá","Do",null,{"$f":"lista03.3","v":"Lu"},"Ma","Mi","Ju","Vi","Sá","Do"]
[{"$nulls":14},{"$f":"VLOOKUP(O27,$B$10:$C$21,2,0)+((ROWS(O29:O29)-1)*7)+(COLUMNS(O29:O29)-1)","v":"2020-01-27"},{"$f":"VLOOKUP(O27,$B$10:$C$21,2,0)+((ROWS(O29:O29)-1)*7)+(COLUMNS(O29:P29)-1)","v":"2020-01-28"},{"$f":"VLOOKUP(O27,$B$10:$C$21,2,0)+((ROWS(O29:O29)-1)*7)+(COLUMNS(O29:Q29)-1)","v":"2020-01-29"},{"$f":"VLOOKUP(O27,$B$10:$C$21,2,0)+((ROWS(O29:O29)-1)*7)+(COLUMNS(O29:R29)-1)","v":"2020-01-30"},{"$f":"VLOOKUP(O27,$B$10:$C$21,2,0)+((ROWS(O29:O29)-1)*7)+(COLUMNS(O29:S29)-1)","v":"2020-01-31"},{"$f":"VLOOKUP(O27,$B$10:$C$21,2,0)+((ROWS(O29:O29)-1)*7)+(COLUMNS(O29:T29)-1)","v":"2020-02-01"},{"$f":"VLOOKUP(O27,$B$10:$C$21,2,0)+((ROWS(O29:O29)-1)*7)+(COLUMNS(O29:U29)-1)","v":"2020-02-02"},null,{"$f":"VLOOKUP(W27,$B$10:$C$21,2,0)+((ROWS(W29:W29)-1)*7)+(COLUMNS(W29:W29)-1)","v":"2020-02-24"},{"$f":"VLOOKUP(W27,$B$10:$C$21,2,0)+((ROWS(W29:W29)-1)*7)+(COLUMNS(W29:X29)-1)","v":"2020-02-25"},{"$f":"VLOOKUP(W27,$B$10:$C$21,2,0)+((ROWS(W29:W29)-1)*7)+(COLUMNS(W29:Y29)-1)","v":"2020-02-26"},{"$f":"VLOOKUP(W27,$B$10:$C$21,2,0)+((ROWS(W29:W29)-1)*7)+(COLUMNS(W29:Z29)-1)","v":"2020-02-27"},{"$f":"VLOOKUP(W27,$B$10:$C$21,2,0)+((ROWS(W29:W29)-1)*7)+(COLUMNS(W29:AA29)-1)","v":"2020-02-28"},{"$f":"VLOOKUP(W27,$B$10:$C$21,2,0)+((ROWS(W29:W29)-1)*7)+(COLUMNS(W29:AB29)-1)","v":"2020-02-29"},{"$f":"VLOOKUP(W27,$B$10:$C$21,2,0)+((ROWS(W29:W29)-1)*7)+(COLUMNS(W29:AC29)-1)","v":"2020-03-01"},null,{"$f":"VLOOKUP(AE27,$B$10:$C$21,2,0)+((ROWS(AE29:AE29)-1)*7)+(COLUMNS(AE29:AE29)-1)","v":"2020-03-30"},{"$f":"VLOOKUP(AE27,$B$10:$C$21,2,0)+((ROWS(AE29:AE29)-1)*7)+(COLUMNS(AE29:AF29)-1)","v":"2020-03-31"},{"$f":"VLOOKUP(AE27,$B$10:$C$21,2,0)+((ROWS(AE29:AE29)-1)*7)+(COLUMNS(AE29:AG29)-1)","v":"2020-04-01"},{"$f":"VLOOKUP(AE27,$B$10:$C$21,2,0)+((ROWS(AE29:AE29)-1)*7)+(COLUMNS(AE29:AH29)-1)","v":"2020-04-02"},{"$f":"VLOOKUP(AE27,$B$10:$C$21,2,0)+((ROWS(AE29:AE29)-1)*7)+(COLUMNS(AE29:AI29)-1)","v":"2020-04-03"},{"$f":"VLOOKUP(AE27,$B$10:$C$21,2,0)+((ROWS(AE29:AE29)-1)*7)+(COLUMNS(AE29:AJ29)-1)","v":"2020-04-04"},{"$f":"VLOOKUP(AE27,$B$10:$C$21,2,0)+((ROWS(AE29:AE29)-1)*7)+(COLUMNS(AE29:AK29)-1)","v":"2020-04-05"}]
[{"$nulls":14},{"$f":"VLOOKUP(O27,$B$10:$C$21,2,0)+((ROWS(O29:O30)-1)*7)+(COLUMNS(O29:O29)-1)","v":"2020-02-03"},{"$f":"VLOOKUP(O27,$B$10:$C$21,2,0)+((ROWS(O29:O30)-1)*7)+(COLUMNS(O29:P29)-1)","v":"2020-02-04"},{"$f":"VLOOKUP(O27,$B$10:$C$21,2,0)+((ROWS(O29:O30)-1)*7)+(COLUMNS(O29:Q29)-1)","v":"2020-02-05"},{"$f":"VLOOKUP(O27,$B$10:$C$21,2,0)+((ROWS(O29:O30)-1)*7)+(COLUMNS(O29:R29)-1)","v":"2020-02-06"},{"$f":"VLOOKUP(O27,$B$10:$C$21,2,0)+((ROWS(O29:O30)-1)*7)+(COLUMNS(O29:S29)-1)","v":"2020-02-07"},{"$f":"VLOOKUP(O27,$B$10:$C$21,2,0)+((ROWS(O29:O30)-1)*7)+(COLUMNS(O29:T29)-1)","v":"2020-02-08"},{"$f":"VLOOKUP(O27,$B$10:$C$21,2,0)+((ROWS(O29:O30)-1)*7)+(COLUMNS(O29:U29)-1)","v":"2020-02-09"},null,{"$f":"VLOOKUP(W27,$B$10:$C$21,2,0)+((ROWS(W29:W30)-1)*7)+(COLUMNS(W29:W29)-1)","v":"2020-03-02"},{"$f":"VLOOKUP(W27,$B$10:$C$21,2,0)+((ROWS(W29:W30)-1)*7)+(COLUMNS(W29:X29)-1)","v":"2020-03-03"},{"$f":"VLOOKUP(W27,$B$10:$C$21,2,0)+((ROWS(W29:W30)-1)*7)+(COLUMNS(W29:Y29)-1)","v":"2020-03-04"},{"$f":"VLOOKUP(W27,$B$10:$C$21,2,0)+((ROWS(W29:W30)-1)*7)+(COLUMNS(W29:Z29)-1)","v":"2020-03-05"},{"$f":"VLOOKUP(W27,$B$10:$C$21,2,0)+((ROWS(W29:W30)-1)*7)+(COLUMNS(W29:AA29)-1)","v":"2020-03-06"},{"$f":"VLOOKUP(W27,$B$10:$C$21,2,0)+((ROWS(W29:W30)-1)*7)+(COLUMNS(W29:AB29)-1)","v":"2020-03-07"},{"$f":"VLOOKUP(W27,$B$10:$C$21,2,0)+((ROWS(W29:W30)-1)*7)+(COLUMNS(W29:AC29)-1)","v":"2020-03-08"},null,{"$f":"VLOOKUP(AE27,$B$10:$C$21,2,0)+((ROWS(AE29:AE30)-1)*7)+(COLUMNS(AE29:AE29)-1)","v":"2020-04-06"},{"$f":"VLOOKUP(AE27,$B$10:$C$21,2,0)+((ROWS(AE29:AE30)-1)*7)+(COLUMNS(AE29:AF29)-1)","v":"2020-04-07"},{"$f":"VLOOKUP(AE27,$B$10:$C$21,2,0)+((ROWS(AE29:AE30)-1)*7)+(COLUMNS(AE29:AG29)-1)","v":"2020-04-08"},{"$f":"VLOOKUP(AE27,$B$10:$C$21,2,0)+((ROWS(AE29:AE30)-1)*7)+(COLUMNS(AE29:AH29)-1)","v":"2020-04-09"},{"$f":"VLOOKUP(AE27,$B$10:$C$21,2,0)+((ROWS(AE29:AE30)-1)*7)+(COLUMNS(AE29:AI29)-1)","v":"2020-04-10"},{"$f":"VLOOKUP(AE27,$B$10:$C$21,2,0)+((ROWS(AE29:AE30)-1)*7)+(COLUMNS(AE29:AJ29)-1)","v":"2020-04-11"},{"$f":"VLOOKUP(AE27,$B$10:$C$21,2,0)+((ROWS(AE29:AE30)-1)*7)+(COLUMNS(AE29:AK29)-1)","v":"2020-04-12"}]
[{"$nulls":14},{"$f":"VLOOKUP(O27,$B$10:$C$21,2,0)+((ROWS(O29:O31)-1)*7)+(COLUMNS(O29:O29)-1)","v":"2020-02-10"},{"$f":"VLOOKUP(O27,$B$10:$C$21,2,0)+((ROWS(O29:O31)-1)*7)+(COLUMNS(O29:P29)-1)","v":"2020-02-11"},{"$f":"VLOOKUP(O27,$B$10:$C$21,2,0)+((ROWS(O29:O31)-1)*7)+(COLUMNS(O29:Q29)-1)","v":"2020-02-12"},{"$f":"VLOOKUP(O27,$B$10:$C$21,2,0)+((ROWS(O29:O31)-1)*7)+(COLUMNS(O29:R29)-1)","v":"2020-02-13"},{"$f":"VLOOKUP(O27,$B$10:$C$21,2,0)+((ROWS(O29:O31)-1)*7)+(COLUMNS(O29:S29)-1)","v":"2020-02-14"},{"$f":"VLOOKUP(O27,$B$10:$C$21,2,0)+((ROWS(O29:O31)-1)*7)+(COLUMNS(O29:T29)-1)","v":"2020-02-15"},{"$f":"VLOOKUP(O27,$B$10:$C$21,2,0)+((ROWS(O29:O31)-1)*7)+(COLUMNS(O29:U29)-1)","v":"2020-02-16"},null,{"$f":"VLOOKUP(W27,$B$10:$C$21,2,0)+((ROWS(W29:W31)-1)*7)+(COLUMNS(W29:W29)-1)","v":"2020-03-09"},{"$f":"VLOOKUP(W27,$B$10:$C$21,2,0)+((ROWS(W29:W31)-1)*7)+(COLUMNS(W29:X29)-1)","v":"2020-03-10"},{"$f":"VLOOKUP(W27,$B$10:$C$21,2,0)+((ROWS(W29:W31)-1)*7)+(COLUMNS(W29:Y29)-1)","v":"2020-03-11"},{"$f":"VLOOKUP(W27,$B$10:$C$21,2,0)+((ROWS(W29:W31)-1)*7)+(COLUMNS(W29:Z29)-1)","v":"2020-03-12"},{"$f":"VLOOKUP(W27,$B$10:$C$21,2,0)+((ROWS(W29:W31)-1)*7)+(COLUMNS(W29:AA29)-1)","v":"2020-03-13"},{"$f":"VLOOKUP(W27,$B$10:$C$21,2,0)+((ROWS(W29:W31)-1)*7)+(COLUMNS(W29:AB29)-1)","v":"2020-03-14"},{"$f":"VLOOKUP(W27,$B$10:$C$21,2,0)+((ROWS(W29:W31)-1)*7)+(COLUMNS(W29:AC29)-1)","v":"2020-03-15"},null,{"$f":"VLOOKUP(AE27,$B$10:$C$21,2,0)+((ROWS(AE29:AE31)-1)*7)+(COLUMNS(AE29:AE29)-1)","v":"2020-04-13"},{"$f":"VLOOKUP(AE27,$B$10:$C$21,2,0)+((ROWS(AE29:AE31)-1)*7)+(COLUMNS(AE29:AF29)-1)","v":"2020-04-14"},{"$f":"VLOOKUP(AE27,$B$10:$C$21,2,0)+((ROWS(AE29:AE31)-1)*7)+(COLUMNS(AE29:AG29)-1)","v":"2020-04-15"},{"$f":"VLOOKUP(AE27,$B$10:$C$21,2,0)+((ROWS(AE29:AE31)-1)*7)+(COLUMNS(AE29:AH29)-1)","v":"2020-04-16"},{"$f":"VLOOKUP(AE27,$B$10:$C$21,2,0)+((ROWS(AE29:AE31)-1)*7)+(COLUMNS(AE29:AI29)-1)","v":"2020-04-17"},{"$f":"VLOOKUP(AE27,$B$10:$C$21,2,0)+((ROWS(AE29:AE31)-1)*7)+(COLUMNS(AE29:AJ29)-1)","v":"2020-04-18"},{"$f":"VLOOKUP(AE27,$B$10:$C$21,2,0)+((ROWS(AE29:AE31)-1)*7)+(COLUMNS(AE29:AK29)-1)","v":"2020-04-19"}]
[{"$nulls":14},{"$f":"VLOOKUP(O27,$B$10:$C$21,2,0)+((ROWS(O29:O32)-1)*7)+(COLUMNS(O29:O29)-1)","v":"2020-02-17"},{"$f":"VLOOKUP(O27,$B$10:$C$21,2,0)+((ROWS(O29:O32)-1)*7)+(COLUMNS(O29:P29)-1)","v":"2020-02-18"},{"$f":"VLOOKUP(O27,$B$10:$C$21,2,0)+((ROWS(O29:O32)-1)*7)+(COLUMNS(O29:Q29)-1)","v":"2020-02-19"},{"$f":"VLOOKUP(O27,$B$10:$C$21,2,0)+((ROWS(O29:O32)-1)*7)+(COLUMNS(O29:R29)-1)","v":"2020-02-20"},{"$f":"VLOOKUP(O27,$B$10:$C$21,2,0)+((ROWS(O29:O32)-1)*7)+(COLUMNS(O29:S29)-1)","v":"2020-02-21"},{"$f":"VLOOKUP(O27,$B$10:$C$21,2,0)+((ROWS(O29:O32)-1)*7)+(COLUMNS(O29:T29)-1)","v":"2020-02-22"},{"$f":"VLOOKUP(O27,$B$10:$C$21,2,0)+((ROWS(O29:O32)-1)*7)+(COLUMNS(O29:U29)-1)","v":"2020-02-23"},null,{"$f":"VLOOKUP(W27,$B$10:$C$21,2,0)+((ROWS(W29:W32)-1)*7)+(COLUMNS(W29:W29)-1)","v":"2020-03-16"},{"$f":"VLOOKUP(W27,$B$10:$C$21,2,0)+((ROWS(W29:W32)-1)*7)+(COLUMNS(W29:X29)-1)","v":"2020-03-17"},{"$f":"VLOOKUP(W27,$B$10:$C$21,2,0)+((ROWS(W29:W32)-1)*7)+(COLUMNS(W29:Y29)-1)","v":"2020-03-18"},{"$f":"VLOOKUP(W27,$B$10:$C$21,2,0)+((ROWS(W29:W32)-1)*7)+(COLUMNS(W29:Z29)-1)","v":"2020-03-19"},{"$f":"VLOOKUP(W27,$B$10:$C$21,2,0)+((ROWS(W29:W32)-1)*7)+(COLUMNS(W29:AA29)-1)","v":"2020-03-20"},{"$f":"VLOOKUP(W27,$B$10:$C$21,2,0)+((ROWS(W29:W32)-1)*7)+(COLUMNS(W29:AB29)-1)","v":"2020-03-21"},{"$f":"VLOOKUP(W27,$B$10:$C$21,2,0)+((ROWS(W29:W32)-1)*7)+(COLUMNS(W29:AC29)-1)","v":"2020-03-22"},null,{"$f":"VLOOKUP(AE27,$B$10:$C$21,2,0)+((ROWS(AE29:AE32)-1)*7)+(COLUMNS(AE29:AE29)-1)","v":"2020-04-20"},{"$f":"VLOOKUP(AE27,$B$10:$C$21,2,0)+((ROWS(AE29:AE32)-1)*7)+(COLUMNS(AE29:AF29)-1)","v":"2020-04-21"},{"$f":"VLOOKUP(AE27,$B$10:$C$21,2,0)+((ROWS(AE29:AE32)-1)*7)+(COLUMNS(AE29:AG29)-1)","v":"2020-04-22"},{"$f":"VLOOKUP(AE27,$B$10:$C$21,2,0)+((ROWS(AE29:AE32)-1)*7)+(COLUMNS(AE29:AH29)-1)","v":"2020-04-23"},{"$f":"VLOOKUP(AE27,$B$10:$C$21,2,0)+((ROWS(AE29:AE32)-1)*7)+(COLUMNS(AE29:AI29)-1)","v":"2020-04-24"},{"$f":"VLOOKUP(AE27,$B$10:$C$21,2,0)+((ROWS(AE29:AE32)-1)*7)+(COLUMNS(AE29:AJ29)-1)","v":"2020-04-25"},{"$f":"VLOOKUP(AE27,$B$10:$C$21,2,0)+((ROWS(AE29:AE32)-1)*7)+(COLUMNS(AE29:AK29)-1)","v":"2020-04-26"}]
[{"$nulls":14},{"$f":"VLOOKUP(O27,$B$10:$C$21,2,0)+((ROWS(O29:O33)-1)*7)+(COLUMNS(O29:O29)-1)","v":"2020-02-24"},{"$f":"VLOOKUP(O27,$B$10:$C$21,2,0)+((ROWS(O29:O33)-1)*7)+(COLUMNS(O29:P29)-1)","v":"2020-02-25"},{"$f":"VLOOKUP(O27,$B$10:$C$21,2,0)+((ROWS(O29:O33)-1)*7)+(COLUMNS(O29:Q29)-1)","v":"2020-02-26"},{"$f":"VLOOKUP(O27,$B$10:$C$21,2,0)+((ROWS(O29:O33)-1)*7)+(COLUMNS(O29:R29)-1)","v":"2020-02-27"},{"$f":"VLOOKUP(O27,$B$10:$C$21,2,0)+((ROWS(O29:O33)-1)*7)+(COLUMNS(O29:S29)-1)","v":"2020-02-28"},{"$f":"VLOOKUP(O27,$B$10:$C$21,2,0)+((ROWS(O29:O33)-1)*7)+(COLUMNS(O29:T29)-1)","v":"2020-02-29"},{"$f":"VLOOKUP(O27,$B$10:$C$21,2,0)+((ROWS(O29:O33)-1)*7)+(COLUMNS(O29:U29)-1)","v":"2020-03-01"},null,{"$f":"VLOOKUP(W27,$B$10:$C$21,2,0)+((ROWS(W29:W33)-1)*7)+(COLUMNS(W29:W29)-1)","v":"2020-03-23"},{"$f":"VLOOKUP(W27,$B$10:$C$21,2,0)+((ROWS(W29:W33)-1)*7)+(COLUMNS(W29:X29)-1)","v":"2020-03-24"},{"$f":"VLOOKUP(W27,$B$10:$C$21,2,0)+((ROWS(W29:W33)-1)*7)+(COLUMNS(W29:Y29)-1)","v":"2020-03-25"},{"$f":"VLOOKUP(W27,$B$10:$C$21,2,0)+((ROWS(W29:W33)-1)*7)+(COLUMNS(W29:Z29)-1)","v":"2020-03-26"},{"$f":"VLOOKUP(W27,$B$10:$C$21,2,0)+((ROWS(W29:W33)-1)*7)+(COLUMNS(W29:AA29)-1)","v":"2020-03-27"},{"$f":"VLOOKUP(W27,$B$10:$C$21,2,0)+((ROWS(W29:W33)-1)*7)+(COLUMNS(W29:AB29)-1)","v":"2020-03-28"},{"$f":"VLOOKUP(W27,$B$10:$C$21,2,0)+((ROWS(W29:W33)-1)*7)+(COLUMNS(W29:AC29)-1)","v":"2020-03-29"},null,{"$f":"VLOOKUP(AE27,$B$10:$C$21,2,0)+((ROWS(AE29:AE33)-1)*7)+(COLUMNS(AE29:AE29)-1)","v":"2020-04-27"},{"$f":"VLOOKUP(AE27,$B$10:$C$21,2,0)+((ROWS(AE29:AE33)-1)*7)+(COLUMNS(AE29:AF29)-1)","v":"2020-04-28"},{"$f":"VLOOKUP(AE27,$B$10:$C$21,2,0)+((ROWS(AE29:AE33)-1)*7)+(COLUMNS(AE29:AG29)-1)","v":"2020-04-29"},{"$f":"VLOOKUP(AE27,$B$10:$C$21,2,0)+((ROWS(AE29:AE33)-1)*7)+(COLUMNS(AE29:AH29)-1)","v":"2020-04-30"},{"$f":"VLOOKUP(AE27,$B$10:$C$21,2,0)+((ROWS(AE29:AE33)-1)*7)+(COLUMNS(AE29:AI29)-1)","v":"2020-05-01"},{"$f":"VLOOKUP(AE27,$B$10:$C$21,2,0)+((ROWS(AE29:AE33)-1)*7)+(COLUMNS(AE29:AJ29)-1)","v":"2020-05-02"},{"$f":"VLOOKUP(AE27,$B$10:$C$21,2,0)+((ROWS(AE29:AE33)-1)*7)+(COLUMNS(AE29:AK29)-1)","v":"2020-05-03"}]
[{"$nulls":14},{"$f":"VLOOKUP(O27,$B$10:$C$21,2,0)+((ROWS(O29:O34)-1)*7)+(COLUMNS(O29:O29)-1)","v":"2020-03-02"},{"$f":"VLOOKUP(O27,$B$10:$C$21,2,0)+((ROWS(O29:O34)-1)*7)+(COLUMNS(O29:P29)-1)","v":"2020-03-03"},{"$f":"VLOOKUP(O27,$B$10:$C$21,2,0)+((ROWS(O29:O34)-1)*7)+(COLUMNS(O29:Q29)-1)","v":"2020-03-04"},{"$f":"VLOOKUP(O27,$B$10:$C$21,2,0)+((ROWS(O29:O34)-1)*7)+(COLUMNS(O29:R29)-1)","v":"2020-03-05"},{"$f":"VLOOKUP(O27,$B$10:$C$21,2,0)+((ROWS(O29:O34)-1)*7)+(COLUMNS(O29:S29)-1)","v":"2020-03-06"},{"$f":"VLOOKUP(O27,$B$10:$C$21,2,0)+((ROWS(O29:O34)-1)*7)+(COLUMNS(O29:T29)-1)","v":"2020-03-07"},{"$f":"VLOOKUP(O27,$B$10:$C$21,2,0)+((ROWS(O29:O34)-1)*7)+(COLUMNS(O29:U29)-1)","v":"2020-03-08"},null,{"$f":"VLOOKUP(W27,$B$10:$C$21,2,0)+((ROWS(W29:W34)-1)*7)+(COLUMNS(W29:W29)-1)","v":"2020-03-30"},{"$f":"VLOOKUP(W27,$B$10:$C$21,2,0)+((ROWS(W29:W34)-1)*7)+(COLUMNS(W29:X29)-1)","v":"2020-03-31"},{"$f":"VLOOKUP(W27,$B$10:$C$21,2,0)+((ROWS(W29:W34)-1)*7)+(COLUMNS(W29:Y29)-1)","v":"2020-04-01"},{"$f":"VLOOKUP(W27,$B$10:$C$21,2,0)+((ROWS(W29:W34)-1)*7)+(COLUMNS(W29:Z29)-1)","v":"2020-04-02"},{"$f":"VLOOKUP(W27,$B$10:$C$21,2,0)+((ROWS(W29:W34)-1)*7)+(COLUMNS(W29:AA29)-1)","v":"2020-04-03"},{"$f":"VLOOKUP(W27,$B$10:$C$21,2,0)+((ROWS(W29:W34)-1)*7)+(COLUMNS(W29:AB29)-1)","v":"2020-04-04"},{"$f":"VLOOKUP(W27,$B$10:$C$21,2,0)+((ROWS(W29:W34)-1)*7)+(COLUMNS(W29:AC29)-1)","v":"2020-04-05"},null,{"$f":"VLOOKUP(AE27,$B$10:$C$21,2,0)+((ROWS(AE29:AE34)-1)*7)+(COLUMNS(AE29:AE29)-1)","v":"2020-05-04"},{"$f":"VLOOKUP(AE27,$B$10:$C$21,2,0)+((ROWS(AE29:AE34)-1)*7)+(COLUMNS(AE29:AF29)-1)","v":"2020-05-05"},{"$f":"VLOOKUP(AE27,$B$10:$C$21,2,0)+((ROWS(AE29:AE34)-1)*7)+(COLUMNS(AE29:AG29)-1)","v":"2020-05-06"},{"$f":"VLOOKUP(AE27,$B$10:$C$21,2,0)+((ROWS(AE29:AE34)-1)*7)+(COLUMNS(AE29:AH29)-1)","v":"2020-05-07"},{"$f":"VLOOKUP(AE27,$B$10:$C$21,2,0)+((ROWS(AE29:AE34)-1)*7)+(COLUMNS(AE29:AI29)-1)","v":"2020-05-08"},{"$f":"VLOOKUP(AE27,$B$10:$C$21,2,0)+((ROWS(AE29:AE34)-1)*7)+(COLUMNS(AE29:AJ29)-1)","v":"2020-05-09"},{"$f":"VLOOKUP(AE27,$B$10:$C$21,2,0)+((ROWS(AE29:AE34)-1)*7)+(COLUMNS(AE29:AK29)-1)","v":"2020-05-10"}]
[{"$nulls":14},{"$f":"VLOOKUP(O27,$B$10:$C$21,2,0)+((ROWS(O29:O35)-1)*7)+(COLUMNS(O29:O29)-1)","v":"2020-03-09"},{"$f":"VLOOKUP(O27,$B$10:$C$21,2,0)+((ROWS(O29:O35)-1)*7)+(COLUMNS(O29:P29)-1)","v":"2020-03-10"},{"$f":"VLOOKUP(O27,$B$10:$C$21,2,0)+((ROWS(O29:O35)-1)*7)+(COLUMNS(O29:Q29)-1)","v":"2020-03-11"},{"$f":"VLOOKUP(O27,$B$10:$C$21,2,0)+((ROWS(O29:O35)-1)*7)+(COLUMNS(O29:R29)-1)","v":"2020-03-12"},{"$f":"VLOOKUP(O27,$B$10:$C$21,2,0)+((ROWS(O29:O35)-1)*7)+(COLUMNS(O29:S29)-1)","v":"2020-03-13"},{"$f":"VLOOKUP(O27,$B$10:$C$21,2,0)+((ROWS(O29:O35)-1)*7)+(COLUMNS(O29:T29)-1)","v":"2020-03-14"},{"$f":"VLOOKUP(O27,$B$10:$C$21,2,0)+((ROWS(O29:O35)-1)*7)+(COLUMNS(O29:U29)-1)","v":"2020-03-15"},null,{"$f":"VLOOKUP(W27,$B$10:$C$21,2,0)+((ROWS(W29:W35)-1)*7)+(COLUMNS(W29:W29)-1)","v":"2020-04-06"},{"$f":"VLOOKUP(W27,$B$10:$C$21,2,0)+((ROWS(W29:W35)-1)*7)+(COLUMNS(W29:X29)-1)","v":"2020-04-07"},{"$f":"VLOOKUP(W27,$B$10:$C$21,2,0)+((ROWS(W29:W35)-1)*7)+(COLUMNS(W29:Y29)-1)","v":"2020-04-08"},{"$f":"VLOOKUP(W27,$B$10:$C$21,2,0)+((ROWS(W29:W35)-1)*7)+(COLUMNS(W29:Z29)-1)","v":"2020-04-09"},{"$f":"VLOOKUP(W27,$B$10:$C$21,2,0)+((ROWS(W29:W35)-1)*7)+(COLUMNS(W29:AA29)-1)","v":"2020-04-10"},{"$f":"VLOOKUP(W27,$B$10:$C$21,2,0)+((ROWS(W29:W35)-1)*7)+(COLUMNS(W29:AB29)-1)","v":"2020-04-11"},{"$f":"VLOOKUP(W27,$B$10:$C$21,2,0)+((ROWS(W29:W35)-1)*7)+(COLUMNS(W29:AC29)-1)","v":"2020-04-12"},null,{"$f":"VLOOKUP(AE27,$B$10:$C$21,2,0)+((ROWS(AE29:AE35)-1)*7)+(COLUMNS(AE29:AE29)-1)","v":"2020-05-11"},{"$f":"VLOOKUP(AE27,$B$10:$C$21,2,0)+((ROWS(AE29:AE35)-1)*7)+(COLUMNS(AE29:AF29)-1)","v":"2020-05-12"},{"$f":"VLOOKUP(AE27,$B$10:$C$21,2,0)+((ROWS(AE29:AE35)-1)*7)+(COLUMNS(AE29:AG29)-1)","v":"2020-05-13"},{"$f":"VLOOKUP(AE27,$B$10:$C$21,2,0)+((ROWS(AE29:AE35)-1)*7)+(COLUMNS(AE29:AH29)-1)","v":"2020-05-14"},{"$f":"VLOOKUP(AE27,$B$10:$C$21,2,0)+((ROWS(AE29:AE35)-1)*7)+(COLUMNS(AE29:AI29)-1)","v":"2020-05-15"},{"$f":"VLOOKUP(AE27,$B$10:$C$21,2,0)+((ROWS(AE29:AE35)-1)*7)+(COLUMNS(AE29:AJ29)-1)","v":"2020-05-16"},{"$f":"VLOOKUP(AE27,$B$10:$C$21,2,0)+((ROWS(AE29:AE35)-1)*7)+(COLUMNS(AE29:AK29)-1)","v":"2020-05-17"}]
[]
[{"$nulls":14},{"$f":"B19","v":"Mayo • 2020"},{"$nulls":7},{"$f":"B20","v":"Junio • 2020"},{"$nulls":7},{"$f":"B21","v":"Julio • 2020"}]
[{"$nulls":14},{"$f":"lista03.3","v":"Lu"},"Ma","Mi","Ju","Vi","Sá","Do",null,{"$f":"lista03.3","v":"Lu"},"Ma","Mi","Ju","Vi","Sá","Do",null,{"$f":"lista03.3","v":"Lu"},"Ma","Mi","Ju","Vi","Sá","Do"]
[{"$nulls":14},{"$f":"VLOOKUP(O37,$B$10:$C$21,2,0)+((ROWS(O39:O39)-1)*7)+(COLUMNS(O39:O39)-1)","v":"2020-04-27"},{"$f":"VLOOKUP(O37,$B$10:$C$21,2,0)+((ROWS(O39:O39)-1)*7)+(COLUMNS(O39:P39)-1)","v":"2020-04-28"},{"$f":"VLOOKUP(O37,$B$10:$C$21,2,0)+((ROWS(O39:O39)-1)*7)+(COLUMNS(O39:Q39)-1)","v":"2020-04-29"},{"$f":"VLOOKUP(O37,$B$10:$C$21,2,0)+((ROWS(O39:O39)-1)*7)+(COLUMNS(O39:R39)-1)","v":"2020-04-30"},{"$f":"VLOOKUP(O37,$B$10:$C$21,2,0)+((ROWS(O39:O39)-1)*7)+(COLUMNS(O39:S39)-1)","v":"2020-05-01"},{"$f":"VLOOKUP(O37,$B$10:$C$21,2,0)+((ROWS(O39:O39)-1)*7)+(COLUMNS(O39:T39)-1)","v":"2020-05-02"},{"$f":"VLOOKUP(O37,$B$10:$C$21,2,0)+((ROWS(O39:O39)-1)*7)+(COLUMNS(O39:U39)-1)","v":"2020-05-03"},null,{"$f":"VLOOKUP(W37,$B$10:$C$21,2,0)+((ROWS(W39:W39)-1)*7)+(COLUMNS(W39:W39)-1)","v":"2020-06-01"},{"$f":"VLOOKUP(W37,$B$10:$C$21,2,0)+((ROWS(W39:W39)-1)*7)+(COLUMNS(W39:X39)-1)","v":"2020-06-02"},{"$f":"VLOOKUP(W37,$B$10:$C$21,2,0)+((ROWS(W39:W39)-1)*7)+(COLUMNS(W39:Y39)-1)","v":"2020-06-03"},{"$f":"VLOOKUP(W37,$B$10:$C$21,2,0)+((ROWS(W39:W39)-1)*7)+(COLUMNS(W39:Z39)-1)","v":"2020-06-04"},{"$f":"VLOOKUP(W37,$B$10:$C$21,2,0)+((ROWS(W39:W39)-1)*7)+(COLUMNS(W39:AA39)-1)","v":"2020-06-05"},{"$f":"VLOOKUP(W37,$B$10:$C$21,2,0)+((ROWS(W39:W39)-1)*7)+(COLUMNS(W39:AB39)-1)","v":"2020-06-06"},{"$f":"VLOOKUP(W37,$B$10:$C$21,2,0)+((ROWS(W39:W39)-1)*7)+(COLUMNS(W39:AC39)-1)","v":"2020-06-07"},null,{"$f":"VLOOKUP(AE37,$B$10:$C$21,2,0)+((ROWS(AE39:AE39)-1)*7)+(COLUMNS(AE39:AE39)-1)","v":"2020-06-29"},{"$f":"VLOOKUP(AE37,$B$10:$C$21,2,0)+((ROWS(AE39:AE39)-1)*7)+(COLUMNS(AE39:AF39)-1)","v":"2020-06-30"},{"$f":"VLOOKUP(AE37,$B$10:$C$21,2,0)+((ROWS(AE39:AE39)-1)*7)+(COLUMNS(AE39:AG39)-1)","v":"2020-07-01"},{"$f":"VLOOKUP(AE37,$B$10:$C$21,2,0)+((ROWS(AE39:AE39)-1)*7)+(COLUMNS(AE39:AH39)-1)","v":"2020-07-02"},{"$f":"VLOOKUP(AE37,$B$10:$C$21,2,0)+((ROWS(AE39:AE39)-1)*7)+(COLUMNS(AE39:AI39)-1)","v":"2020-07-03"},{"$f":"VLOOKUP(AE37,$B$10:$C$21,2,0)+((ROWS(AE39:AE39)-1)*7)+(COLUMNS(AE39:AJ39)-1)","v":"2020-07-04"},{"$f":"VLOOKUP(AE37,$B$10:$C$21,2,0)+((ROWS(AE39:AE39)-1)*7)+(COLUMNS(AE39:AK39)-1)","v":"2020-07-05"}]
[{"$nulls":14},{"$f":"VLOOKUP(O37,$B$10:$C$21,2,0)+((ROWS(O39:O40)-1)*7)+(COLUMNS(O39:O39)-1)","v":"2020-05-04"},{"$f":"VLOOKUP(O37,$B$10:$C$21,2,0)+((ROWS(O39:O40)-1)*7)+(COLUMNS(O39:P39)-1)","v":"2020-05-05"},{"$f":"VLOOKUP(O37,$B$10:$C$21,2,0)+((ROWS(O39:O40)-1)*7)+(COLUMNS(O39:Q39)-1)","v":"2020-05-06"},{"$f":"VLOOKUP(O37,$B$10:$C$21,2,0)+((ROWS(O39:O40)-1)*7)+(COLUMNS(O39:R39)-1)","v":"2020-05-07"},{"$f":"VLOOKUP(O37,$B$10:$C$21,2,0)+((ROWS(O39:O40)-1)*7)+(COLUMNS(O39:S39)-1)","v":"2020-05-08"},{"$f":"VLOOKUP(O37,$B$10:$C$21,2,0)+((ROWS(O39:O40)-1)*7)+(COLUMNS(O39:T39)-1)","v":"2020-05-09"},{"$f":"VLOOKUP(O37,$B$10:$C$21,2,0)+((ROWS(O39:O40)-1)*7)+(COLUMNS(O39:U39)-1)","v":"2020-05-10"},null,{"$f":"VLOOKUP(W37,$B$10:$C$21,2,0)+((ROWS(W39:W40)-1)*7)+(COLUMNS(W39:W39)-1)","v":"2020-06-08"},{"$f":"VLOOKUP(W37,$B$10:$C$21,2,0)+((ROWS(W39:W40)-1)*7)+(COLUMNS(W39:X39)-1)","v":"2020-06-09"},{"$f":"VLOOKUP(W37,$B$10:$C$21,2,0)+((ROWS(W39:W40)-1)*7)+(COLUMNS(W39:Y39)-1)","v":"2020-06-10"},{"$f":"VLOOKUP(W37,$B$10:$C$21,2,0)+((ROWS(W39:W40)-1)*7)+(COLUMNS(W39:Z39)-1)","v":"2020-06-11"},{"$f":"VLOOKUP(W37,$B$10:$C$21,2,0)+((ROWS(W39:W40)-1)*7)+(COLUMNS(W39:AA39)-1)","v":"2020-06-12"},{"$f":"VLOOKUP(W37,$B$10:$C$21,2,0)+((ROWS(W39:W40)-1)*7)+(COLUMNS(W39:AB39)-1)","v":"2020-06-13"},{"$f":"VLOOKUP(W37,$B$10:$C$21,2,0)+((ROWS(W39:W40)-1)*7)+(COLUMNS(W39:AC39)-1)","v":"2020-06-14"},null,{"$f":"VLOOKUP(AE37,$B$10:$C$21,2,0)+((ROWS(AE39:AE40)-1)*7)+(COLUMNS(AE39:AE39)-1)","v":"2020-07-06"},{"$f":"VLOOKUP(AE37,$B$10:$C$21,2,0)+((ROWS(AE39:AE40)-1)*7)+(COLUMNS(AE39:AF39)-1)","v":"2020-07-07"},{"$f":"VLOOKUP(AE37,$B$10:$C$21,2,0)+((ROWS(AE39:AE40)-1)*7)+(COLUMNS(AE39:AG39)-1)","v":"2020-07-08"},{"$f":"VLOOKUP(AE37,$B$10:$C$21,2,0)+((ROWS(AE39:AE40)-1)*7)+(COLUMNS(AE39:AH39)-1)","v":"2020-07-09"},{"$f":"VLOOKUP(AE37,$B$10:$C$21,2,0)+((ROWS(AE39:AE40)-1)*7)+(COLUMNS(AE39:AI39)-1)","v":"2020-07-10"},{"$f":"VLOOKUP(AE37,$B$10:$C$21,2,0)+((ROWS(AE39:AE40)-1)*7)+(COLUMNS(AE39:AJ39)-1)","v":"2020-07-11"},{"$f":"VLOOKUP(AE37,$B$10:$C$21,2,0)+((ROWS(AE39:AE40)-1)*7)+(COLUMNS(AE39:AK39)-1)","v":"2020-07-12"}]
[{"$nulls":14},{"$f":"VLOOKUP(O37,$B$10:$C$21,2,0)+((ROWS(O39:O41)-1)*7)+(COLUMNS(O39:O39)-1)","v":"2020-05-11"},{"$f":"VLOOKUP(O37,$B$10:$C$21,2,0)+((ROWS(O39:O41)-1)*7)+(COLUMNS(O39:P39)-1)","v":"2020-05-12"},{"$f":"VLOOKUP(O37,$B$10:$C$21,2,0)+((ROWS(O39:O41)-1)*7)+(COLUMNS(O39:Q39)-1)","v":"2020-05-13"},{"$f":"VLOOKUP(O37,$B$10:$C$21,2,0)+((ROWS(O39:O41)-1)*7)+(COLUMNS(O39:R39)-1)","v":"2020-05-14"},{"$f":"VLOOKUP(O37,$B$10:$C$21,2,0)+((ROWS(O39:O41)-1)*7)+(COLUMNS(O39:S39)-1)","v":"2020-05-15"},{"$f":"VLOOKUP(O37,$B$10:$C$21,2,0)+((ROWS(O39:O41)-1)*7)+(COLUMNS(O39:T39)-1)","v":"2020-05-16"},{"$f":"VLOOKUP(O37,$B$10:$C$21,2,0)+((ROWS(O39:O41)-1)*7)+(COLUMNS(O39:U39)-1)","v":"2020-05-17"},null,{"$f":"VLOOKUP(W37,$B$10:$C$21,2,0)+((ROWS(W39:W41)-1)*7)+(COLUMNS(W39:W39)-1)","v":"2020-06-15"},{"$f":"VLOOKUP(W37,$B$10:$C$21,2,0)+((ROWS(W39:W41)-1)*7)+(COLUMNS(W39:X39)-1)","v":"2020-06-16"},{"$f":"VLOOKUP(W37,$B$10:$C$21,2,0)+((ROWS(W39:W41)-1)*7)+(COLUMNS(W39:Y39)-1)","v":"2020-06-17"},{"$f":"VLOOKUP(W37,$B$10:$C$21,2,0)+((ROWS(W39:W41)-1)*7)+(COLUMNS(W39:Z39)-1)","v":"2020-06-18"},{"$f":"VLOOKUP(W37,$B$10:$C$21,2,0)+((ROWS(W39:W41)-1)*7)+(COLUMNS(W39:AA39)-1)","v":"2020-06-19"},{"$f":"VLOOKUP(W37,$B$10:$C$21,2,0)+((ROWS(W39:W41)-1)*7)+(COLUMNS(W39:AB39)-1)","v":"2020-06-20"},{"$f":"VLOOKUP(W37,$B$10:$C$21,2,0)+((ROWS(W39:W41)-1)*7)+(COLUMNS(W39:AC39)-1)","v":"2020-06-21"},null,{"$f":"VLOOKUP(AE37,$B$10:$C$21,2,0)+((ROWS(AE39:AE41)-1)*7)+(COLUMNS(AE39:AE39)-1)","v":"2020-07-13"},{"$f":"VLOOKUP(AE37,$B$10:$C$21,2,0)+((ROWS(AE39:AE41)-1)*7)+(COLUMNS(AE39:AF39)-1)","v":"2020-07-14"},{"$f":"VLOOKUP(AE37,$B$10:$C$21,2,0)+((ROWS(AE39:AE41)-1)*7)+(COLUMNS(AE39:AG39)-1)","v":"2020-07-15"},{"$f":"VLOOKUP(AE37,$B$10:$C$21,2,0)+((ROWS(AE39:AE41)-1)*7)+(COLUMNS(AE39:AH39)-1)","v":"2020-07-16"},{"$f":"VLOOKUP(AE37,$B$10:$C$21,2,0)+((ROWS(AE39:AE41)-1)*7)+(COLUMNS(AE39:AI39)-1)","v":"2020-07-17"},{"$f":"VLOOKUP(AE37,$B$10:$C$21,2,0)+((ROWS(AE39:AE41)-1)*7)+(COLUMNS(AE39:AJ39)-1)","v":"2020-07-18"},{"$f":"VLOOKUP(AE37,$B$10:$C$21,2,0)+((ROWS(AE39:AE41)-1)*7)+(COLUMNS(AE39:AK39)-1)","v":"2020-07-19"}]
[{"$nulls":14},{"$f":"VLOOKUP(O37,$B$10:$C$21,2,0)+((ROWS(O39:O42)-1)*7)+(COLUMNS(O39:O39)-1)","v":"2020-05-18"},{"$f":"VLOOKUP(O37,$B$10:$C$21,2,0)+((ROWS(O39:O42)-1)*7)+(COLUMNS(O39:P39)-1)","v":"2020-05-19"},{"$f":"VLOOKUP(O37,$B$10:$C$21,2,0)+((ROWS(O39:O42)-1)*7)+(COLUMNS(O39:Q39)-1)","v":"2020-05-20"},{"$f":"VLOOKUP(O37,$B$10:$C$21,2,0)+((ROWS(O39:O42)-1)*7)+(COLUMNS(O39:R39)-1)","v":"2020-05-21"},{"$f":"VLOOKUP(O37,$B$10:$C$21,2,0)+((ROWS(O39:O42)-1)*7)+(COLUMNS(O39:S39)-1)","v":"2020-05-22"},{"$f":"VLOOKUP(O37,$B$10:$C$21,2,0)+((ROWS(O39:O42)-1)*7)+(COLUMNS(O39:T39)-1)","v":"2020-05-23"},{"$f":"VLOOKUP(O37,$B$10:$C$21,2,0)+((ROWS(O39:O42)-1)*7)+(COLUMNS(O39:U39)-1)","v":"2020-05-24"},null,{"$f":"VLOOKUP(W37,$B$10:$C$21,2,0)+((ROWS(W39:W42)-1)*7)+(COLUMNS(W39:W39)-1)","v":"2020-06-22"},{"$f":"VLOOKUP(W37,$B$10:$C$21,2,0)+((ROWS(W39:W42)-1)*7)+(COLUMNS(W39:X39)-1)","v":"2020-06-23"},{"$f":"VLOOKUP(W37,$B$10:$C$21,2,0)+((ROWS(W39:W42)-1)*7)+(COLUMNS(W39:Y39)-1)","v":"2020-06-24"},{"$f":"VLOOKUP(W37,$B$10:$C$21,2,0)+((ROWS(W39:W42)-1)*7)+(COLUMNS(W39:Z39)-1)","v":"2020-06-25"},{"$f":"VLOOKUP(W37,$B$10:$C$21,2,0)+((ROWS(W39:W42)-1)*7)+(COLUMNS(W39:AA39)-1)","v":"2020-06-26"},{"$f":"VLOOKUP(W37,$B$10:$C$21,2,0)+((ROWS(W39:W42)-1)*7)+(COLUMNS(W39:AB39)-1)","v":"2020-06-27"},{"$f":"VLOOKUP(W37,$B$10:$C$21,2,0)+((ROWS(W39:W42)-1)*7)+(COLUMNS(W39:AC39)-1)","v":"2020-06-28"},null,{"$f":"VLOOKUP(AE37,$B$10:$C$21,2,0)+((ROWS(AE39:AE42)-1)*7)+(COLUMNS(AE39:AE39)-1)","v":"2020-07-20"},{"$f":"VLOOKUP(AE37,$B$10:$C$21,2,0)+((ROWS(AE39:AE42)-1)*7)+(COLUMNS(AE39:AF39)-1)","v":"2020-07-21"},{"$f":"VLOOKUP(AE37,$B$10:$C$21,2,0)+((ROWS(AE39:AE42)-1)*7)+(COLUMNS(AE39:AG39)-1)","v":"2020-07-22"},{"$f":"VLOOKUP(AE37,$B$10:$C$21,2,0)+((ROWS(AE39:AE42)-1)*7)+(COLUMNS(AE39:AH39)-1)","v":"2020-07-23"},{"$f":"VLOOKUP(AE37,$B$10:$C$21,2,0)+((ROWS(AE39:AE42)-1)*7)+(COLUMNS(AE39:AI39)-1)","v":"2020-07-24"},{"$f":"VLOOKUP(AE37,$B$10:$C$21,2,0)+((ROWS(AE39:AE42)-1)*7)+(COLUMNS(AE39:AJ39)-1)","v":"2020-07-25"},{"$f":"VLOOKUP(AE37,$B$10:$C$21,2,0)+((ROWS(AE39:AE42)-1)*7)+(COLUMNS(AE39:AK39)-1)","v":"2020-07-26"}]
[{"$nulls":14},{"$f":"VLOOKUP(O37,$B$10:$C$21,2,0)+((ROWS(O39:O43)-1)*7)+(COLUMNS(O39:O39)-1)","v":"2020-05-25"},{"$f":"VLOOKUP(O37,$B$10:$C$21,2,0)+((ROWS(O39:O43)-1)*7)+(COLUMNS(O39:P39)-1)","v":"2020-05-26"},{"$f":"VLOOKUP(O37,$B$10:$C$21,2,0)+((ROWS(O39:O43)-1)*7)+(COLUMNS(O39:Q39)-1)","v":"2020-05-27"},{"$f":"VLOOKUP(O37,$B$10:$C$21,2,0)+((ROWS(O39:O43)-1)*7)+(COLUMNS(O39:R39)-1)","v":"2020-05-28"},{"$f":"VLOOKUP(O37,$B$10:$C$21,2,0)+((ROWS(O39:O43)-1)*7)+(COLUMNS(O39:S39)-1)","v":"2020-05-29"},{"$f":"VLOOKUP(O37,$B$10:$C$21,2,0)+((ROWS(O39:O43)-1)*7)+(COLUMNS(O39:T39)-1)","v":"2020-05-30"},{"$f":"VLOOKUP(O37,$B$10:$C$21,2,0)+((ROWS(O39:O43)-1)*7)+(COLUMNS(O39:U39)-1)","v":"2020-05-31"},null,{"$f":"VLOOKUP(W37,$B$10:$C$21,2,0)+((ROWS(W39:W43)-1)*7)+(COLUMNS(W39:W39)-1)","v":"2020-06-29"},{"$f":"VLOOKUP(W37,$B$10:$C$21,2,0)+((ROWS(W39:W43)-1)*7)+(COLUMNS(W39:X39)-1)","v":"2020-06-30"},{"$f":"VLOOKUP(W37,$B$10:$C$21,2,0)+((ROWS(W39:W43)-1)*7)+(COLUMNS(W39:Y39)-1)","v":"2020-07-01"},{"$f":"VLOOKUP(W37,$B$10:$C$21,2,0)+((ROWS(W39:W43)-1)*7)+(COLUMNS(W39:Z39)-1)","v":"2020-07-02"},{"$f":"VLOOKUP(W37,$B$10:$C$21,2,0)+((ROWS(W39:W43)-1)*7)+(COLUMNS(W39:AA39)-1)","v":"2020-07-03"},{"$f":"VLOOKUP(W37,$B$10:$C$21,2,0)+((ROWS(W39:W43)-1)*7)+(COLUMNS(W39:AB39)-1)","v":"2020-07-04"},{"$f":"VLOOKUP(W37,$B$10:$C$21,2,0)+((ROWS(W39:W43)-1)*7)+(COLUMNS(W39:AC39)-1)","v":"2020-07-05"},null,{"$f":"VLOOKUP(AE37,$B$10:$C$21,2,0)+((ROWS(AE39:AE43)-1)*7)+(COLUMNS(AE39:AE39)-1)","v":"2020-07-27"},{"$f":"VLOOKUP(AE37,$B$10:$C$21,2,0)+((ROWS(AE39:AE43)-1)*7)+(COLUMNS(AE39:AF39)-1)","v":"2020-07-28"},{"$f":"VLOOKUP(AE37,$B$10:$C$21,2,0)+((ROWS(AE39:AE43)-1)*7)+(COLUMNS(AE39:AG39)-1)","v":"2020-07-29"},{"$f":"VLOOKUP(AE37,$B$10:$C$21,2,0)+((ROWS(AE39:AE43)-1)*7)+(COLUMNS(AE39:AH39)-1)","v":"2020-07-30"},{"$f":"VLOOKUP(AE37,$B$10:$C$21,2,0)+((ROWS(AE39:AE43)-1)*7)+(COLUMNS(AE39:AI39)-1)","v":"2020-07-31"},{"$f":"VLOOKUP(AE37,$B$10:$C$21,2,0)+((ROWS(AE39:AE43)-1)*7)+(COLUMNS(AE39:AJ39)-1)","v":"2020-08-01"},{"$f":"VLOOKUP(AE37,$B$10:$C$21,2,0)+((ROWS(AE39:AE43)-1)*7)+(COLUMNS(AE39:AK39)-1)","v":"2020-08-02"}]
[{"$nulls":14},{"$f":"VLOOKUP(O37,$B$10:$C$21,2,0)+((ROWS(O39:O44)-1)*7)+(COLUMNS(O39:O39)-1)","v":"2020-06-01"},{"$f":"VLOOKUP(O37,$B$10:$C$21,2,0)+((ROWS(O39:O44)-1)*7)+(COLUMNS(O39:P39)-1)","v":"2020-06-02"},{"$f":"VLOOKUP(O37,$B$10:$C$21,2,0)+((ROWS(O39:O44)-1)*7)+(COLUMNS(O39:Q39)-1)","v":"2020-06-03"},{"$f":"VLOOKUP(O37,$B$10:$C$21,2,0)+((ROWS(O39:O44)-1)*7)+(COLUMNS(O39:R39)-1)","v":"2020-06-04"},{"$f":"VLOOKUP(O37,$B$10:$C$21,2,0)+((ROWS(O39:O44)-1)*7)+(COLUMNS(O39:S39)-1)","v":"2020-06-05"},{"$f":"VLOOKUP(O37,$B$10:$C$21,2,0)+((ROWS(O39:O44)-1)*7)+(COLUMNS(O39:T39)-1)","v":"2020-06-06"},{"$f":"VLOOKUP(O37,$B$10:$C$21,2,0)+((ROWS(O39:O44)-1)*7)+(COLUMNS(O39:U39)-1)","v":"2020-06-07"},null,{"$f":"VLOOKUP(W37,$B$10:$C$21,2,0)+((ROWS(W39:W44)-1)*7)+(COLUMNS(W39:W39)-1)","v":"2020-07-06"},{"$f":"VLOOKUP(W37,$B$10:$C$21,2,0)+((ROWS(W39:W44)-1)*7)+(COLUMNS(W39:X39)-1)","v":"2020-07-07"},{"$f":"VLOOKUP(W37,$B$10:$C$21,2,0)+((ROWS(W39:W44)-1)*7)+(COLUMNS(W39:Y39)-1)","v":"2020-07-08"},{"$f":"VLOOKUP(W37,$B$10:$C$21,2,0)+((ROWS(W39:W44)-1)*7)+(COLUMNS(W39:Z39)-1)","v":"2020-07-09"},{"$f":"VLOOKUP(W37,$B$10:$C$21,2,0)+((ROWS(W39:W44)-1)*7)+(COLUMNS(W39:AA39)-1)","v":"2020-07-10"},{"$f":"VLOOKUP(W37,$B$10:$C$21,2,0)+((ROWS(W39:W44)-1)*7)+(COLUMNS(W39:AB39)-1)","v":"2020-07-11"},{"$f":"VLOOKUP(W37,$B$10:$C$21,2,0)+((ROWS(W39:W44)-1)*7)+(COLUMNS(W39:AC39)-1)","v":"2020-07-12"},null,{"$f":"VLOOKUP(AE37,$B$10:$C$21,2,0)+((ROWS(AE39:AE44)-1)*7)+(COLUMNS(AE39:AE39)-1)","v":"2020-08-03"},{"$f":"VLOOKUP(AE37,$B$10:$C$21,2,0)+((ROWS(AE39:AE44)-1)*7)+(COLUMNS(AE39:AF39)-1)","v":"2020-08-04"},{"$f":"VLOOKUP(AE37,$B$10:$C$21,2,0)+((ROWS(AE39:AE44)-1)*7)+(COLUMNS(AE39:AG39)-1)","v":"2020-08-05"},{"$f":"VLOOKUP(AE37,$B$10:$C$21,2,0)+((ROWS(AE39:AE44)-1)*7)+(COLUMNS(AE39:AH39)-1)","v":"2020-08-06"},{"$f":"VLOOKUP(AE37,$B$10:$C$21,2,0)+((ROWS(AE39:AE44)-1)*7)+(COLUMNS(AE39:AI39)-1)","v":"2020-08-07"},{"$f":"VLOOKUP(AE37,$B$10:$C$21,2,0)+((ROWS(AE39:AE44)-1)*7)+(COLUMNS(AE39:AJ39)-1)","v":"2020-08-08"},{"$f":"VLOOKUP(AE37,$B$10:$C$21,2,0)+((ROWS(AE39:AE44)-1)*7)+(COLUMNS(AE39:AK39)-1)","v":"2020-08-09"}]

{"sheet":"Calendario Actual","index":5,"n_rows":43,"n_cols":24,"rows_kept":43,"merged":[[3,1,3,3],[4,1,4,3],[6,1,6,23],[8,1,8,7],[8,9,8,15],[8,17,8,23],[17,1,17,7],[17,9,17,15],[17,17,17,23],[26,1,26,7],[26,9,26,15],[26,17,26,23],[35,1,35,7],[35,9,35,15],[35,17,35,23]]}
[null,"Excel No Convencional"]
[null,"MOS Expert - CPC Martín Cruz - +51 998401784"]
[]
[null,"Seleccione día inicio"]
[null,"Lunes",null,null,6]
[]
[null,"Calendario Actual"]
[]
[null,{"$f":"INDEX(lista04.m13,1)","v":"Agosto • 2019"},{"$nulls":7},{"$f":"INDEX(lista04.m13,2)","v":"Septiembre • 2019"},{"$nulls":7},{"$f":"INDEX(lista04.m13,3)","v":"Octubre • 2019"}]
[null,{"$f":"lista04.m01","v":"Lu"},"Ma","Mi","Ju","Vi","Sá","Do",null,{"$f":"lista04.m02","v":"Lu"},"Ma","Mi","Ju","Vi","Sá","Do",null,{"$f":"lista04.m03","v":"Lu"},"Ma","Mi","Ju","Vi","Sá","Do"]
[null,"2019-07-29","2019-07-30","2019-07-31","2019-08-01","2019-08-02","2019-08-03","2019-08-04",null,"2019-08-26","2019-08-27","2019-08-28","2019-08-29","2019-08-30","2019-08-31","2019-09-01",null,"2019-09-30","2019-10-01","2019-10-02","2019-10-03","2019-10-04","2019-10-05","2019-10-06"]
[null,"2019-08-05","2019-08-06","2019-08-07","2019-08-08","2019-08-09","2019-08-10","2019-08-11",null,"2019-09-02","2019-09-03","2019-09-04","2019-09-05","2019-09-06","2019-09-07","2019-09-08",null,"2019-10-07","2019-10-08","2019-10-09","2019-10-10","2019-10-11","2019-10-12","2019-10-13"]
[null,"2019-08-12","2019-08-13","2019-08-14","2019-08-15","2019-08-16","2019-08-17","2019-08-18",null,"2019-09-09","2019-09-10","2019-09-11","2019-09-12","2019-09-13","2019-09-14","2019-09-15",null,"2019-10-14","2019-10-15","2019-10-16","2019-10-17","2019-10-18","2019-10-19","2019-10-20"]
[null,"2019-08-19","2019-08-20","2019-08-21","2019-08-22","2019-08-23","2019-08-24","2019-08-25",null,"2019-09-16","2019-09-17","2019-09-18","2019-09-19","2019-09-20","2019-09-21","2019-09-22",null,"2019-10-21","2019-10-22","2019-10-23","2019-10-24","2019-10-25","2019-10-26","2019-10-27"]
[null,"2019-08-26","2019-08-27","2019-08-28","2019-08-29","2019-08-30","2019-08-31","2019-09-01",null,"2019-09-23","2019-09-24","2019-09-25","2019-09-26","2019-09-27","2019-09-28","2019-09-29",null,"2019-10-28","2019-10-29","2019-10-30","2019-10-31","2019-11-01","2019-11-02","2019-11-03"]
[null,"2019-09-02","2019-09-03","2019-09-04","2019-09-05","2019-09-06","2019-09-07","2019-09-08",null,"2019-09-30","2019-10-01","2019-10-02","2019-10-03","2019-10-04","2019-10-05","2019-10-06",null,"2019-11-04","2019-11-05","2019-11-06","2019-11-07","2019-11-08","2019-11-09","2019-11-10"]
[]
[null,{"$f":"INDEX(lista04.m13,4)","v":"Noviembre • 2019"},{"$nulls":7},{"$f":"INDEX(lista04.m13,5)","v":"Diciembre • 2019"},{"$nulls":7},{"$f":"INDEX(lista04.m13,6)","v":"Enero • 2020"}]
[null,{"$f":"lista04.m04","v":"Lu"},"Ma","Mi","Ju","Vi","Sá","Do",null,{"$f":"lista04.m05","v":"Lu"},"Ma","Mi","Ju","Vi","Sá","Do",null,{"$f":"lista04.m06","v":"Lu"},"Ma","Mi","Ju","Vi","Sá","Do"]
[null,"2019-10-28","2019-10-29","2019-10-30","2019-10-31","2019-11-01","2019-11-02","2019-11-03",null,"2019-11-25","2019-11-26","2019-11-27","2019-11-28","2019-11-29","2019-11-30","2019-12-01",null,"2019-12-30","2019-12-31","2020-01-01","2020-01-02","2020-01-03","2020-01-04","2020-01-05"]
[null,"2019-11-04","2019-11-05","2019-11-06","2019-11-07","2019-11-08","2019-11-09","2019-11-10",null,"2019-12-02","2019-12-03","2019-12-04","2019-12-05","2019-12-06","2019-12-07","2019-12-08",null,"2020-01-06","2020-01-07","2020-01-08","2020-01-09","2020-01-10","2020-01-11","2020-01-12"]
[null,"2019-11-11","2019-11-12","2019-11-13","2019-11-14","2019-11-15","2019-11-16","2019-11-17",null,"2019-12-09","2019-12-10","2019-12-11","2019-12-12","2019-12-13","2019-12-14","2019-12-15",null,"2020-01-13","2020-01-14","2020-01-15","2020-01-16","2020-01-17","2020-01-18","2020-01-19"]
[null,"2019-11-18","2019-11-19","2019-11-20","2019-11-21","2019-11-22","2019-11-23","2019-11-24",null,"2019-12-16","2019-12-17","2019-12-18","2019-12-19","2019-12-20","2019-12-21","2019-12-22",null,"2020-01-20","2020-01-21","2020-01-22","2020-01-23","2020-01-24","2020-01-25","2020-01-26"]
[null,"2019-11-25","2019-11-26","2019-11-27","2019-11-28","2019-11-29","2019-11-30","2019-12-01",null,"2019-12-23","2019-12-24","2019-12-25","2019-12-26","2019-12-27","2019-12-28","2019-12-29",null,"2020-01-27","2020-01-28","2020-01-29","2020-01-30","2020-01-31","2020-02-01","2020-02-02"]
[null,"2019-12-02","2019-12-03","2019-12-04","2019-12-05","2019-12-06","2019-12-07","2019-12-08",null,"2019-12-30","2019-12-31","2020-01-01","2020-01-02","2020-01-03","2020-01-04","2020-01-05",null,"2020-02-03","2020-02-04","2020-02-05","2020-02-06","2020-02-07","2020-02-08","2020-02-09"]
[]
[null,{"$f":"INDEX(lista04.m13,7)","v":"Febrero • 2020"},{"$nulls":7},{"$f":"INDEX(lista04.m13,8)","v":"Marzo • 2020"},{"$nulls":7},{"$f":"INDEX(lista04.m13,9)","v":"Abril • 2020"}]
[null,{"$f":"lista04.m07","v":"Lu"},"Ma","Mi","Ju","Vi","Sá","Do",null,{"$f":"lista04.m08","v":"Lu"},"Ma","Mi","Ju","Vi","Sá","Do",null,{"$f":"lista04.m09","v":"Lu"},"Ma","Mi","Ju","Vi","Sá","Do"]
[null,"2020-01-27","2020-01-28","2020-01-29","2020-01-30","2020-01-31","2020-02-01","2020-02-02",null,"2020-02-24","2020-02-25","2020-02-26","2020-02-27","2020-02-28","2020-02-29","2020-03-01",null,"2020-03-30","2020-03-31","2020-04-01","2020-04-02","2020-04-03","2020-04-04","2020-04-05"]
[null,"2020-02-03","2020-02-04","2020-02-05","2020-02-06","2020-02-07","2020-02-08","2020-02-09",null,"2020-03-02","2020-03-03","2020-03-04","2020-03-05","2020-03-06","2020-03-07","2020-03-08",null,"2020-04-06","2020-04-07","2020-04-08","2020-04-09","2020-04-10","2020-04-11","2020-04-12"]
[null,"2020-02-10","2020-02-11","2020-02-12","2020-02-13","2020-02-14","2020-02-15","2020-02-16",null,"2020-03-09","2020-03-10","2020-03-11","2020-03-12","2020-03-13","2020-03-14","2020-03-15",null,"2020-04-13","2020-04-14","2020-04-15","2020-04-16","2020-04-17","2020-04-18","2020-04-19"]
[null,"2020-02-17","2020-02-18","2020-02-19","2020-02-20","2020-02-21","2020-02-22","2020-02-23",null,"2020-03-16","2020-03-17","2020-03-18","2020-03-19","2020-03-20","2020-03-21","2020-03-22",null,"2020-04-20","2020-04-21","2020-04-22","2020-04-23","2020-04-24","2020-04-25","2020-04-26"]
[null,"2020-02-24","2020-02-25","2020-02-26","2020-02-27","2020-02-28","2020-02-29","2020-03-01",null,"2020-03-23","2020-03-24","2020-03-25","2020-03-26","2020-03-27","2020-03-28","2020-03-29",null,"2020-04-27","2020-04-28","2020-04-29","2020-04-30","2020-05-01","2020-05-02","2020-05-03"]
[null,"2020-03-02","2020-03-03","2020-03-04","2020-03-05","2020-03-06","2020-03-07","2020-03-08",null,"2020-03-30","2020-03-31","2020-04-01","2020-04-02","2020-04-03","2020-04-04","2020-04-05",null,"2020-05-04","2020-05-05","2020-05-06","2020-05-07","2020-05-08","2020-05-09","2020-05-10"]
[]
[null,{"$f":"INDEX(lista04.m13,10)","v":"Mayo • 2020"},{"$nulls":7},{"$f":"INDEX(lista04.m13,11)","v":"Junio • 2020"},{"$nulls":7},{"$f":"INDEX(lista04.m13,12)","v":"Julio • 2020"}]
[null,{"$f":"lista04.m10","v":"Lu"},"Ma","Mi","Ju","Vi","Sá","Do",null,{"$f":"lista04.m11","v":"Lu"},"Ma","Mi","Ju","Vi","Sá","Do",null,{"$f":"lista04.m12","v":"Lu"},"Ma","Mi","Ju","Vi","Sá","Do"]
[null,"2020-04-27","2020-04-28","2020-04-29","2020-04-30","2020-05-01","2020-05-02","2020-05-03",null,"2020-06-01","2020-06-02","2020-06-03","2020-06-04","2020-06-05","2020-06-06","2020-06-07",null,"2020-06-29","2020-06-30","2020-07-01","2020-07-02","2020-07-03","2020-07-04","2020-07-05"]
[null,"2020-05-04","2020-05-05","2020-05-06","2020-05-07","2020-05-08","2020-05-09","2020-05-10",null,"2020-06-08","2020-06-09","2020-06-10","2020-06-11","2020-06-12","2020-06-13","2020-06-14",null,"2020-07-06","2020-07-07","2020-07-08","2020-07-09","2020-07-10","2020-07-11","2020-07-12"]
[null,"2020-05-11","2020-05-12","2020-05-13","2020-05-14","2020-05-15","2020-05-16","2020-05-17",null,"2020-06-15","2020-06-16","2020-06-17","2020-06-18","2020-06-19","2020-06-20","2020-06-21",null,"2020-07-13","2020-07-14","2020-07-15","2020-07-16","2020-07-17","2020-07-18","2020-07-19"]
[null,"2020-05-18","2020-05-19","2020-05-20","2020-05-21","2020-05-22","2020-05-23","2020-05-24",null,"2020-06-22","2020-06-23","2020-06-24","2020-06-25","2020-06-26","2020-06-27","2020-06-28",null,"2020-07-20","2020-07-21","2020-07-22","2020-07-23","2020-07-24","2020-07-25","2020-07-26"]
[null,"2020-05-25","2020-05-26","2020-05-27","2020-05-28","2020-05-29","2020-05-30","2020-05-31",null,"2020-06-29","2020-06-30","2020-07-01","2020-07-02","2020-07-03","2020-07-04","2020-07-05",null,"2020-07-27","2020-07-28","2020-07-29","2020-07-30","2020-07-31","2020-08-01","2020-08-02"]
[null,"2020-06-01","2020-06-02","2020-06-03","2020-06-04","2020-06-05","2020-06-06","2020-06-07",null,"2020-07-06","2020-07-07","2020-07-08","2020-07-09","2020-07-10","2020-07-11","2020-07-12",null,"2020-08-03","2020-08-04","2020-08-05","2020-08-06","2020-08-07","2020-08-08","2020-08-09"]