{"text_format":"3","workbook":"xlsx","n_sheets":6,"sheets":["DO_1","Calendario por años (Editable)","Dias (Editable)","Calendario Casa Matriz","DO_2","Calendario Actual"],"not_rendered":{"macros":1,"defined_names":36},"read":"whole","date_system":"1900"}

{"sheet":"DO_1","index":0,"n_rows":25,"n_cols":69,"rows_kept":25,"hidden":true}
[]
[]
[]
[{"$nulls":7},{"$f":"IF('Calendario Casa Matriz'!B5=\"\",TEXT(TODAY(),\"mmmm\"),'Calendario Casa Matriz'!B5)","v":"Agosto"},{"$nulls":3},{"$f":"UPPER(H4)&\"•\"&H17","v":"AGOSTO•2019"}]
[{"$nulls":11},"L","M","X","J","V","S","D",null,"Feriados y no laborables",{"$nulls":6},"Obligaciones mensuales",{"$nulls":6},"Feriados casa matriz",{"$nulls":14},{"$f":"L5","v":"L"},"M","X","J","V","S","D"]
[{"$nulls":11},{"$f":"f.ini+(ROWS($L$6:$L6)-1)*7+(COLUMNS($L$6:L$6)-1)","v":"2019-07-29"},{"$f":"f.ini+(ROWS($L$6:$L6)-1)*7+(COLUMNS($L$6:M$6)-1)","v":"2019-07-30"},{"$f":"f.ini+(ROWS($L$6:$L6)-1)*7+(COLUMNS($L$6:N$6)-1)","v":"2019-07-31"},{"$f":"f.ini+(ROWS($L$6:$L6)-1)*7+(COLUMNS($L$6:O$6)-1)","v":"2019-08-01"},{"$f":"f.ini+(ROWS($L$6:$L6)-1)*7+(COLUMNS($L$6:P$6)-1)","v":"2019-08-02"},{"$f":"f.ini+(ROWS($L$6:$L6)-1)*7+(COLUMNS($L$6:Q$6)-1)","v":"2019-08-03"},{"$f":"f.ini+(ROWS($L$6:$L6)-1)*7+(COLUMNS($L$6:R$6)-1)","v":"2019-08-04"},null,{"$f":"IFERROR(DAY(SMALL(IF(MONTH(t.feriados[DIA])=MONTH(DO_1!$H$18),t.feriados[DIA],\"\"),ROWS(T$6:T6))),\"\")","v":29},{"$f":"IFERROR(VLOOKUP(SMALL(IF(MONTH(t.feriados[DIA])=MONTH(DO_1!$H$18),t.feriados[DIA],\"\"),ROWS(T$6:T6)),t.feriados[],2,0),\"\")","v":"No Laborable (declarado)"},{"$nulls":5},{"$f":"IFERROR(DAY(SMALL(IF(MONTH(t.obligaciones[DIA])=MONTH(DO_1!$H$18),t.obligaciones[DIA],\"\"),ROWS(AA$6:AA6))),\"\")","v":{"v":2,"d":"02"}},{"$f":"IFERROR(VLOOKUP(SMALL(IF(MONTH(t.obligaciones[DIA])=MONTH(DO_1!$H$18),t.obligaciones[DIA],\"\"),ROWS(T$6:T6)),t.obligaciones[],2,0),\"\")","v":"Reporting"},{"$nulls":5},{"$f":"IFERROR(DAY(SMALL(IF(MONTH(t.feriados.matriz[DIA])=MONTH(DO_1!$H$18),t.feriados.matriz[DIA],\"\"),ROWS(AH$6:AH6))),\"\")","v":15},{"$f":"IFERROR(VLOOKUP(SMALL(IF(MONTH(t.feriados.matriz[DIA])=MONTH(DO_1!$H$18),t.feriados.matriz[DIA],\"\"),ROWS(AA$6:AA6)),t.feriados.matriz[],2,0),\"\")","v":"Asunción de la Virgen"},{"$nulls":13},"2019-07-29","2019-07-30","2019-07-31","2019-08-01","2019-08-02","2019-08-03","2019-08-04",null,{"$f":"T6","v":29},"No Laborable (declarado)",null,{"$f":"AA6","v":{"v":2,"d":"02"}},"Reporting",{"$nulls":3},{"$f":"AH6","v":15},"Asunción de la Virgen"]
[{"$nulls":11},{"$f":"f.ini+(ROWS($L$6:$L7)-1)*7+(COLUMNS($L$6:L$6)-1)","v":"2019-08-05"},{"$f":"f.ini+(ROWS($L$6:$L7)-1)*7+(COLUMNS($L$6:M$6)-1)","v":"2019-08-06"},{"$f":"f.ini+(ROWS($L$6:$L7)-1)*7+(COLUMNS($L$6:N$6)-1)","v":"2019-08-07"},{"$f":"f.ini+(ROWS($L$6:$L7)-1)*7+(COLUMNS($L$6:O$6)-1)","v":"2019-08-08"},{"$f":"f.ini+(ROWS($L$6:$L7)-1)*7+(COLUMNS($L$6:P$6)-1)","v":"2019-08-09"},{"$f":"f.ini+(ROWS($L$6:$L7)-1)*7+(COLUMNS($L$6:Q$6)-1)","v":"2019-08-10"},{"$f":"f.ini+(ROWS($L$6:$L7)-1)*7+(COLUMNS($L$6:R$6)-1)","v":"2019-08-11"},null,{"$f":"IFERROR(DAY(SMALL(IF(MONTH(t.feriados[DIA])=MONTH(DO_1!$H$18),t.feriados[DIA],\"\"),ROWS(T$6:T7))),\"\")","v":30},{"$f":"IFERROR(VLOOKUP(SMALL(IF(MONTH(t.feriados[DIA])=MONTH(DO_1!$H$18),t.feriados[DIA],\"\"),ROWS(T$6:T7)),t.feriados[],2,0),\"\")","v":"Santa Rosa de Lima"},{"$nulls":5},{"$f":"IFERROR(DAY(SMALL(IF(MONTH(t.obligaciones[DIA])=MONTH(DO_1!$H$18),t.obligaciones[DIA],\"\"),ROWS(AA$6:AA7))),\"\")","v":{"v":7,"d":"07"}},{"$f":"IFERROR(VLOOKUP(SMALL(IF(MONTH(t.obligaciones[DIA])=MONTH(DO_1!$H$18),t.obligaciones[DIA],\"\"),ROWS(T$6:T7)),t.obligaciones[],2,0),\"\")","v":"Declaración AFP"},{"$nulls":5},{"$f":"IFERROR(DAY(SMALL(IF(MONTH(t.feriados.matriz[DIA])=MONTH(DO_1!$H$18),t.feriados.matriz[DIA],\"\"),ROWS(AH$6:AH7))),\"\")","v":""},{"$f":"IFERROR(VLOOKUP(SMALL(IF(MONTH(t.feriados.matriz[DIA])=MONTH(DO_1!$H$18),t.feriados.matriz[DIA],\"\"),ROWS(AA$6:AA7)),t.feriados.matriz[],2,0),\"\")","v":""},{"$nulls":13},"2019-08-05","2019-08-06","2019-08-07","2019-08-08","2019-08-09","2019-08-10","2019-08-11",null,30,"Santa Rosa de Lima",null,{"v":7,"d":"07"},"Declaración AFP",{"$nulls":3},"",""]
[{"$nulls":11},{"$f":"f.ini+(ROWS($L$6:$L8)-1)*7+(COLUMNS($L$6:L$6)-1)","v":"2019-08-12"},{"$f":"f.ini+(ROWS($L$6:$L8)-1)*7+(COLUMNS($L$6:M$6)-1)","v":"2019-08-13"},{"$f":"f.ini+(ROWS($L$6:$L8)-1)*7+(COLUMNS($L$6:N$6)-1)","v":"2019-08-14"},{"$f":"f.ini+(ROWS($L$6:$L8)-1)*7+(COLUMNS($L$6:O$6)-1)","v":"2019-08-15"},{"$f":"f.ini+(ROWS($L$6:$L8)-1)*7+(COLUMNS($L$6:P$6)-1)","v":"2019-08-16"},{"$f":"f.ini+(ROWS($L$6:$L8)-1)*7+(COLUMNS($L$6:Q$6)-1)","v":"2019-08-17"},{"$f":"f.ini+(ROWS($L$6:$L8)-1)*7+(COLUMNS($L$6:R$6)-1)","v":"2019-08-18"},null,{"$f":"IFERROR(DAY(SMALL(IF(MONTH(t.feriados[DIA])=MONTH(DO_1!$H$18),t.feriados[DIA],\"\"),ROWS(T$6:T8))),\"\")","v":""},{"$f":"IFERROR(VLOOKUP(SMALL(IF(MONTH(t.feriados[DIA])=MONTH(DO_1!$H$18),t.feriados[DIA],\"\"),ROWS(T$6:T8)),t.feriados[],2,0),\"\")","v":""},{"$nulls":5},{"$f":"IFERROR(DAY(SMALL(IF(MONTH(t.obligaciones[DIA])=MONTH(DO_1!$H$18),t.obligaciones[DIA],\"\"),ROWS(AA$6:AA8))),\"\")","v":13},{"$f":"IFERROR(VLOOKUP(SMALL(IF(MONTH(t.obligaciones[DIA])=MONTH(DO_1!$H$18),t.obligaciones[DIA],\"\"),ROWS(T$6:T8)),t.obligaciones[],2,0),\"\")","v":"Libros Electrónicos"},{"$nulls":5},{"$f":"IFERROR(DAY(SMALL(IF(MONTH(t.feriados.matriz[DIA])=MONTH(DO_1!$H$18),t.feriados.matriz[DIA],\"\"),ROWS(AH$6:AH8))),\"\")","v":""},{"$f":"IFERROR(VLOOKUP(SMALL(IF(MONTH(t.feriados.matriz[DIA])=MONTH(DO_1!$H$18),t.feriados.matriz[DIA],\"\"),ROWS(AA$6:AA8)),t.feriados.matriz[],2,0),\"\")","v":""},{"$nulls":13},"2019-08-12","2019-08-13","2019-08-14","2019-08-15","2019-08-16","2019-08-17","2019-08-18",null,"","",null,13,"Libros Electrónicos",{"$nulls":3},"",""]
[{"$nulls":11},{"$f":"f.ini+(ROWS($L$6:$L9)-1)*7+(COLUMNS($L$6:L$6)-1)","v":"2019-08-19"},{"$f":"f.ini+(ROWS($L$6:$L9)-1)*7+(COLUMNS($L$6:M$6)-1)","v":"2019-08-20"},{"$f":"f.ini+(ROWS($L$6:$L9)-1)*7+(COLUMNS($L$6:N$6)-1)","v":"2019-08-21"},{"$f":"f.ini+(ROWS($L$6:$L9)-1)*7+(COLUMNS($L$6:O$6)-1)","v":"2019-08-22"},{"$f":"f.ini+(ROWS($L$6:$L9)-1)*7+(COLUMNS($L$6:P$6)-1)","v":"2019-08-23"},{"$f":"f.ini+(ROWS($L$6:$L9)-1)*7+(COLUMNS($L$6:Q$6)-1)","v":"2019-08-24"},{"$f":"f.ini+(ROWS($L$6:$L9)-1)*7+(COLUMNS($L$6:R$6)-1)","v":"2019-08-25"},null,{"$f":"IFERROR(DAY(SMALL(IF(MONTH(t.feriados[DIA])=MONTH(DO_1!$H$18),t.feriados[DIA],\"\"),ROWS(T$6:T9))),\"\")","v":""},{"$f":"IFERROR(VLOOKUP(SMALL(IF(MONTH(t.feriados[DIA])=MONTH(DO_1!$H$18),t.feriados[DIA],\"\"),ROWS(T$6:T9)),t.feriados[],2,0),\"\")","v":""},{"$nulls":5},{"$f":"IFERROR(DAY(SMALL(IF(MONTH(t.obligaciones[DIA])=MONTH(DO_1!$H$18),t.obligaciones[DIA],\"\"),ROWS(AA$6:AA9))),\"\")","v":14},{"$f":"IFERROR(VLOOKUP(SMALL(IF(MONTH(t.obligaciones[DIA])=MONTH(DO_1!$H$18),t.obligaciones[DIA],\"\"),ROWS(T$6:T9)),t.obligaciones[],2,0),\"\")","v":"Declaración SUNAT"},{"$nulls":5},{"$f":"IFERROR(DAY(SMALL(IF(MONTH(t.feriados.matriz[DIA])=MONTH(DO_1!$H$18),t.feriados.matriz[DIA],\"\"),ROWS(AH$6:AH9))),\"\")","v":""},{"$f":"IFERROR(VLOOKUP(SMALL(IF(MONTH(t.feriados.matriz[DIA])=MONTH(DO_1!$H$18),t.feriados.matriz[DIA],\"\"),ROWS(AA$6:AA9)),t.feriados.matriz[],2,0),\"\")","v":""},{"$nulls":13},"2019-08-19","2019-08-20","2019-08-21","2019-08-22","2019-08-23","2019-08-24","2019-08-25",null,"","",null,14,"Declaración SUNAT",{"$nulls":3},"",""]
[{"$nulls":11},{"$f":"f.ini+(ROWS($L$6:$L10)-1)*7+(COLUMNS($L$6:L$6)-1)","v":"2019-08-26"},{"$f":"f.ini+(ROWS($L$6:$L10)-1)*7+(COLUMNS($L$6:M$6)-1)","v":"2019-08-27"},{"$f":"f.ini+(ROWS($L$6:$L10)-1)*7+(COLUMNS($L$6:N$6)-1)","v":"2019-08-28"},{"$f":"f.ini+(ROWS($L$6:$L10)-1)*7+(COLUMNS($L$6:O$6)-1)","v":"2019-08-29"},{"$f":"f.ini+(ROWS($L$6:$L10)-1)*7+(COLUMNS($L$6:P$6)-1)","v":"2019-08-30"},{"$f":"f.ini+(ROWS($L$6:$L10)-1)*7+(COLUMNS($L$6:Q$6)-1)","v":"2019-08-31"},{"$f":"f.ini+(ROWS($L$6:$L10)-1)*7+(COLUMNS($L$6:R$6)-1)","v":"2019-09-01"},null,{"$f":"IFERROR(DAY(SMALL(IF(MONTH(t.feriados[DIA])=MONTH(DO_1!$H$18),t.feriados[DIA],\"\"),ROWS(T$6:T10))),\"\")","v":""},{"$f":"IFERROR(VLOOKUP(SMALL(IF(MONTH(t.feriados[DIA])=MONTH(DO_1!$H$18),t.feriados[DIA],\"\"),ROWS(T$6:T10)),t.feriados[],2,0),\"\")","v":""},{"$nulls":5},{"$f":"IFERROR(DAY(SMALL(IF(MONTH(t.obligaciones[DIA])=MONTH(DO_1!$H$18),t.obligaciones[DIA],\"\"),ROWS(AA$6:AA10))),\"\")","v":16},{"$f":"IFERROR(VLOOKUP(SMALL(IF(MONTH(t.obligaciones[DIA])=MONTH(DO_1!$H$18),t.obligaciones[DIA],\"\"),ROWS(T$6:T10)),t.obligaciones[],2,0),\"\")","v":"INEI"},{"$nulls":5},{"$f":"IFERROR(DAY(SMALL(IF(MONTH(t.feriados.matriz[DIA])=MONTH(DO_1!$H$18),t.feriados.matriz[DIA],\"\"),ROWS(AH$6:AH10))),\"\")","v":""},{"$f":"IFERROR(VLOOKUP(SMALL(IF(MONTH(t.feriados.matriz[DIA])=MONTH(DO_1!$H$18),t.feriados.matriz[DIA],\"\"),ROWS(AA$6:AA10)),t.feriados.matriz[],2,0),\"\")","v":""},{"$nulls":13},"2019-08-26","2019-08-27","2019-08-28","2019-08-29","2019-08-30","2019-08-31","2019-09-01",null,"","",null,16,"INEI",{"$nulls":3},"",""]
{"$rows_left_out":16}
{"sheet":"Calendario por años (Editable)","index":1,"n_rows":43,"n_cols":32,"rows_kept":43,"merged":[[3,1,3,3],[4,1,4,3],[6,1,6,23],[8,1,8,6],[8,9,8,14],[8,17,8,22],[17,1,17,6],[17,9,17,14],[17,17,17,22],[26,1,26,6],[26,9,26,14],[26,17,26,22],[35,1,35,6],[35,9,35,14],[35,17,35,22]]}
[null,"Calendario Anual"]
[null,"MOS Expert - CPC Martín Cruz - +51 998401784"]
[]
[null,"Indique el año"]
[null,2020]
[]
[null,{"$f":"\"Calendario [ \"&B5&\" ]\"","v":"Calendario [ 2020 ]"}]
[]
[null,{"$f":"\"Enero\"&\" • \"&IF($B$5=\"\",YEAR(TODAY()),B5)","v":"Enero • 2020"},{"$nulls":5},1,null,{"$f":"\"Febrero\"&\" • \"&IF($B$5=\"\",YEAR(TODAY()),B5)","v":"Febrero • 2020"},{"$nulls":5},2,null,{"$f":"\"Marzo\"&\" • \"&IF($B$5=\"\",YEAR(TODAY()),B5)","v":"Marzo • 2020"},{"$nulls":5},3]
[null,"Lu","Ma","Mi","Ju","Vi","Sá","Do",null,"Lu","Ma","Mi","Ju","Vi","Sá","Do",null,"Lu","Ma","Mi","Ju","Vi","Sá","Do"]
{"$rows_left_out":34}
{"sheet":"Dias (Editable)","index":2,"n_rows":69,"n_cols":9,"rows_kept":69,"merged":[[3,1,3,8]]}
[null,"Excel No Convencional"]
[null,"MOS Expert - CPC Martín Cruz - +51 998401784"]
[]
[null,"Tablas de feriados, dias no laborables y obligaciones"]
[]
[null,"Tabla de feriados y dias no laborables",null,null,"Tabla de obligaciones mensuales",null,null,"tabla de feriados y dias no laborables casa matriz"]
[null,"DIA","NOMBRE",null,"DIA","NOMBRE",null,"DIA","NOMBRE"]
[null,"2019-01-01","Año nuevo",null,"2019-01-03","Reporting",null,"2019-01-01","Año nuevo"]
[null,"2019-04-18","Jueves santo",null,"2019-01-07","Declaración AFP",null,"2019-04-19","Viernes santo"]
[null,"2019-04-19","Viernes santo",null,"2019-01-11","Libros Electrónicos",null,"2019-05-01","Dia de trabajo"]
{"$rows_left_out":60}
{"sheet":"Calendario Casa Matriz","index":3,"n_rows":35,"n_cols":22,"rows_kept":35,"merged":[[3,1,3,3],[4,1,4,3],[6,1,6,20],[8,1,8,7],[18,1,18,6],[18,8,18,13],[18,15,18,20],[27,1,27,7],[27,8,27,14],[27,15,27,21]]}
[null,"Excel No Convencional"]
[null,"MOS Expert - CPC Martín Cruz - +51 998401784"]
[]
[null,"Seleccione un mes"]
[null,"Agosto",null,null,6]
[]
[null,"Calendario de obligaciones mensuales"]
[]
[null,{"$f":"lista01.1","v":"AGOSTO•2019"}]
[null,{"$f":"lista01.2","v":"L"},"M","X","J","V","S","D"]
{"$rows_left_out":26}
{"sheet":"DO_2","index":4,"n_rows":44,"n_cols":37,"rows_kept":44,"hidden":true}
[]
[null,{"$f":"TODAY()","v":"2019-09-28"},null,"Inicio",{"$f":"'Calendario Actual'!B5","v":"Lunes"},null,"Lu","Do"]
[null,{"$f":"EOMONTH(B2,-2)+1","v":"2019-08-01"},null,null,{"$f":"IF(E2=\"Lunes\",2,1)","v":2},null,"Ma","Lu"]
[null,{"$f":"WEEKDAY(B3,E3)","v":4},{"$nulls":4},"Mi","Ma"]
[null,{"$f":"B3-B4+1","v":"2019-07-29"},{"$nulls":4},"Ju","Mi"]
[{"$nulls":6},"Vi","Ju"]
[{"$nulls":6},"Sá","Vi"]
[{"$nulls":6},"Do","Sá"]
[{"$nulls":14},{"$f":"B10","v":"Agosto • 2019"},{"$nulls":7},{"$f":"B11","v":"Septiembre • 2019"},{"$nulls":7},{"$f":"B12","v":"Octubre • 2019"}]
[null,{"$f":"PROPER(TEXT(EOMONTH($B$5,ROWS(B$10:B10)),\"mmmm\"))&\" • \"&YEAR(EOMONTH($B$5,ROWS(B$10:B10)))","v":"Agosto • 2019"},{"$f":"EOMONTH($B$5,ROWS(B$10:B10)-1)-WEEKDAY(EOMONTH($B$5,ROWS(B$10:B10)-1)+1,$E$3)+2","v":"2019-07-29"},{"$nulls":3},{"$f":"INDEX(INDIRECT(\"lista03.\"&$E$3),COLUMNS($G$10:G$10))","v":"Lu"},{"$f":"INDEX(INDIRECT(\"lista03.\"&$E$3),COLUMNS($G$10:H$10))","v":"Ma"},{"$f":"INDEX(INDIRECT(\"lista03.\"&$E$3),COLUMNS($G$10:I$10))","v":"Mi"},{"$f":"INDEX(INDIRECT(\"lista03.\"&$E$3),COLUMNS($G$10:J$10))","v":"Ju"},{"$f":"INDEX(INDIRECT(\"lista03.\"&$E$3),COLUMNS($G$10:K$10))","v":"Vi"},{"$f":"INDEX(INDIRECT(\"lista03.\"&$E$3),COLUMNS($G$10:L$10))","v":"Sá"},{"$f":"INDEX(INDIRECT(\"lista03.\"&$E$3),COLUMNS($G$10:M$10))","v":"Do"},null,{"$f":"lista03.3","v":"Lu"},"Ma","Mi","Ju","Vi","Sá","Do",null,{"$f":"lista03.3","v":"Lu"},"Ma","Mi","Ju","Vi","Sá","Do",null,{"$f":"lista03.3","v":"Lu"},"Ma","Mi","Ju","Vi","Sá","Do"]
{"$rows_left_out":35}
{"sheet":"Calendario Actual","index":5,"n_rows":43,"n_cols":24,"rows_kept":43,"merged":[[3,1,3,3],[4,1,4,3],[6,1,6,23],[8,1,8,7],[8,9,8,15],[8,17,8,23],[17,1,17,7],[17,9,17,15],[17,17,17,23],[26,1,26,7],[26,9,26,15],[26,17,26,23],[35,1,35,7],[35,9,35,15],[35,17,35,23]]}
[null,"Excel No Convencional"]
[null,"MOS Expert - CPC Martín Cruz - +51 998401784"]
[]
[null,"Seleccione día inicio"]
[null,"Lunes",null,null,6]
[]
[null,"Calendario Actual"]
[]
[null,{"$f":"INDEX(lista04.m13,1)","v":"Agosto • 2019"},{"$nulls":7},{"$f":"INDEX(lista04.m13,2)","v":"Septiembre • 2019"},{"$nulls":7},{"$f":"INDEX(lista04.m13,3)","v":"Octubre • 2019"}]
[null,{"$f":"lista04.m01","v":"Lu"},"Ma","Mi","Ju","Vi","Sá","Do",null,{"$f":"lista04.m02","v":"Lu"},"Ma","Mi","Ju","Vi","Sá","Do",null,{"$f":"lista04.m03","v":"Lu"},"Ma","Mi","Ju","Vi","Sá","Do"]
{"$rows_left_out":33}